{"text_format":"1","workbook":"xlsx","n_sheets":2,"sheets":["MIXTE","Feuil1"],"not_rendered":{"charts":0,"images":1,"macros":1,"external_links":0,"defined_names":2,"comments":0,"pivot_tables":0},"unopened":[],"bounds":{"document_bytes":16777216,"sheet_cells":100000,"rows_first":2000,"rows_last":500,"rows_between":2000,"halvings":0,"cell_chars":16384,"cell_head_chars":4096},"cells_cut":0,"cells_raw":0,"read":"whole","date_system":"1900"}

{"sheet":"MIXTE","index":0,"n_rows":532,"n_cols":50,"rows_kept":532,"cut":false,"hidden":false,"merged":[[0,2,0,10],[0,21,0,22],[0,24,2,24],[2,7,2,8],[2,11,2,13],[2,14,2,18],[2,19,2,20],[2,21,2,23],[4,21,4,22],[5,7,5,10],[6,9,10,9],[11,7,11,10],[17,7,17,10],[27,1,27,4],[27,5,27,6],[27,10,27,15],[25,1,25,4],[25,5,25,6],[25,10,25,15],[26,1,26,4],[26,5,26,6],[26,8,26,9],[26,10,26,15],[28,1,28,4],[28,5,28,6],[29,1,29,4],[29,5,29,6],[29,10,29,13],[29,21,29,23],[12,9,16,9],[18,9,22,9],[29,15,29,18],[25,19,25,23],[26,17,26,18]]}
[null,null,"COUPE DE FRANCE DES CLUBS MIXTE     2017",null,null,null,null,null,null,null,null,null,null,null," ",null,null,null,null,null,null,null,null,null,"MIXTE"]
[]
[null,null,null,null,"LIEU :",null,null,"REGION :",null,null,null,"Date :"]
[null,null,null,null,null,null,null,null,null,null,null,null,null,null,null,null,null,null,null,null,null,null,null,null,null,null,null,"DEB ","DEP +","REG +","IRG +","FED +","NAT +","INTB +","INTA +","OLY +"]
["SEXE","ZONE","REG.","CL.","LICENCE","NOMS","Prénoms","AN","POIDS","CLUB","NAT",1,2,3,"ARR",1,2,3,"EP-J","Total","IWF","SERIE",null,"Catég"," ",null," ","DEB ","DEP +","REG +","IRG +","FED +","NAT +","INTB +","INTA +","OLY +"]
[null,"Tirage au sort :",null,null,null,null,null,"Classement :",null,null,null,{"$f":"IF(Y6=\"\",\"\",RANK(Y6,$Z$7:$Z$9,0))","v":3},null,null,null,null,null,null,null,null,null,null,null,null,{"$f":"SUM(U7:U11)","v":1179.8664863558586},null," ",{"$f":"T6-HLOOKUP(X6,Feuil1!$C$1:$BL$10,2,FALSE)","v":{"$error":"#N/A"}},{"$f":"T6-HLOOKUP(X6,Feuil1!$C$1:$BL$10,3,FALSE)","v":{"$error":"#N/A"}},{"$f":"T6-HLOOKUP(X6,Feuil1!$C$1:$BL$10,4,FALSE)","v":{"$error":"#N/A"}},{"$f":"T6-HLOOKUP(X6,Feuil1!$C$1:$BL$10,5,FALSE)","v":{"$error":"#N/A"}},{"$f":"T6-HLOOKUP(X6,Feuil1!$C$1:$BL$10,6,FALSE)","v":{"$error":"#N/A"}},{"$f":"T6-HLOOKUP(X6,Feuil1!$C$1:$BL$10,7,FALSE)","v":{"$error":"#N/A"}},{"$f":"T6-HLOOKUP(X6,Feuil1!$C$1:$BL$10,8,FALSE)","v":{"$error":"#N/A"}},{"$f":"T6-HLOOKUP(X6,Feuil1!$C$1:$BL$10,9,FALSE)","v":{"$error":"#N/A"}},{"$f":"T6-HLOOKUP(X6,Feuil1!$C$1:$BL$10,10,FALSE)","v":{"$error":"#N/A"}},null,null,null,null,null,null,{"$f":"IF(AJ6>=0,$AJ$5,IF(AI6>=0,$AI$5,IF(AH6>=0,$AH$5,IF(AG6>=0,$AG$5,IF(AF6>=0,$AF$5,IF(AE6>=0,$AE$5,IF(AD6>=0,$AD$5,IF(AC6>=0,$AC$5,$AB$5))))))))","v":{"$error":"#N/A"}}]
["H","SEST","RAL",null,null,null,null,1996,100,null,null,90,null,null,{"$f":"IF(H7=\"\",\"\",IF(MAXA(L7:N7)<=0,0,MAXA(L7:N7)))","v":90},100,null,null,{"$f":"IF(H7=\"\",\"\",IF(MAXA(P7:R7)<=0,0,MAXA(P7:R7)))","v":100},{"$f":"IF(H7=\"\",\"\",IF(OR(O7=0,S7=0),0,O7+S7))","v":190},{"$f":"IF(I7=\"\",\"\",IF(A7=\"H\",10^(0.794358141*LOG(I7/174.393)^2)*T7,IF(A7=\"F\",10^(0.89726074*LOG(I7/148.026)^2)*T7,\"\")))","v":211.39441102151278},{"$f":"IF(H7=\"\",\"\",AQ7)","v":"DEB "},{"$f":"IF(AJ7>=0,AJ7,IF(AI7>=0,AI7,IF(AH7>=0,AH7,IF(AG7>=0,AG7,IF(AF7>=0,AF7,IF(AE7>=0,AE7,IF(AD7>=0,AD7,IF(AC7>=0,AC7,AB7))))))))","v":15},{"$f":"IF(I7=\"\",\"\",IF(A7=\"H\",IF(OR(H7=\"SEN\",H7<1997),VLOOKUP(I7,Feuil1!$A$11:$G$29,6),IF(AND(H7>1996,H7<2000),VLOOKUP(I7,Feuil1!$A$11:$G$29,5),IF(AND(H7>1999,H7<2002),VLOOKUP(I7,Feuil1!$A$11:$G$29,4),IF(AND(H7>2001,H7<2004),VLOOKUP(I7,Feuil1!$A$11:$G$29,3),VLOOKUP(I7,Feuil1!$A$11:$G$29,2))))),IF(OR(H7=\"SEN\",H7<1997),VLOOKUP(I7,Feuil1!$G$11:$L$25,6),IF(AND(H7>1996,H7<2000),VLOOKUP(I7,Feuil1!$G$11:$L$25,5),IF(AND(H7>1999,H7<2002),VLOOKUP(I7,Feuil1!$G$11:$L$25,4),IF(AND(H7>2001,H7<2004),VLOOKUP(I7,Feuil1!$G$11:$L$25,3),VLOOKUP(I7,Feuil1!$G$11:$L$25,2)))))))","v":"S105"},null,{"$f":"Y6","v":1179.8664863558586}," ",{"$f":"T7-HLOOKUP(X7,Feuil1!$C$1:$BL$10,2,FALSE)","v":15},{"$f":"T7-HLOOKUP(X7,Feuil1!$C$1:$BL$10,3,FALSE)","v":-5},{"$f":"T7-HLOOKUP(X7,Feuil1!$C$1:$BL$10,4,FALSE)","v":-30},{"$f":"T7-HLOOKUP(X7,Feuil1!$C$1:$BL$10,5,FALSE)","v":-55},{"$f":"T7-HLOOKUP(X7,Feuil1!$C$1:$BL$10,6,FALSE)","v":-80},{"$f":"T7-HLOOKUP(X7,Feuil1!$C$1:$BL$10,7,FALSE)","v":-110},{"$f":"T7-HLOOKUP(X7,Feuil1!$C$1:$BL$10,8,FALSE)","v":-135},{"$f":"T7-HLOOKUP(X7,Feuil1!$C$1:$BL$10,9,FALSE)","v":-155},{"$f":"T7-HLOOKUP(X7,Feuil1!$C$1:$BL$10,10,FALSE)","v":-175},null,null,null,null,null,null,{"$f":"IF(AJ7>=0,$AJ$5,IF(AI7>=0,$AI$5,IF(AH7>=0,$AH$5,IF(AG7>=0,$AG$5,IF(AF7>=0,$AF$5,IF(AE7>=0,$AE$5,IF(AD7>=0,$AD$5,IF(AC7>=0,$AC$5,$AB$5))))))))","v":"DEB "}]
["H","SEST","RAL",null,null,null,null,2000,75,null,null,100,null,null,100,110,null,null,110,210,268.47293516740018,"NAT +",10,{"$f":"IF(I8=\"\",\"\",IF(A8=\"H\",IF(OR(H8=\"SEN\",H8<1997),VLOOKUP(I8,Feuil1!$A$11:$G$29,6),IF(AND(H8>1996,H8<2000),VLOOKUP(I8,Feuil1!$A$11:$G$29,5),IF(AND(H8>1999,H8<2002),VLOOKUP(I8,Feuil1!$A$11:$G$29,4),IF(AND(H8>2001,H8<2004),VLOOKUP(I8,Feuil1!$A$11:$G$29,3),VLOOKUP(I8,Feuil1!$A$11:$G$29,2))))),IF(OR(H8=\"SEN\",H8<1997),VLOOKUP(I8,Feuil1!$G$11:$L$25,6),IF(AND(H8>1996,H8<2000),VLOOKUP(I8,Feuil1!$G$11:$L$25,5),IF(AND(H8>1999,H8<2002),VLOOKUP(I8,Feuil1!$G$11:$L$25,4),IF(AND(H8>2001,H8<2004),VLOOKUP(I8,Feuil1!$G$11:$L$25,3),VLOOKUP(I8,Feuil1!$G$11:$L$25,2)))))))","v":"C2 77"},null,{"$f":"Y12","v":1276.1159508647752}," ",{"$f":"T8-HLOOKUP(X8,Feuil1!$C$1:$BL$10,2,FALSE)","v":100},{"$f":"T8-HLOOKUP(X8,Feuil1!$C$1:$BL$10,3,FALSE)","v":80},{"$f":"T8-HLOOKUP(X8,Feuil1!$C$1:$BL$10,4,FALSE)","v":60},{"$f":"T8-HLOOKUP(X8,Feuil1!$C$1:$BL$10,5,FALSE)","v":40},{"$f":"T8-HLOOKUP(X8,Feuil1!$C$1:$BL$10,6,FALSE)","v":25},{"$f":"T8-HLOOKUP(X8,Feuil1!$C$1:$BL$10,7,FALSE)","v":10},{"$f":"T8-HLOOKUP(X8,Feuil1!$C$1:$BL$10,8,FALSE)","v":-10},{"$f":"T8-HLOOKUP(X8,Feuil1!$C$1:$BL$10,9,FALSE)","v":-40},{"$f":"T8-HLOOKUP(X8,Feuil1!$C$1:$BL$10,10,FALSE)","v":-790},null,null,null,null,null,null,"NAT +"]
["H","SEST","RAL",null,null,null,null,1985,95,null,null,100,null,null,{"$f":"IF(H9=\"\",\"\",IF(MAXA(L9:N9)<=0,0,MAXA(L9:N9)))","v":100},110,null,null,{"$f":"IF(H9=\"\",\"\",IF(MAXA(P9:R9)<=0,0,MAXA(P9:R9)))","v":110},{"$f":"IF(H9=\"\",\"\",IF(OR(O9=0,S9=0),0,O9+S9))","v":210},{"$f":"IF(I9=\"\",\"\",IF(A9=\"H\",10^(0.794358141*LOG(I9/174.393)^2)*T9,IF(A9=\"F\",10^(0.89726074*LOG(I9/148.026)^2)*T9,\"\")))","v":238.5070982391083},{"$f":"IF(H9=\"\",\"\",AQ9)","v":"DEP +"},{"$f":"IF(AJ9>=0,AJ9,IF(AI9>=0,AI9,IF(AH9>=0,AH9,IF(AG9>=0,AG9,IF(AF9>=0,AF9,IF(AE9>=0,AE9,IF(AD9>=0,AD9,IF(AC9>=0,AC9,AB9))))))))","v":15},{"$f":"IF(I9=\"\",\"\",IF(A9=\"H\",IF(OR(H9=\"SEN\",H9<1997),VLOOKUP(I9,Feuil1!$A$11:$G$29,6),IF(AND(H9>1996,H9<2000),VLOOKUP(I9,Feuil1!$A$11:$G$29,5),IF(AND(H9>1999,H9<2002),VLOOKUP(I9,Feuil1!$A$11:$G$29,4),IF(AND(H9>2001,H9<2004),VLOOKUP(I9,Feuil1!$A$11:$G$29,3),VLOOKUP(I9,Feuil1!$A$11:$G$29,2))))),IF(OR(H9=\"SEN\",H9<1997),VLOOKUP(I9,Feuil1!$G$11:$L$25,6),IF(AND(H9>1996,H9<2000),VLOOKUP(I9,Feuil1!$G$11:$L$25,5),IF(AND(H9>1999,H9<2002),VLOOKUP(I9,Feuil1!$G$11:$L$25,4),IF(AND(H9>2001,H9<2004),VLOOKUP(I9,Feuil1!$G$11:$L$25,3),VLOOKUP(I9,Feuil1!$G$11:$L$25,2)))))))","v":"S105"},null,{"$f":"Y18","v":1197.1502481132948}," ",{"$f":"T9-HLOOKUP(X9,Feuil1!$C$1:$BL$10,2,FALSE)","v":35},{"$f":"T9-HLOOKUP(X9,Feuil1!$C$1:$BL$10,3,FALSE)","v":15},{"$f":"T9-HLOOKUP(X9,Feuil1!$C$1:$BL$10,4,FALSE)","v":-10},{"$f":"T9-HLOOKUP(X9,Feuil1!$C$1:$BL$10,5,FALSE)","v":-35},{"$f":"T9-HLOOKUP(X9,Feuil1!$C$1:$BL$10,6,FALSE)","v":-60},{"$f":"T9-HLOOKUP(X9,Feuil1!$C$1:$BL$10,7,FALSE)","v":-90},{"$f":"T9-HLOOKUP(X9,Feuil1!$C$1:$BL$10,8,FALSE)","v":-115},{"$f":"T9-HLOOKUP(X9,Feuil1!$C$1:$BL$10,9,FALSE)","v":-135},{"$f":"T9-HLOOKUP(X9,Feuil1!$C$1:$BL$10,10,FALSE)","v":-155},null,null,null,null,null,null,"DEP +"]
["F","SEST","RAL",null,null,null,null,1996,58,null,null,80,null,null,80,100,null,null,100,180,253.4178084030498,"INTA +",10,{"$f":"IF(I10=\"\",\"\",IF(A10=\"H\",IF(OR(H10=\"SEN\",H10<1997),VLOOKUP(I10,Feuil1!$A$11:$G$29,6),IF(AND(H10>1996,H10<2000),VLOOKUP(I10,Feuil1!$A$11:$G$29,5),IF(AND(H10>1999,H10<2002),VLOOKUP(I10,Feuil1!$A$11:$G$29,4),IF(AND(H10>2001,H10<2004),VLOOKUP(I10,Feuil1!$A$11:$G$29,3),VLOOKUP(I10,Feuil1!$A$11:$G$29,2))))),IF(OR(H10=\"SEN\",H10<1997),VLOOKUP(I10,Feuil1!$G$11:$L$25,6),IF(AND(H10>1996,H10<2000),VLOOKUP(I10,Feuil1!$G$11:$L$25,5),IF(AND(H10>1999,H10<2002),VLOOKUP(I10,Feuil1!$G$11:$L$25,4),IF(AND(H10>2001,H10<2004),VLOOKUP(I10,Feuil1!$G$11:$L$25,3),VLOOKUP(I10,Feuil1!$G$11:$L$25,2)))))))","v":"FS58"},null,null," ",{"$f":"T10-HLOOKUP(X10,Feuil1!$C$1:$BL$10,2,FALSE)","v":110},{"$f":"T10-HLOOKUP(X10,Feuil1!$C$1:$BL$10,3,FALSE)","v":100},{"$f":"T10-HLOOKUP(X10,Feuil1!$C$1:$BL$10,4,FALSE)","v":90},{"$f":"T10-HLOOKUP(X10,Feuil1!$C$1:$BL$10,5,FALSE)","v":80},{"$f":"T10-HLOOKUP(X10,Feuil1!$C$1:$BL$10,6,FALSE)","v":65},{"$f":"T10-HLOOKUP(X10,Feuil1!$C$1:$BL$10,7,FALSE)","v":50},{"$f":"T10-HLOOKUP(X10,Feuil1!$C$1:$BL$10,8,FALSE)","v":30},{"$f":"T10-HLOOKUP(X10,Feuil1!$C$1:$BL$10,9,FALSE)","v":10},{"$f":"T10-HLOOKUP(X10,Feuil1!$C$1:$BL$10,10,FALSE)","v":-10},null,null,null,null,null,null,"INTA +"]
["F","SEST","RAL",null,null,null,null,1997,54,null,null,60,null,null,60,80,null,null,80,140,208.07423352478753,"INTB +",10,{"$f":"IF(I11=\"\",\"\",IF(A11=\"H\",IF(OR(H11=\"SEN\",H11<1997),VLOOKUP(I11,Feuil1!$A$11:$G$29,6),IF(AND(H11>1996,H11<2000),VLOOKUP(I11,Feuil1!$A$11:$G$29,5),IF(AND(H11>1999,H11<2002),VLOOKUP(I11,Feuil1!$A$11:$G$29,4),IF(AND(H11>2001,H11<2004),VLOOKUP(I11,Feuil1!$A$11:$G$29,3),VLOOKUP(I11,Feuil1!$A$11:$G$29,2))))),IF(OR(H11=\"SEN\",H11<1997),VLOOKUP(I11,Feuil1!$G$11:$L$25,6),IF(AND(H11>1996,H11<2000),VLOOKUP(I11,Feuil1!$G$11:$L$25,5),IF(AND(H11>1999,H11<2002),VLOOKUP(I11,Feuil1!$G$11:$L$25,4),IF(AND(H11>2001,H11<2004),VLOOKUP(I11,Feuil1!$G$11:$L$25,3),VLOOKUP(I11,Feuil1!$G$11:$L$25,2)))))))","v":"FJ58"},null,null," ",{"$f":"T11-HLOOKUP(X11,Feuil1!$C$1:$BL$10,2,FALSE)","v":80},{"$f":"T11-HLOOKUP(X11,Feuil1!$C$1:$BL$10,3,FALSE)","v":70},{"$f":"T11-HLOOKUP(X11,Feuil1!$C$1:$BL$10,4,FALSE)","v":60},{"$f":"T11-HLOOKUP(X11,Feuil1!$C$1:$BL$10,5,FALSE)","v":50},{"$f":"T11-HLOOKUP(X11,Feuil1!$C$1:$BL$10,6,FALSE)","v":40},{"$f":"T11-HLOOKUP(X11,Feuil1!$C$1:$BL$10,7,FALSE)","v":25},{"$f":"T11-HLOOKUP(X11,Feuil1!$C$1:$BL$10,8,FALSE)","v":10},{"$f":"T11-HLOOKUP(X11,Feuil1!$C$1:$BL$10,9,FALSE)","v":-10},{"$f":"T11-HLOOKUP(X11,Feuil1!$C$1:$BL$10,10,FALSE)","v":-860},null,null,null,null,null,null,"INTB +"]
[null,"Tirage au sort :",null,null,null,null,null,"Classement :",null,null,null,{"$f":"IF(Y12=\"\",\"\",RANK(Y12,$Z$7:$Z$9,0))","v":1},null,null,null,null,null,null,null,null,null,null,null,null,{"$f":"SUM(U13:U17)","v":1276.1159508647752},null,null,{"$f":"T12-HLOOKUP(X12,Feuil1!$C$1:$BL$10,2,FALSE)","v":{"$error":"#N/A"}},{"$f":"T12-HLOOKUP(X12,Feuil1!$C$1:$BL$10,3,FALSE)","v":{"$error":"#N/A"}},{"$f":"T12-HLOOKUP(X12,Feuil1!$C$1:$BL$10,4,FALSE)","v":{"$error":"#N/A"}},{"$f":"T12-HLOOKUP(X12,Feuil1!$C$1:$BL$10,5,FALSE)","v":{"$error":"#N/A"}},{"$f":"T12-HLOOKUP(X12,Feuil1!$C$1:$BL$10,6,FALSE)","v":{"$error":"#N/A"}},{"$f":"T12-HLOOKUP(X12,Feuil1!$C$1:$BL$10,7,FALSE)","v":{"$error":"#N/A"}},{"$f":"T12-HLOOKUP(X12,Feuil1!$C$1:$BL$10,8,FALSE)","v":{"$error":"#N/A"}},{"$f":"T12-HLOOKUP(X12,Feuil1!$C$1:$BL$10,9,FALSE)","v":{"$error":"#N/A"}},{"$f":"T12-HLOOKUP(X12,Feuil1!$C$1:$BL$10,10,FALSE)","v":{"$error":"#N/A"}},null,null,null,null,null,null,{"$error":"#N/A"}]
["H","SEST","RAL",null,null,null,null,2005,75,null,null,120,null,null,120,145,null,null,145,265,338.7872753302907,{"$error":"#N/A"},{"$error":"#N/A"},{"$f":"IF(I13=\"\",\"\",IF(A13=\"H\",IF(OR(H13=\"SEN\",H13<1997),VLOOKUP(I13,Feuil1!$A$11:$G$29,6),IF(AND(H13>1996,H13<2000),VLOOKUP(I13,Feuil1!$A$11:$G$29,5),IF(AND(H13>1999,H13<2002),VLOOKUP(I13,Feuil1!$A$11:$G$29,4),IF(AND(H13>2001,H13<2004),VLOOKUP(I13,Feuil1!$A$11:$G$29,3),VLOOKUP(I13,Feuil1!$A$11:$G$29,2))))),IF(OR(H13=\"SEN\",H13<1997),VLOOKUP(I13,Feuil1!$G$11:$L$25,6),IF(AND(H13>1996,H13<2000),VLOOKUP(I13,Feuil1!$G$11:$L$25,5),IF(AND(H13>1999,H13<2002),VLOOKUP(I13,Feuil1!$G$11:$L$25,4),IF(AND(H13>2001,H13<2004),VLOOKUP(I13,Feuil1!$G$11:$L$25,3),VLOOKUP(I13,Feuil1!$G$11:$L$25,2)))))))","v":"NON"},null,null," ",{"$f":"T13-HLOOKUP(X13,Feuil1!$C$1:$BL$10,2,FALSE)","v":{"$error":"#N/A"}},{"$f":"T13-HLOOKUP(X13,Feuil1!$C$1:$BL$10,3,FALSE)","v":{"$error":"#N/A"}},{"$f":"T13-HLOOKUP(X13,Feuil1!$C$1:$BL$10,4,FALSE)","v":{"$error":"#N/A"}},{"$f":"T13-HLOOKUP(X13,Feuil1!$C$1:$BL$10,5,FALSE)","v":{"$error":"#N/A"}},{"$f":"T13-HLOOKUP(X13,Feuil1!$C$1:$BL$10,6,FALSE)","v":{"$error":"#N/A"}},{"$f":"T13-HLOOKUP(X13,Feuil1!$C$1:$BL$10,7,FALSE)","v":{"$error":"#N/A"}},{"$f":"T13-HLOOKUP(X13,Feuil1!$C$1:$BL$10,8,FALSE)","v":{"$error":"#N/A"}},{"$f":"T13-HLOOKUP(X13,Feuil1!$C$1:$BL$10,9,FALSE)","v":{"$error":"#N/A"}},{"$f":"T13-HLOOKUP(X13,Feuil1!$C$1:$BL$10,10,FALSE)","v":{"$error":"#N/A"}},null,null,null,null,null,null,{"$error":"#N/A"}]
["H","SEST","RAL",null,null,null,null,1994,75,null,null,100,null,null,100,120,null,null,120,220,281.25736065156207,"IRG +",10,{"$f":"IF(I14=\"\",\"\",IF(A14=\"H\",IF(OR(H14=\"SEN\",H14<1997),VLOOKUP(I14,Feuil1!$A$11:$G$29,6),IF(AND(H14>1996,H14<2000),VLOOKUP(I14,Feuil1!$A$11:$G$29,5),IF(AND(H14>1999,H14<2002),VLOOKUP(I14,Feuil1!$A$11:$G$29,4),IF(AND(H14>2001,H14<2004),VLOOKUP(I14,Feuil1!$A$11:$G$29,3),VLOOKUP(I14,Feuil1!$A$11:$G$29,2))))),IF(OR(H14=\"SEN\",H14<1997),VLOOKUP(I14,Feuil1!$G$11:$L$25,6),IF(AND(H14>1996,H14<2000),VLOOKUP(I14,Feuil1!$G$11:$L$25,5),IF(AND(H14>1999,H14<2002),VLOOKUP(I14,Feuil1!$G$11:$L$25,4),IF(AND(H14>2001,H14<2004),VLOOKUP(I14,Feuil1!$G$11:$L$25,3),VLOOKUP(I14,Feuil1!$G$11:$L$25,2)))))))","v":"S77"},null,null," ",{"$f":"T14-HLOOKUP(X14,Feuil1!$C$1:$BL$10,2,FALSE)","v":70},{"$f":"T14-HLOOKUP(X14,Feuil1!$C$1:$BL$10,3,FALSE)","v":50},{"$f":"T14-HLOOKUP(X14,Feuil1!$C$1:$BL$10,4,FALSE)","v":30},{"$f":"T14-HLOOKUP(X14,Feuil1!$C$1:$BL$10,5,FALSE)","v":10},{"$f":"T14-HLOOKUP(X14,Feuil1!$C$1:$BL$10,6,FALSE)","v":-20},{"$f":"T14-HLOOKUP(X14,Feuil1!$C$1:$BL$10,7,FALSE)","v":-45},{"$f":"T14-HLOOKUP(X14,Feuil1!$C$1:$BL$10,8,FALSE)","v":-65},{"$f":"T14-HLOOKUP(X14,Feuil1!$C$1:$BL$10,9,FALSE)","v":-85},{"$f":"T14-HLOOKUP(X14,Feuil1!$C$1:$BL$10,10,FALSE)","v":-100},null,null,null,null,null,null,"IRG +"]
["H","SEST","RAL",null,null,null,null,1997,75,null,null,100,null,null,{"$f":"IF(H15=\"\",\"\",IF(MAXA(L15:N15)<=0,0,MAXA(L15:N15)))","v":100},110,null,null,{"$f":"IF(H15=\"\",\"\",IF(MAXA(P15:R15)<=0,0,MAXA(P15:R15)))","v":110},{"$f":"IF(H15=\"\",\"\",IF(OR(O15=0,S15=0),0,O15+S15))","v":210},{"$f":"IF(I15=\"\",\"\",IF(A15=\"H\",10^(0.794358141*LOG(I15/174.393)^2)*T15,IF(A15=\"F\",10^(0.89726074*LOG(I15/148.026)^2)*T15,\"\")))","v":268.47293516740018},{"$f":"IF(H15=\"\",\"\",AQ15)","v":"FED +"},{"$f":"IF(AJ15>=0,AJ15,IF(AI15>=0,AI15,IF(AH15>=0,AH15,IF(AG15>=0,AG15,IF(AF15>=0,AF15,IF(AE15>=0,AE15,IF(AD15>=0,AD15,IF(AC15>=0,AC15,AB15))))))))","v":0},{"$f":"IF(I15=\"\",\"\",IF(A15=\"H\",IF(OR(H15=\"SEN\",H15<1997),VLOOKUP(I15,Feuil1!$A$11:$G$29,6),IF(AND(H15>1996,H15<2000),VLOOKUP(I15,Feuil1!$A$11:$G$29,5),IF(AND(H15>1999,H15<2002),VLOOKUP(I15,Feuil1!$A$11:$G$29,4),IF(AND(H15>2001,H15<2004),VLOOKUP(I15,Feuil1!$A$11:$G$29,3),VLOOKUP(I15,Feuil1!$A$11:$G$29,2))))),IF(OR(H15=\"SEN\",H15<1997),VLOOKUP(I15,Feuil1!$G$11:$L$25,6),IF(AND(H15>1996,H15<2000),VLOOKUP(I15,Feuil1!$G$11:$L$25,5),IF(AND(H15>1999,H15<2002),VLOOKUP(I15,Feuil1!$G$11:$L$25,4),IF(AND(H15>2001,H15<2004),VLOOKUP(I15,Feuil1!$G$11:$L$25,3),VLOOKUP(I15,Feuil1!$G$11:$L$25,2)))))))","v":"J77"},null,null," ",{"$f":"T15-HLOOKUP(X15,Feuil1!$C$1:$BL$10,2,FALSE)","v":80},{"$f":"T15-HLOOKUP(X15,Feuil1!$C$1:$BL$10,3,FALSE)","v":60},{"$f":"T15-HLOOKUP(X15,Feuil1!$C$1:$BL$10,4,FALSE)","v":40},{"$f":"T15-HLOOKUP(X15,Feuil1!$C$1:$BL$10,5,FALSE)","v":20},{"$f":"T15-HLOOKUP(X15,Feuil1!$C$1:$BL$10,6,FALSE)","v":0},{"$f":"T15-HLOOKUP(X15,Feuil1!$C$1:$BL$10,7,FALSE)","v":-30},{"$f":"T15-HLOOKUP(X15,Feuil1!$C$1:$BL$10,8,FALSE)","v":-50},{"$f":"T15-HLOOKUP(X15,Feuil1!$C$1:$BL$10,9,FALSE)","v":-75},{"$f":"T15-HLOOKUP(X15,Feuil1!$C$1:$BL$10,10,FALSE)","v":-9790},null,null,null,null,null,null,"FED +"]
{"$rows_left_out":518}
{"sheet":"Feuil1","index":1,"n_rows":29,"n_cols":64,"rows_kept":29,"cut":false,"hidden":true,"merged":[]}
[null,null,"FC1 40","FC1 44","FC1 48","FC1 53","FC1 58","FC1 63","FC1 69","FC1 +69","FC2 44","FC2 48","FC2 53","FC2 58","FC2 63","FC2 69","FC2 +69","FJ48","FJ53","FJ58","FJ63","FJ69","FJ75","FJ+75","FS48","FS53","FS58","FS63","FS69","FS75","FS+75","C1 45","C1 50","C1 56","C1 62","C1 69","C1 77","C1 85","C1 94","C1 +94","C2 50","C2 56","C2 62","C2 69","C2 77","C2 85","C2 94","C2 +94","J56","J62","J69","J77","J85","J94","J105","J+105","S56","S62","S69","S77","S85","S94","S105","S+105"]
[null,"DEBUTANT",20,25,30,35,40,45,50,60,30,35,45,50,55,60,70,45,55,60,65,70,80,90,55,65,70,75,80,95,100,35,40,50,75,85,90,100,110,120,45,65,85,95,110,120,125,135,80,90,110,130,145,150,155,165,95,120,130,150,165,170,175,185]
[null,"DEPARTEMENTAL",25,30,35,45,50,55,60,70,40,45,55,60,65,70,80,55,65,70,75,80,95,100,65,75,80,85,90,105,110,50,55,70,95,105,110,120,130,140,65,85,105,115,130,140,145,155,100,120,130,150,165,170,175,185,115,135,150,170,185,190,195,205]
[null,"REGIONAL",35,40,45,55,60,65,70,80,50,55,65,70,75,80,95,65,75,80,85,90,105,110,75,85,90,95,105,115,125,60,65,85,105,115,130,140,145,155,80,100,120,130,150,160,165,175,115,135,150,170,185,190,195,205,130,150,170,190,205,215,220,225]
[null,"INTERREGIONAL",45,50,55,65,70,75,80,95,60,65,75,80,85,90,105,75,85,90,95,105,115,125,85,95,100,110,120,130,140,75,80,100,120,130,150,160,165,175,95,115,135,150,170,180,185,195,130,150,170,190,205,215,220,225,145,170,190,210,225,235,245,250]
[null,"FEDERAL",50,60,65,75,80,85,90,105,70,75,85,90,95,105,115,85,95,100,110,120,130,140,95,105,115,125,135,145,150,90,95,115,135,150,170,180,185,195,110,130,150,170,185,200,210,220,145,170,190,210,225,235,245,250,170,190,220,240,250,260,270,280]
[null,"NATIONAL",60,70,75,85,90,95,105,115,80,85,95,100,110,120,130,95,105,115,125,135,145,150,110,120,130,140,150,160,170,105,110,130,150,170,185,200,210,220,120,145,170,190,200,220,225,235,170,190,220,240,250,260,270,280,190,210,240,265,280,290,300,310]
[null,"INTERNATIONAL B",70,80,85,95,100,110,120,130,90,95,105,115,125,135,145,110,120,130,140,150,160,170,125,140,150,160,170,180,190,115,120,145,170,190,200,220,225,235,135,170,190,210,220,240,250,260,190,210,240,260,280,290,300,310,210,230,260,285,300,310,325,330]
[null,"INTERNATIONAL A",80,90,95,105,115,125,135,145,100,110,120,130,140,150,160,125,135,150,160,170,180,190,140,160,170,180,190,195,210,130,135,170,190,210,220,240,250,260,150,190,210,230,250,260,280,280,210,230,250,285,300,310,325,330,225,255,275,305,325,330,345,355]
[null,"OLYMPIQUE",1000,1000,1000,1000,1000,1000,1000,1000,1000,1000,1000,1000,1000,1000,1000,1000,1000,1000,1000,1000,1000,1000,155,175,190,200,205,210,225,1000,1000,1000,1000,1000,1000,10000,1000,1000,1000,1000,1000,1000,1000,10000,1000,1000,1000,1000,1000,10000,1000,1000,1000,10000,240,270,290,320,345,355,365,375]
[null,"MINIME","CADET","CADET","JUNIOR","SENIOR",null,"MINIME","CADETTE","CADETTE","JUNIOR","SENIOR"]
[20.010000000000002,"NON","C1 45","C2 50","J56","S56",20.010000000000002,"NON","FC1 40","FC2 44","FJ48","FS48"]
[34.01,"NON","C1 45","C2 50","J56","S56",30.01,"NON","FC1 40","FC2 44","FJ48","FS48"]
[38.01,"NON","C1 45","C2 50","J56","S56",35.01,"NON","FC1 40","FC2 44","FJ48","FS48"]
[40.01,"NON","C1 45","C2 50","J56","S56",36.01,"NON","FC1 40","FC2 44","FJ48","FS48"]
{"$rows_left_out":14}