{"text_format":"1","workbook":"xlsx","n_sheets":2,"sheets":["MINIMES GARCONS et FILLES","Feuil1"],"not_rendered":{"charts":0,"images":0,"macros":1,"external_links":0,"defined_names":2,"comments":1,"pivot_tables":0},"unopened":[],"bounds":{"document_bytes":16777216,"sheet_cells":100000,"rows_first":2000,"rows_last":500,"rows_between":2000,"halvings":0,"cell_chars":16384,"cell_head_chars":4096},"cells_cut":0,"cells_raw":0,"read":"whole","date_system":"1900"}

{"sheet":"MINIMES GARCONS et FILLES","index":0,"n_rows":624,"n_cols":52,"rows_kept":624,"cut":false,"hidden":false,"merged":[[0,24,1,24],[1,7,1,8],[1,9,1,11],[1,12,1,15],[1,17,1,18],[1,19,1,20],[1,21,1,23],[2,21,2,22],[0,2,0,10],[0,17,0,18],[0,19,0,20],[0,21,0,22],[113,3,113,5],[113,14,113,17],[113,20,113,22],[101,8,103,8],[104,8,106,8],[107,8,109,8],[112,3,112,5],[112,14,112,17],[112,20,112,22]]}
[null,null,"LISTING  BENJAMINS MINIMES",null,null,null,null,null,null,null,null,null," ",null,null,null,null," ",null,null,null,null,null,null,"BENJAMINSMINIMES "]
[null,null,null,null,null,null," ",null,null,"REGION :",null,null,null,null,null,null,null,"Date :"]
["SEXE"," ","REG.","LICENCE","NAT","Place","NOMS","Prénoms","CLUB","AN","POIDS",1,2,3,"ARR",1,2,3,"EP-J","TOTAL","IWF",null,null,"Catég"," ","DEP +","REG +","IRG +","FED +","NAT +","INTB +","INTA +","OLY +","NCL"]
["F",null,null,null,null,null,null,null,null,null,null,null,null,null,{"$f":"IF(MAXA(L4,M4,N4)=MAXA(L4+M4,M4+N4,L4+N4,L4,M4,N4),0,MAXA(L4+M4,M4+N4,L4+N4,L4,M4,N4))","v":0},null,null,null,{"$f":"IF(MAXA(P4,Q4,R4)=MAXA(P4+Q4,Q4+R4,P4+R4,P4,Q4,R4),0,MAXA(P4+Q4,Q4+R4,P4+R4,P4,Q4,R4))","v":0},{"$f":"IF(K4=\"\",\"\",IF(OR(O4=0,S4=0),0,O4+S4))","v":""},{"$f":"IF(K4=\"\",\"\",IF(A4=\"H\",10^(0.794358141*LOG(K4/174.393)^2)*T4,IF(A4=\"F\",10^(0.794358141 * LOG(K4/174.393)^2)*T4,\"\")))","v":""},null,null,{"$f":"IF(A4=\"F\",(IF(AND(J4>2003,J4<2007),VLOOKUP(K4,Feuil1!$H$11:$N$25,3),VLOOKUP(K4,Feuil1!$H$11:$N$25,2))),IF(A4=\"H\",(IF(AND(J4>2003,J4<2007),VLOOKUP(K4,Feuil1!$A$11:$G$29,3),VLOOKUP(K4,Feuil1!$A$11:$G$29,2)))))","v":{"$error":"#N/A"}},null,{"$f":"T4-HLOOKUP(X4,#REF!,2,FALSE)","v":{"$error":"#VALUE!"}},{"$f":"T4-HLOOKUP(X4,#REF!,3,FALSE)","v":{"$error":"#VALUE!"}},{"$f":"T4-HLOOKUP(X4,#REF!,4,FALSE)","v":{"$error":"#VALUE!"}},{"$f":"T4-HLOOKUP(X4,#REF!,5,FALSE)","v":{"$error":"#VALUE!"}},{"$f":"T4-HLOOKUP(X4,#REF!,6,FALSE)","v":{"$error":"#VALUE!"}},{"$f":"T4-HLOOKUP(X4,#REF!,7,FALSE)","v":{"$error":"#VALUE!"}},{"$f":"T4-HLOOKUP(X4,#REF!,8,FALSE)","v":{"$error":"#VALUE!"}},{"$f":"T4-HLOOKUP(X4,#REF!,9,FALSE)","v":{"$error":"#VALUE!"}},null,null,null,null,null,null,null,{"$f":"IF(AG4>=0,$AG$3,IF(AF4>=0,$AF$3,IF(AE4>=0,$AE$3,IF(AD4>=0,$AD$3,IF(AC4>=0,$AC$3,IF(AB4>=0,$AB$3,IF(AA4>=0,$AA$3,IF(Z4>=0,$Z$3,$AH$3))))))))","v":{"$error":"#VALUE!"}}]
["F",null,null,null,null,null,null,null,null,null,null,null,null,null,0,null,null,null,0,"","",null,null,{"$f":"IF(A5=\"F\",(IF(AND(J5>2003,J5<2007),VLOOKUP(K5,Feuil1!$H$11:$N$25,3),VLOOKUP(K5,Feuil1!$H$11:$N$25,2))),IF(A5=\"H\",(IF(AND(J5>2003,J5<2007),VLOOKUP(K5,Feuil1!$A$11:$G$29,3),VLOOKUP(K5,Feuil1!$A$11:$G$29,2)))))","v":{"$error":"#N/A"}},null,{"$f":"T5-HLOOKUP(X5,#REF!,2,FALSE)","v":{"$error":"#VALUE!"}},{"$f":"T5-HLOOKUP(X5,#REF!,3,FALSE)","v":{"$error":"#VALUE!"}},{"$f":"T5-HLOOKUP(X5,#REF!,4,FALSE)","v":{"$error":"#VALUE!"}},{"$f":"T5-HLOOKUP(X5,#REF!,5,FALSE)","v":{"$error":"#VALUE!"}},{"$f":"T5-HLOOKUP(X5,#REF!,6,FALSE)","v":{"$error":"#VALUE!"}},{"$f":"T5-HLOOKUP(X5,#REF!,7,FALSE)","v":{"$error":"#VALUE!"}},{"$f":"T5-HLOOKUP(X5,#REF!,8,FALSE)","v":{"$error":"#VALUE!"}},{"$f":"T5-HLOOKUP(X5,#REF!,9,FALSE)","v":{"$error":"#VALUE!"}},null,null,null,null,null,null,null,{"$error":"#VALUE!"}]
["F",null,null,null,null,null,null,null,null,null,null,null,null,null,0,null,null,null,0,"","",null,null,{"$f":"IF(A6=\"F\",(IF(AND(J6>2003,J6<2007),VLOOKUP(K6,Feuil1!$H$11:$N$25,3),VLOOKUP(K6,Feuil1!$H$11:$N$25,2))),IF(A6=\"H\",(IF(AND(J6>2003,J6<2007),VLOOKUP(K6,Feuil1!$A$11:$G$29,3),VLOOKUP(K6,Feuil1!$A$11:$G$29,2)))))","v":{"$error":"#N/A"}},null,{"$f":"T6-HLOOKUP(X6,#REF!,2,FALSE)","v":{"$error":"#VALUE!"}},{"$f":"T6-HLOOKUP(X6,#REF!,3,FALSE)","v":{"$error":"#VALUE!"}},{"$f":"T6-HLOOKUP(X6,#REF!,4,FALSE)","v":{"$error":"#VALUE!"}},{"$f":"T6-HLOOKUP(X6,#REF!,5,FALSE)","v":{"$error":"#VALUE!"}},{"$f":"T6-HLOOKUP(X6,#REF!,6,FALSE)","v":{"$error":"#VALUE!"}},{"$f":"T6-HLOOKUP(X6,#REF!,7,FALSE)","v":{"$error":"#VALUE!"}},{"$f":"T6-HLOOKUP(X6,#REF!,8,FALSE)","v":{"$error":"#VALUE!"}},{"$f":"T6-HLOOKUP(X6,#REF!,9,FALSE)","v":{"$error":"#VALUE!"}},null,null,null,null,null,null,null,{"$error":"#VALUE!"},null,null,null,null,null,null,null,null,null,null,{"$f":"#REF!","v":{"$error":"#REF!"}}]
["F",null,null,null,null,null,null,null,null,null,null,null,null,null,0,null,null,null,0,"","",null,null,{"$f":"IF(A7=\"F\",(IF(AND(J7>2003,J7<2007),VLOOKUP(K7,Feuil1!$H$11:$N$25,3),VLOOKUP(K7,Feuil1!$H$11:$N$25,2))),IF(A7=\"H\",(IF(AND(J7>2003,J7<2007),VLOOKUP(K7,Feuil1!$A$11:$G$29,3),VLOOKUP(K7,Feuil1!$A$11:$G$29,2)))))","v":{"$error":"#N/A"}},null,{"$f":"T7-HLOOKUP(X7,#REF!,2,FALSE)","v":{"$error":"#VALUE!"}},{"$f":"T7-HLOOKUP(X7,#REF!,3,FALSE)","v":{"$error":"#VALUE!"}},{"$f":"T7-HLOOKUP(X7,#REF!,4,FALSE)","v":{"$error":"#VALUE!"}},{"$f":"T7-HLOOKUP(X7,#REF!,5,FALSE)","v":{"$error":"#VALUE!"}},{"$f":"T7-HLOOKUP(X7,#REF!,6,FALSE)","v":{"$error":"#VALUE!"}},{"$f":"T7-HLOOKUP(X7,#REF!,7,FALSE)","v":{"$error":"#VALUE!"}},{"$f":"T7-HLOOKUP(X7,#REF!,8,FALSE)","v":{"$error":"#VALUE!"}},{"$f":"T7-HLOOKUP(X7,#REF!,9,FALSE)","v":{"$error":"#VALUE!"}},null,null,null,null,null,null,null,{"$error":"#VALUE!"},null,null,null,null,null,null,null,null,null,null,{"$f":"#REF!","v":{"$error":"#REF!"}}]
["F",null,null,null,null,null,null,null,null,null,null,null,null,null,0,null,null,null,0,"","",null,null,{"$f":"IF(A8=\"F\",(IF(AND(J8>2003,J8<2007),VLOOKUP(K8,Feuil1!$H$11:$N$25,3),VLOOKUP(K8,Feuil1!$H$11:$N$25,2))),IF(A8=\"H\",(IF(AND(J8>2003,J8<2007),VLOOKUP(K8,Feuil1!$A$11:$G$29,3),VLOOKUP(K8,Feuil1!$A$11:$G$29,2)))))","v":{"$error":"#N/A"}},null,{"$f":"T8-HLOOKUP(X8,#REF!,2,FALSE)","v":{"$error":"#VALUE!"}},{"$f":"T8-HLOOKUP(X8,#REF!,3,FALSE)","v":{"$error":"#VALUE!"}},{"$f":"T8-HLOOKUP(X8,#REF!,4,FALSE)","v":{"$error":"#VALUE!"}},{"$f":"T8-HLOOKUP(X8,#REF!,5,FALSE)","v":{"$error":"#VALUE!"}},{"$f":"T8-HLOOKUP(X8,#REF!,6,FALSE)","v":{"$error":"#VALUE!"}},{"$f":"T8-HLOOKUP(X8,#REF!,7,FALSE)","v":{"$error":"#VALUE!"}},{"$f":"T8-HLOOKUP(X8,#REF!,8,FALSE)","v":{"$error":"#VALUE!"}},{"$f":"T8-HLOOKUP(X8,#REF!,9,FALSE)","v":{"$error":"#VALUE!"}},null,null,null,null,null,null,null,{"$error":"#VALUE!"},null,null,null,null,null,null,null,null,null,null,{"$f":"#REF!","v":{"$error":"#REF!"}}]
["F",null,null,null,null,null,null,null,null,null,null,null,null,null,0,null,null,null,0,"","",null,null,{"$f":"IF(A9=\"F\",(IF(AND(J9>2003,J9<2007),VLOOKUP(K9,Feuil1!$H$11:$N$25,3),VLOOKUP(K9,Feuil1!$H$11:$N$25,2))),IF(A9=\"H\",(IF(AND(J9>2003,J9<2007),VLOOKUP(K9,Feuil1!$A$11:$G$29,3),VLOOKUP(K9,Feuil1!$A$11:$G$29,2)))))","v":{"$error":"#N/A"}},null,{"$f":"T9-HLOOKUP(X9,#REF!,2,FALSE)","v":{"$error":"#VALUE!"}},{"$f":"T9-HLOOKUP(X9,#REF!,3,FALSE)","v":{"$error":"#VALUE!"}},{"$f":"T9-HLOOKUP(X9,#REF!,4,FALSE)","v":{"$error":"#VALUE!"}},{"$f":"T9-HLOOKUP(X9,#REF!,5,FALSE)","v":{"$error":"#VALUE!"}},{"$f":"T9-HLOOKUP(X9,#REF!,6,FALSE)","v":{"$error":"#VALUE!"}},{"$f":"T9-HLOOKUP(X9,#REF!,7,FALSE)","v":{"$error":"#VALUE!"}},{"$f":"T9-HLOOKUP(X9,#REF!,8,FALSE)","v":{"$error":"#VALUE!"}},{"$f":"T9-HLOOKUP(X9,#REF!,9,FALSE)","v":{"$error":"#VALUE!"}},null,null,null,null,null,null,null,{"$error":"#VALUE!"},null,null,null,null,null,null,null,null,null,null,{"$f":"#REF!","v":{"$error":"#REF!"}}]
["F",null,null,null,null,null,null,null,null,null,null,null,null,null,0,null,null,null,0,"",{"$f":"IF(K10=\"\",\"\",IF(A10=\"H\",10^(0.794358141*LOG(K10/174.393)^2)*T10,IF(A10=\"F\",10^(0.794358141 * LOG(K10/174.393)^2)*T10,\"\")))","v":""},null,null,{"$f":"IF(A10=\"F\",(IF(AND(J10>2003,J10<2007),VLOOKUP(K10,Feuil1!$H$11:$N$25,3),VLOOKUP(K10,Feuil1!$H$11:$N$25,2))),IF(A10=\"H\",(IF(AND(J10>2003,J10<2007),VLOOKUP(K10,Feuil1!$A$11:$G$29,3),VLOOKUP(K10,Feuil1!$A$11:$G$29,2)))))","v":{"$error":"#N/A"}},null,{"$f":"T10-HLOOKUP(X10,#REF!,2,FALSE)","v":{"$error":"#VALUE!"}},{"$f":"T10-HLOOKUP(X10,#REF!,3,FALSE)","v":{"$error":"#VALUE!"}},{"$f":"T10-HLOOKUP(X10,#REF!,4,FALSE)","v":{"$error":"#VALUE!"}},{"$f":"T10-HLOOKUP(X10,#REF!,5,FALSE)","v":{"$error":"#VALUE!"}},{"$f":"T10-HLOOKUP(X10,#REF!,6,FALSE)","v":{"$error":"#VALUE!"}},{"$f":"T10-HLOOKUP(X10,#REF!,7,FALSE)","v":{"$error":"#VALUE!"}},{"$f":"T10-HLOOKUP(X10,#REF!,8,FALSE)","v":{"$error":"#VALUE!"}},{"$f":"T10-HLOOKUP(X10,#REF!,9,FALSE)","v":{"$error":"#VALUE!"}},null,null,null,null,null,null,null,{"$f":"IF(AG10>=0,$AG$3,IF(AF10>=0,$AF$3,IF(AE10>=0,$AE$3,IF(AD10>=0,$AD$3,IF(AC10>=0,$AC$3,IF(AB10>=0,$AB$3,IF(AA10>=0,$AA$3,IF(Z10>=0,$Z$3,$AH$3))))))))","v":{"$error":"#VALUE!"}},null,null,null,null,null,null,null,null,null,null,{"$f":"#REF!","v":{"$error":"#REF!"}}]
["F",null,null,null,null,null,null,null,null,null,null,null,null,null,0,null,null,null,0,"","",null,null,{"$f":"IF(A11=\"F\",(IF(AND(J11>2003,J11<2007),VLOOKUP(K11,Feuil1!$H$11:$N$25,3),VLOOKUP(K11,Feuil1!$H$11:$N$25,2))),IF(A11=\"H\",(IF(AND(J11>2003,J11<2007),VLOOKUP(K11,Feuil1!$A$11:$G$29,3),VLOOKUP(K11,Feuil1!$A$11:$G$29,2)))))","v":{"$error":"#N/A"}},null,{"$f":"T11-HLOOKUP(X11,#REF!,2,FALSE)","v":{"$error":"#VALUE!"}},{"$f":"T11-HLOOKUP(X11,#REF!,3,FALSE)","v":{"$error":"#VALUE!"}},{"$f":"T11-HLOOKUP(X11,#REF!,4,FALSE)","v":{"$error":"#VALUE!"}},{"$f":"T11-HLOOKUP(X11,#REF!,5,FALSE)","v":{"$error":"#VALUE!"}},{"$f":"T11-HLOOKUP(X11,#REF!,6,FALSE)","v":{"$error":"#VALUE!"}},{"$f":"T11-HLOOKUP(X11,#REF!,7,FALSE)","v":{"$error":"#VALUE!"}},{"$f":"T11-HLOOKUP(X11,#REF!,8,FALSE)","v":{"$error":"#VALUE!"}},{"$f":"T11-HLOOKUP(X11,#REF!,9,FALSE)","v":{"$error":"#VALUE!"}},null,null,null,null,null,null,null,{"$error":"#VALUE!"},null,null,null,null,null,null,null,null,null,null,{"$f":"#REF!","v":{"$error":"#REF!"}}]
["F",null,null,null,null,null,null,null,null,null,null,null,null,null,0,null,null,null,0,"","",null,null,{"$f":"IF(A12=\"F\",(IF(AND(J12>2003,J12<2007),VLOOKUP(K12,Feuil1!$H$11:$N$25,3),VLOOKUP(K12,Feuil1!$H$11:$N$25,2))),IF(A12=\"H\",(IF(AND(J12>2003,J12<2007),VLOOKUP(K12,Feuil1!$A$11:$G$29,3),VLOOKUP(K12,Feuil1!$A$11:$G$29,2)))))","v":{"$error":"#N/A"}},null,{"$f":"T12-HLOOKUP(X12,#REF!,2,FALSE)","v":{"$error":"#VALUE!"}},{"$f":"T12-HLOOKUP(X12,#REF!,3,FALSE)","v":{"$error":"#VALUE!"}},{"$f":"T12-HLOOKUP(X12,#REF!,4,FALSE)","v":{"$error":"#VALUE!"}},{"$f":"T12-HLOOKUP(X12,#REF!,5,FALSE)","v":{"$error":"#VALUE!"}},{"$f":"T12-HLOOKUP(X12,#REF!,6,FALSE)","v":{"$error":"#VALUE!"}},{"$f":"T12-HLOOKUP(X12,#REF!,7,FALSE)","v":{"$error":"#VALUE!"}},{"$f":"T12-HLOOKUP(X12,#REF!,8,FALSE)","v":{"$error":"#VALUE!"}},{"$f":"T12-HLOOKUP(X12,#REF!,9,FALSE)","v":{"$error":"#VALUE!"}},null,null,null,null,null,null,null,{"$error":"#VALUE!"},null,null,null,null,null,null,null,null,null,null,{"$f":"#REF!","v":{"$error":"#REF!"}}]
["F",null,null,null,null,null,null,null,null,null,null,null,null,null,0,null,null,null,0,"","",null,null,{"$f":"IF(A13=\"F\",(IF(AND(J13>2003,J13<2007),VLOOKUP(K13,Feuil1!$H$11:$N$25,3),VLOOKUP(K13,Feuil1!$H$11:$N$25,2))),IF(A13=\"H\",(IF(AND(J13>2003,J13<2007),VLOOKUP(K13,Feuil1!$A$11:$G$29,3),VLOOKUP(K13,Feuil1!$A$11:$G$29,2)))))","v":{"$error":"#N/A"}},null,{"$f":"T13-HLOOKUP(X13,#REF!,2,FALSE)","v":{"$error":"#VALUE!"}},{"$f":"T13-HLOOKUP(X13,#REF!,3,FALSE)","v":{"$error":"#VALUE!"}},{"$f":"T13-HLOOKUP(X13,#REF!,4,FALSE)","v":{"$error":"#VALUE!"}},{"$f":"T13-HLOOKUP(X13,#REF!,5,FALSE)","v":{"$error":"#VALUE!"}},{"$f":"T13-HLOOKUP(X13,#REF!,6,FALSE)","v":{"$error":"#VALUE!"}},{"$f":"T13-HLOOKUP(X13,#REF!,7,FALSE)","v":{"$error":"#VALUE!"}},{"$f":"T13-HLOOKUP(X13,#REF!,8,FALSE)","v":{"$error":"#VALUE!"}},{"$f":"T13-HLOOKUP(X13,#REF!,9,FALSE)","v":{"$error":"#VALUE!"}},null,null,null,null,null,null,null,{"$error":"#VALUE!"},null,null,null,null,null,null,null,null,null,null,{"$f":"#REF!","v":{"$error":"#REF!"}}]
["F",null,null,null,null,null,null,null,null,null,null,null,null,null,{"$f":"IF(MAXA(L14,M14,N14)=MAXA(L14+M14,M14+N14,L14+N14,L14,M14,N14),0,MAXA(L14+M14,M14+N14,L14+N14,L14,M14,N14))","v":0},null,null,null,{"$f":"IF(MAXA(P14,Q14,R14)=MAXA(P14+Q14,Q14+R14,P14+R14,P14,Q14,R14),0,MAXA(P14+Q14,Q14+R14,P14+R14,P14,Q14,R14))","v":0},{"$f":"IF(K14=\"\",\"\",IF(OR(O14=0,S14=0),0,O14+S14))","v":""},{"$f":"IF(K14=\"\",\"\",IF(A14=\"H\",10^(0.794358141*LOG(K14/174.393)^2)*T14,IF(A14=\"F\",10^(0.794358141 * LOG(K14/174.393)^2)*T14,\"\")))","v":""},null,null,{"$f":"IF(A14=\"F\",(IF(AND(J14>2003,J14<2007),VLOOKUP(K14,Feuil1!$H$11:$N$25,3),VLOOKUP(K14,Feuil1!$H$11:$N$25,2))),IF(A14=\"H\",(IF(AND(J14>2003,J14<2007),VLOOKUP(K14,Feuil1!$A$11:$G$29,3),VLOOKUP(K14,Feuil1!$A$11:$G$29,2)))))","v":{"$error":"#N/A"}},null,{"$f":"T14-HLOOKUP(X14,#REF!,2,FALSE)","v":{"$error":"#VALUE!"}},{"$f":"T14-HLOOKUP(X14,#REF!,3,FALSE)","v":{"$error":"#VALUE!"}},{"$f":"T14-HLOOKUP(X14,#REF!,4,FALSE)","v":{"$error":"#VALUE!"}},{"$f":"T14-HLOOKUP(X14,#REF!,5,FALSE)","v":{"$error":"#VALUE!"}},{"$f":"T14-HLOOKUP(X14,#REF!,6,FALSE)","v":{"$error":"#VALUE!"}},{"$f":"T14-HLOOKUP(X14,#REF!,7,FALSE)","v":{"$error":"#VALUE!"}},{"$f":"T14-HLOOKUP(X14,#REF!,8,FALSE)","v":{"$error":"#VALUE!"}},{"$f":"T14-HLOOKUP(X14,#REF!,9,FALSE)","v":{"$error":"#VALUE!"}},null,null,null,null,null,null,null,{"$error":"#VALUE!"}]
["F",null,null,null,null,null,null,null,null,null,null,null,null,null,{"$f":"IF(MAXA(L15,M15,N15)=MAXA(L15+M15,M15+N15,L15+N15,L15,M15,N15),0,MAXA(L15+M15,M15+N15,L15+N15,L15,M15,N15))","v":0},null,null,null,{"$f":"IF(MAXA(P15,Q15,R15)=MAXA(P15+Q15,Q15+R15,P15+R15,P15,Q15,R15),0,MAXA(P15+Q15,Q15+R15,P15+R15,P15,Q15,R15))","v":0},{"$f":"IF(K15=\"\",\"\",IF(OR(O15=0,S15=0),0,O15+S15))","v":""},"",null,null,{"$f":"IF(A15=\"F\",(IF(AND(J15>2003,J15<2007),VLOOKUP(K15,Feuil1!$H$11:$N$25,3),VLOOKUP(K15,Feuil1!$H$11:$N$25,2))),IF(A15=\"H\",(IF(AND(J15>2003,J15<2007),VLOOKUP(K15,Feuil1!$A$11:$G$29,3),VLOOKUP(K15,Feuil1!$A$11:$G$29,2)))))","v":{"$error":"#N/A"}},null,{"$f":"T15-HLOOKUP(X15,#REF!,2,FALSE)","v":{"$error":"#VALUE!"}},{"$f":"T15-HLOOKUP(X15,#REF!,3,FALSE)","v":{"$error":"#VALUE!"}},{"$f":"T15-HLOOKUP(X15,#REF!,4,FALSE)","v":{"$error":"#VALUE!"}},{"$f":"T15-HLOOKUP(X15,#REF!,5,FALSE)","v":{"$error":"#VALUE!"}},{"$f":"T15-HLOOKUP(X15,#REF!,6,FALSE)","v":{"$error":"#VALUE!"}},{"$f":"T15-HLOOKUP(X15,#REF!,7,FALSE)","v":{"$error":"#VALUE!"}},{"$f":"T15-HLOOKUP(X15,#REF!,8,FALSE)","v":{"$error":"#VALUE!"}},{"$f":"T15-HLOOKUP(X15,#REF!,9,FALSE)","v":{"$error":"#VALUE!"}},null,null,null,null,null,null,null,{"$error":"#VALUE!"}]
["H",null,null,null,null,null,null,null,null,null,null,null,null,null,0,null,null,null,0,"","",null,null,{"$f":"IF(A16=\"F\",(IF(AND(J16>2003,J16<2007),VLOOKUP(K16,Feuil1!$H$11:$N$25,3),VLOOKUP(K16,Feuil1!$H$11:$N$25,2))),IF(A16=\"H\",(IF(AND(J16>2003,J16<2007),VLOOKUP(K16,Feuil1!$A$11:$G$29,3),VLOOKUP(K16,Feuil1!$A$11:$G$29,2)))))","v":{"$error":"#N/A"}},null,{"$f":"T16-HLOOKUP(X16,#REF!,2,FALSE)","v":{"$error":"#VALUE!"}},{"$f":"T16-HLOOKUP(X16,#REF!,3,FALSE)","v":{"$error":"#VALUE!"}},{"$f":"T16-HLOOKUP(X16,#REF!,4,FALSE)","v":{"$error":"#VALUE!"}},{"$f":"T16-HLOOKUP(X16,#REF!,5,FALSE)","v":{"$error":"#VALUE!"}},{"$f":"T16-HLOOKUP(X16,#REF!,6,FALSE)","v":{"$error":"#VALUE!"}},{"$f":"T16-HLOOKUP(X16,#REF!,7,FALSE)","v":{"$error":"#VALUE!"}},{"$f":"T16-HLOOKUP(X16,#REF!,8,FALSE)","v":{"$error":"#VALUE!"}},{"$f":"T16-HLOOKUP(X16,#REF!,9,FALSE)","v":{"$error":"#VALUE!"}},null,null,null,null,null,null,null,{"$error":"#VALUE!"}]
["H",null,null,null,null,null,null,null,null,null,null,null,null,null,0,null,null,null,0,"","",null,null,{"$f":"IF(A17=\"F\",(IF(AND(J17>2003,J17<2007),VLOOKUP(K17,Feuil1!$H$11:$N$25,3),VLOOKUP(K17,Feuil1!$H$11:$N$25,2))),IF(A17=\"H\",(IF(AND(J17>2003,J17<2007),VLOOKUP(K17,Feuil1!$A$11:$G$29,3),VLOOKUP(K17,Feuil1!$A$11:$G$29,2)))))","v":{"$error":"#N/A"}},null,{"$f":"T17-HLOOKUP(X17,#REF!,2,FALSE)","v":{"$error":"#VALUE!"}},{"$f":"T17-HLOOKUP(X17,#REF!,3,FALSE)","v":{"$error":"#VALUE!"}},{"$f":"T17-HLOOKUP(X17,#REF!,4,FALSE)","v":{"$error":"#VALUE!"}},{"$f":"T17-HLOOKUP(X17,#REF!,5,FALSE)","v":{"$error":"#VALUE!"}},{"$f":"T17-HLOOKUP(X17,#REF!,6,FALSE)","v":{"$error":"#VALUE!"}},{"$f":"T17-HLOOKUP(X17,#REF!,7,FALSE)","v":{"$error":"#VALUE!"}},{"$f":"T17-HLOOKUP(X17,#REF!,8,FALSE)","v":{"$error":"#VALUE!"}},{"$f":"T17-HLOOKUP(X17,#REF!,9,FALSE)","v":{"$error":"#VALUE!"}},null,null,null,null,null,null,null,{"$error":"#VALUE!"},null,null,null,null,null,null,null,null,null,null,{"$f":"#REF!","v":{"$error":"#REF!"}}]
["H",null,null,null,null,null,null,null,null,null,null,null,null,null,0,null,null,null,0,"","",null,null,{"$f":"IF(A18=\"F\",(IF(AND(J18>2003,J18<2007),VLOOKUP(K18,Feuil1!$H$11:$N$25,3),VLOOKUP(K18,Feuil1!$H$11:$N$25,2))),IF(A18=\"H\",(IF(AND(J18>2003,J18<2007),VLOOKUP(K18,Feuil1!$A$11:$G$29,3),VLOOKUP(K18,Feuil1!$A$11:$G$29,2)))))","v":{"$error":"#N/A"}},null,{"$f":"T18-HLOOKUP(X18,#REF!,2,FALSE)","v":{"$error":"#VALUE!"}},{"$f":"T18-HLOOKUP(X18,#REF!,3,FALSE)","v":{"$error":"#VALUE!"}},{"$f":"T18-HLOOKUP(X18,#REF!,4,FALSE)","v":{"$error":"#VALUE!"}},{"$f":"T18-HLOOKUP(X18,#REF!,5,FALSE)","v":{"$error":"#VALUE!"}},{"$f":"T18-HLOOKUP(X18,#REF!,6,FALSE)","v":{"$error":"#VALUE!"}},{"$f":"T18-HLOOKUP(X18,#REF!,7,FALSE)","v":{"$error":"#VALUE!"}},{"$f":"T18-HLOOKUP(X18,#REF!,8,FALSE)","v":{"$error":"#VALUE!"}},{"$f":"T18-HLOOKUP(X18,#REF!,9,FALSE)","v":{"$error":"#VALUE!"}},null,null,null,null,null,null,null,{"$error":"#VALUE!"},null,null,null,null,null,null,null,null,null,null,{"$f":"#REF!","v":{"$error":"#REF!"}}]
["H",null,null,null,null,null,null,null,null,null,null,null,null,null,0,null,null,null,0,"","",null,null,{"$f":"IF(A19=\"F\",(IF(AND(J19>2003,J19<2007),VLOOKUP(K19,Feuil1!$H$11:$N$25,3),VLOOKUP(K19,Feuil1!$H$11:$N$25,2))),IF(A19=\"H\",(IF(AND(J19>2003,J19<2007),VLOOKUP(K19,Feuil1!$A$11:$G$29,3),VLOOKUP(K19,Feuil1!$A$11:$G$29,2)))))","v":{"$error":"#N/A"}},null,{"$f":"T19-HLOOKUP(X19,#REF!,2,FALSE)","v":{"$error":"#VALUE!"}},{"$f":"T19-HLOOKUP(X19,#REF!,3,FALSE)","v":{"$error":"#VALUE!"}},{"$f":"T19-HLOOKUP(X19,#REF!,4,FALSE)","v":{"$error":"#VALUE!"}},{"$f":"T19-HLOOKUP(X19,#REF!,5,FALSE)","v":{"$error":"#VALUE!"}},{"$f":"T19-HLOOKUP(X19,#REF!,6,FALSE)","v":{"$error":"#VALUE!"}},{"$f":"T19-HLOOKUP(X19,#REF!,7,FALSE)","v":{"$error":"#VALUE!"}},{"$f":"T19-HLOOKUP(X19,#REF!,8,FALSE)","v":{"$error":"#VALUE!"}},{"$f":"T19-HLOOKUP(X19,#REF!,9,FALSE)","v":{"$error":"#VALUE!"}},null,null,null,null,null,null,null,{"$error":"#VALUE!"},null,null,null,null,null,null,null,null,null,null,{"$f":"#REF!","v":{"$error":"#REF!"}}]
["H",null,null,null,null,null,null,null,null,null,null,null,null,null,0,null,null,null,0,"","",null,null,{"$f":"IF(A20=\"F\",(IF(AND(J20>2003,J20<2007),VLOOKUP(K20,Feuil1!$H$11:$N$25,3),VLOOKUP(K20,Feuil1!$H$11:$N$25,2))),IF(A20=\"H\",(IF(AND(J20>2003,J20<2007),VLOOKUP(K20,Feuil1!$A$11:$G$29,3),VLOOKUP(K20,Feuil1!$A$11:$G$29,2)))))","v":{"$error":"#N/A"}},null,{"$f":"T20-HLOOKUP(X20,#REF!,2,FALSE)","v":{"$error":"#VALUE!"}},{"$f":"T20-HLOOKUP(X20,#REF!,3,FALSE)","v":{"$error":"#VALUE!"}},{"$f":"T20-HLOOKUP(X20,#REF!,4,FALSE)","v":{"$error":"#VALUE!"}},{"$f":"T20-HLOOKUP(X20,#REF!,5,FALSE)","v":{"$error":"#VALUE!"}},{"$f":"T20-HLOOKUP(X20,#REF!,6,FALSE)","v":{"$error":"#VALUE!"}},{"$f":"T20-HLOOKUP(X20,#REF!,7,FALSE)","v":{"$error":"#VALUE!"}},{"$f":"T20-HLOOKUP(X20,#REF!,8,FALSE)","v":{"$error":"#VALUE!"}},{"$f":"T20-HLOOKUP(X20,#REF!,9,FALSE)","v":{"$error":"#VALUE!"}},null,null,null,null,null,null,null,{"$error":"#VALUE!"},null,null,null,null,null,null,null,null,null,null,{"$f":"#REF!","v":{"$error":"#REF!"}}]
{"$rows_left_out":605}
{"sheet":"Feuil1","index":1,"n_rows":29,"n_cols":64,"rows_kept":29,"cut":false,"hidden":true,"merged":[]}
[null,null,"FC1 40","FC1 44","FC1 48","FC1 53","FC1 58","FC1 63","FC1 69","FC1 +69","FC2 44","FC2 48","FC2 53","FC2 58","FC2 63","FC2 69","FC2 +69","FJ48","FJ53","FJ58","FJ63","FJ69","FJ75","FJ+75","FS48","FS53","FS58","FS63","FS69","FS75","FS+75","C1 45","C1 50","C1 56","C1 62","C1 69","C1 77","C1 85","C1 94","C1 +94","C2 50","C2 56","C2 62","C2 69","C2 77","C2 85","C2 94","C2 +94","J56","J62","J69","J77","J85","J94","J105","J+105","S56","S62","S69","S77","S85","S94","S105","S+105"]
[null,"DEBUTANT",20,25,30,35,40,45,50,60,30,35,45,50,55,60,70,45,55,60,65,70,80,90,55,65,70,75,80,95,100,35,40,50,75,85,90,100,110,120,45,65,85,95,110,120,125,135,80,90,110,130,145,150,155,165,95,120,130,150,165,170,175,185]
[null,"DEPARTEMENTAL",25,30,35,45,50,55,60,70,40,45,55,60,65,70,80,55,65,70,75,80,95,100,65,75,80,85,90,105,110,50,55,70,95,105,110,120,130,140,65,85,105,115,130,140,145,155,100,120,130,150,165,170,175,185,115,135,150,170,185,190,195,205]
[null,"REGIONAL",35,40,45,55,60,65,70,80,50,55,65,70,75,80,95,65,75,80,85,90,105,110,75,85,90,95,105,115,125,60,65,85,105,115,130,140,145,155,80,100,120,130,150,160,165,175,115,135,150,170,185,190,195,205,130,150,170,190,205,215,220,225]
[null,"INTERREGIONAL",45,50,55,65,70,75,80,95,60,65,75,80,85,90,105,75,85,90,95,105,115,125,85,95,100,110,120,130,140,75,80,100,120,130,150,160,165,175,95,115,135,150,170,180,185,195,130,150,170,190,205,215,220,225,145,170,190,210,225,235,245,250]
[null,"FEDERAL",50,60,65,75,80,85,90,105,70,75,85,90,95,105,115,85,95,100,110,120,130,140,95,105,115,125,135,145,150,90,95,115,135,150,170,180,185,195,110,130,150,170,185,200,210,220,145,170,190,210,225,235,245,250,170,190,210,240,250,260,270,280]
[null,"NATIONAL",60,70,75,85,90,95,105,115,80,85,95,100,110,120,130,95,105,115,125,135,145,150,110,120,130,140,150,160,170,105,110,130,150,170,185,200,210,220,120,145,170,190,200,220,225,235,170,190,220,240,250,260,270,280,190,210,240,265,280,290,300,310]
[null,"INTERNATIONAL B",70,80,85,95,100,110,120,130,90,95,105,115,125,135,145,110,120,130,140,150,160,170,125,140,150,160,170,180,190,115,120,145,170,190,200,220,225,235,135,170,190,210,220,240,250,260,190,210,240,260,280,290,300,310,210,230,260,285,300,310,325,330]
[null,"INTERNATIONAL A",80,90,95,105,115,125,135,145,100,110,120,130,140,150,160,125,135,150,160,170,180,190,140,160,170,180,190,195,210,130,135,170,190,210,220,240,250,260,150,190,210,230,250,260,280,280,210,230,250,285,300,310,325,330,225,255,275,305,325,330,345,355]
[null,"OLYMPIQUE",1000,1000,1000,1000,1000,1000,1000,1000,1000,1000,1000,1000,1000,1000,1000,1000,1000,1000,1000,1000,1000,1000,155,175,190,200,205,210,225,1000,1000,1000,1000,1000,1000,10000,1000,1000,1000,1000,1000,1000,1000,10000,1000,1000,1000,1000,1000,10000,1000,1000,1000,10000,240,270,290,320,345,355,365,375]
[null,"BENJAMIN","MINIME","CADET","CADET","JUNIOR","SENIOR",null,"BENJAMIN","MINIME","CADETTE","CADETTE","JUNIOR","SENIOR"]
[20.010000000000002,"BENJ ","M35","C1 50","C2 50","J56","S56",20.010000000000002,"BENJ ","FM36","FC1 44","FC2 44","FJ48","FS48"]
[20.010000000000002,"BENJ ","M35","C1 50","C2 50","J56","S56",30.01,"BENJ ","FM36","FC1 44","FC2 44","FJ48","FS48"]
[35.01,"BENJ ","M40","C1 50","C2 50","J56","S56",30.01,"BENJ ","FM36","FC1 44","FC2 44","FJ48","FS48"]
[40.01,"BENJ ","M45","C1 50","C2 50","J56","S56",36.01,"BENJ ","FM40","FC1 44","FC2 44","FJ48","FS48"]
[45.01,"BENJ ","M50","C1 50","C2 50","J56","S56",40.01,"BENJ ","FM44","FC1 44","FC2 44","FJ48","FS48"]
[50.01,"BENJ ","M56","C1 56","C2 56","J56","S56",44.01,"BENJ ","FM48","FC1 48","FC2 48","FJ48","FS48"]
[56.01,"BENJ ","M62","C1 62","C2 62","J62","S62",48.01,"BENJ ","FM53","FC1 53","FC2 53","FJ53","FS53"]
[62.01,"BENJ ","M69","C1 69","C2 69","J69","S69",53.01,"BENJ ","FM58","FC1 58","FC2 58","FJ58","FS58"]
[69.010000000000005,"BENJ ","M+69","C1 77","C2 77","J77","S77",58.01,"BENJ ","FM+58","FC1 63","FC2 63","FJ63","FS63"]
{"$rows_left_out":9}