{"text_format":"1","workbook":"xlsx","n_sheets":4,"sheets":["FEM","Feuil1","Feuil2","Feuil3"],"not_rendered":{"charts":0,"images":1,"macros":1,"external_links":0,"defined_names":2,"comments":1,"pivot_tables":0},"unopened":[],"bounds":{"document_bytes":16777216,"sheet_cells":100000,"rows_first":2000,"rows_last":500,"rows_between":2000,"halvings":0,"cell_chars":16384,"cell_head_chars":4096},"cells_cut":0,"cells_raw":0,"read":"whole","date_system":"1900"}

{"sheet":"FEM","index":0,"n_rows":523,"n_cols":46,"rows_kept":523,"cut":false,"hidden":false,"merged":[[35,1,35,4],[35,5,35,6],[35,10,35,13],[35,15,35,18],[35,21,35,23],[33,1,33,4],[33,5,33,6],[33,10,33,15],[34,1,34,4],[34,5,34,6],[31,1,31,4],[31,5,31,6],[31,10,31,15],[31,19,31,23],[32,1,32,4],[32,5,32,6],[32,8,32,9],[32,10,32,15],[32,17,32,18],[0,18,0,21],[4,21,4,22],[1,6,1,10],[1,11,1,13],[1,14,1,17],[1,18,1,19],[1,21,1,22],[3,7,3,13],[3,18,3,22]]}
[null,null,null,null,null,"EPREUVE :"," ",null,null,null,null,null,null,null,null,null,"DATE :",null," "]
[null,null,null,null,null,"LIEU :"," ",null,null,null,null,"REGION :",null,null,null,null,null,null,null,null,null," "]
[]
[null,null,null,null,null," "," "," ",null,null,null,null,null,null,null,null,null,null," "]
["SEXE","ZONE","REG.","Cl.","LICENCE","NOMS","Prénoms","AN","POIDS","CLUB","NAT",1,2,3,"ARR",1,2,3,"EP-J","Total","IWF SMM","SERIE",null,null,"Catég",null,"N.CL.","REG +","FRA +","EUR +","MON +","INTB +","INTA +","OLY +","NCL"]
["F",null,null,null,null,null,null,1975,69,null,null,65,null,null,{"$f":"IF(I6=\"\",\"\",IF(MAXA(L6:N6)<=0,0,MAXA(L6:N6)))","v":65},85,null,null,{"$f":"IF(I6=\"\",\"\",IF(MAXA(P6:R6)<=0,0,MAXA(P6:R6)))","v":85},{"$f":"IF(I6=\"\",\"\",IF(OR(O6=0,S6=0),0,O6+S6))","v":150},{"$f":"IF(I6=\"\",\"\",IF(A6=\"H\",10^(0.794358141*LOG(I6/174.393)^2)*T6*AS6,IF(A6=\"F\",10^(0.89726074 * LOG(I6/148.026)^2)*T6*AS6,\"\")))","v":218.72216358578237},{"$f":"IF(I6=\"\",\"\",AP6)","v":"MON +"},{"$f":"IF(I6=\"\",\"\",IF(AH6>=0,AH6,IF(AG6>=0,AG6,IF(AF6>=0,AF6,IF(AE6>=0,AE6,IF(AD6>=0,AD6,IF(AC6>=0,AC6,IF(AB6>=0,AB6,AA6))))))))","v":53},{"$f":"IF(AQ6<95,IF(AQ6<=90,VLOOKUP(AQ6,$AQ$467:$AR$522,2)))","v":"V2 F40"},{"$f":"IF(AND(H6<1936),VLOOKUP(I6,Feuil1!$F$10:$O$24,9),IF(AND(H6>=1942,H6<1947),VLOOKUP(I6,Feuil1!$F$10:$O$24,9),IF(AND(H6>=1947,H6<1952),VLOOKUP(I6,Feuil1!$F$10:$O$24,8),IF(AND(H6>=1952,H6<1957),VLOOKUP(I6,Feuil1!$F$10:$O$24,7),IF(AND(H6>=1957,H6<1962),VLOOKUP(I6,Feuil1!$F$10:$O$24,6),IF(AND(H6>=1962,H6<1967),VLOOKUP(I6,Feuil1!$F$10:$O$24,5),IF(AND(H6>=1967,H6<1972),VLOOKUP(I6,Feuil1!$F$10:$O$24,4),IF(AND(H6>=1972,H6<1977),VLOOKUP(I6,Feuil1!$F$10:$O$24,3),IF(AND(H6>=1977,H6<1982),VLOOKUP(I6,Feuil1!$F$10:$O$24,2),VLOOKUP(I6,Feuil1!$F$10:$O$24,2))))))))))","v":"VF40-69"},null,{"$f":"T6-HLOOKUP(Y6,Feuil1!$C$1:$BF$9,2,FALSE)","v":150},{"$f":"T6-HLOOKUP(Y6,Feuil1!$C$1:$BF$9,3,FALSE)","v":85},{"$f":"T6-HLOOKUP(Y6,Feuil1!$C$1:$BF$9,4,FALSE)","v":80},{"$f":"T6-HLOOKUP(Y6,Feuil1!$C$1:$BF$9,5,FALSE)","v":70},{"$f":"T6-HLOOKUP(Y6,Feuil1!$C$1:$BF$9,6,FALSE)","v":53},{"$f":"T6-HLOOKUP(Y6,Feuil1!$C$1:$BF$9,7,FALSE)","v":-850},{"$f":"T6-HLOOKUP(Y6,Feuil1!$C$1:$BF$9,8,FALSE)","v":-850},{"$f":"T6-HLOOKUP(Y6,Feuil1!$C$1:$BF$9,9,FALSE)","v":-850},null,null,null,null,null,null,null,{"$f":"IF(AH6>=0,$AH$5,IF(AG6>=0,$AG$5,IF(AF6>=0,$AF$5,IF(AE6>=0,$AE$5,IF(AD6>=0,$AD$5,IF(AC6>=0,$AC$5,IF(AB6>=0,$AB$5,IF(AA6>=0,$AA$5,$AI$5))))))))","v":"MON +"},{"$f":"2017-H6","v":42},null,{"$f":"IF(AQ6,VLOOKUP(AQ6,FEM!$AS$468:$AT$523,2))","v":1.1619999999999999}]
["F",null,null,null,null,null,null,1976,69,null,null,39,null,null,{"$f":"IF(I7=\"\",\"\",IF(MAXA(L7:N7)<=0,0,MAXA(L7:N7)))","v":39},50,null,null,{"$f":"IF(I7=\"\",\"\",IF(MAXA(P7:R7)<=0,0,MAXA(P7:R7)))","v":50},{"$f":"IF(I7=\"\",\"\",IF(OR(O7=0,S7=0),0,O7+S7))","v":89},{"$f":"IF(I7=\"\",\"\",IF(A7=\"H\",10^(0.794358141*LOG(I7/174.393)^2)*T7*AS7,IF(A7=\"F\",10^(0.89726074 * LOG(I7/148.026)^2)*T7*AS7,\"\")))","v":128.32327693887373},{"$f":"IF(I7=\"\",\"\",AP7)","v":"EUR +"},{"$f":"IF(I7=\"\",\"\",IF(AH7>=0,AH7,IF(AG7>=0,AG7,IF(AF7>=0,AF7,IF(AE7>=0,AE7,IF(AD7>=0,AD7,IF(AC7>=0,AC7,IF(AB7>=0,AB7,AA7))))))))","v":9},{"$f":"IF(AQ7<95,IF(AQ7<=90,VLOOKUP(AQ7,$AQ$467:$AR$522,2)))","v":"V2 F40"},{"$f":"IF(AND(H7<1936),VLOOKUP(I7,Feuil1!$F$10:$O$24,9),IF(AND(H7>=1942,H7<1947),VLOOKUP(I7,Feuil1!$F$10:$O$24,9),IF(AND(H7>=1947,H7<1952),VLOOKUP(I7,Feuil1!$F$10:$O$24,8),IF(AND(H7>=1952,H7<1957),VLOOKUP(I7,Feuil1!$F$10:$O$24,7),IF(AND(H7>=1957,H7<1962),VLOOKUP(I7,Feuil1!$F$10:$O$24,6),IF(AND(H7>=1962,H7<1967),VLOOKUP(I7,Feuil1!$F$10:$O$24,5),IF(AND(H7>=1967,H7<1972),VLOOKUP(I7,Feuil1!$F$10:$O$24,4),IF(AND(H7>=1972,H7<1977),VLOOKUP(I7,Feuil1!$F$10:$O$24,3),IF(AND(H7>=1977,H7<1982),VLOOKUP(I7,Feuil1!$F$10:$O$24,2),VLOOKUP(I7,Feuil1!$F$10:$O$24,2))))))))))","v":"VF40-69"},null,{"$f":"T7-HLOOKUP(Y7,Feuil1!$C$1:$BF$9,2,FALSE)","v":89},{"$f":"T7-HLOOKUP(Y7,Feuil1!$C$1:$BF$9,3,FALSE)","v":24},{"$f":"T7-HLOOKUP(Y7,Feuil1!$C$1:$BF$9,4,FALSE)","v":19},{"$f":"T7-HLOOKUP(Y7,Feuil1!$C$1:$BF$9,5,FALSE)","v":9},{"$f":"T7-HLOOKUP(Y7,Feuil1!$C$1:$BF$9,6,FALSE)","v":-8},{"$f":"T7-HLOOKUP(Y7,Feuil1!$C$1:$BF$9,7,FALSE)","v":-911},{"$f":"T7-HLOOKUP(Y7,Feuil1!$C$1:$BF$9,8,FALSE)","v":-911},{"$f":"T7-HLOOKUP(Y7,Feuil1!$C$1:$BF$9,9,FALSE)","v":-911},null,null,null,null,null,null,null,{"$f":"IF(AH7>=0,$AH$5,IF(AG7>=0,$AG$5,IF(AF7>=0,$AF$5,IF(AE7>=0,$AE$5,IF(AD7>=0,$AD$5,IF(AC7>=0,$AC$5,IF(AB7>=0,$AB$5,IF(AA7>=0,$AA$5,$AI$5))))))))","v":"EUR +"},{"$f":"2017-H7","v":41},null,{"$f":"IF(AQ7,VLOOKUP(AQ7,FEM!$AS$468:$AT$523,2))","v":1.149}]
["F",null,null,null,null,null,null,1977,63,null,null,30,null,null,30,40,null,null,40,70,105.5825318673264,"FRA +",0,"V2 F40",{"$f":"IF(AND(H8<1936),VLOOKUP(I8,Feuil1!$F$10:$O$24,9),IF(AND(H8>=1942,H8<1947),VLOOKUP(I8,Feuil1!$F$10:$O$24,9),IF(AND(H8>=1947,H8<1952),VLOOKUP(I8,Feuil1!$F$10:$O$24,8),IF(AND(H8>=1952,H8<1957),VLOOKUP(I8,Feuil1!$F$10:$O$24,7),IF(AND(H8>=1957,H8<1962),VLOOKUP(I8,Feuil1!$F$10:$O$24,6),IF(AND(H8>=1962,H8<1967),VLOOKUP(I8,Feuil1!$F$10:$O$24,5),IF(AND(H8>=1967,H8<1972),VLOOKUP(I8,Feuil1!$F$10:$O$24,4),IF(AND(H8>=1972,H8<1977),VLOOKUP(I8,Feuil1!$F$10:$O$24,3),IF(AND(H8>=1977,H8<1982),VLOOKUP(I8,Feuil1!$F$10:$O$24,2),VLOOKUP(I8,Feuil1!$F$10:$O$24,2))))))))))","v":"VF35-63"},null,{"$f":"T8-HLOOKUP(Y8,Feuil1!$C$1:$BF$9,2,FALSE)","v":70},{"$f":"T8-HLOOKUP(Y8,Feuil1!$C$1:$BF$9,3,FALSE)","v":5},{"$f":"T8-HLOOKUP(Y8,Feuil1!$C$1:$BF$9,4,FALSE)","v":0},{"$f":"T8-HLOOKUP(Y8,Feuil1!$C$1:$BF$9,5,FALSE)","v":-10},{"$f":"T8-HLOOKUP(Y8,Feuil1!$C$1:$BF$9,6,FALSE)","v":-30},{"$f":"T8-HLOOKUP(Y8,Feuil1!$C$1:$BF$9,7,FALSE)","v":-930},{"$f":"T8-HLOOKUP(Y8,Feuil1!$C$1:$BF$9,8,FALSE)","v":-930},{"$f":"T8-HLOOKUP(Y8,Feuil1!$C$1:$BF$9,9,FALSE)","v":-930},null,null,null,null,null,null,null,"FRA +",{"$f":"2017-H8","v":40},null,{"$f":"IF(AQ8,VLOOKUP(AQ8,FEM!$AS$468:$AT$523,2))","v":1.135}]
["F",null,null,null,null,null,null,1978,69,null,null,25,null,null,25,40,null,null,40,65,91.516967242175042,"N.CL.",65,"V1 F35",{"$f":"IF(AND(H9<1936),VLOOKUP(I9,Feuil1!$F$10:$O$24,9),IF(AND(H9>=1942,H9<1947),VLOOKUP(I9,Feuil1!$F$10:$O$24,9),IF(AND(H9>=1947,H9<1952),VLOOKUP(I9,Feuil1!$F$10:$O$24,8),IF(AND(H9>=1952,H9<1957),VLOOKUP(I9,Feuil1!$F$10:$O$24,7),IF(AND(H9>=1957,H9<1962),VLOOKUP(I9,Feuil1!$F$10:$O$24,6),IF(AND(H9>=1962,H9<1967),VLOOKUP(I9,Feuil1!$F$10:$O$24,5),IF(AND(H9>=1967,H9<1972),VLOOKUP(I9,Feuil1!$F$10:$O$24,4),IF(AND(H9>=1972,H9<1977),VLOOKUP(I9,Feuil1!$F$10:$O$24,3),IF(AND(H9>=1977,H9<1982),VLOOKUP(I9,Feuil1!$F$10:$O$24,2),VLOOKUP(I9,Feuil1!$F$10:$O$24,2))))))))))","v":"VF35-69"},null,{"$f":"T9-HLOOKUP(Y9,Feuil1!$C$1:$BF$9,2,FALSE)","v":65},{"$f":"T9-HLOOKUP(Y9,Feuil1!$C$1:$BF$9,3,FALSE)","v":-5},{"$f":"T9-HLOOKUP(Y9,Feuil1!$C$1:$BF$9,4,FALSE)","v":-10},{"$f":"T9-HLOOKUP(Y9,Feuil1!$C$1:$BF$9,5,FALSE)","v":-20},{"$f":"T9-HLOOKUP(Y9,Feuil1!$C$1:$BF$9,6,FALSE)","v":-37},{"$f":"T9-HLOOKUP(Y9,Feuil1!$C$1:$BF$9,7,FALSE)","v":-935},{"$f":"T9-HLOOKUP(Y9,Feuil1!$C$1:$BF$9,8,FALSE)","v":-935},{"$f":"T9-HLOOKUP(Y9,Feuil1!$C$1:$BF$9,9,FALSE)","v":-935},null,null,null,null,null,null,null,"N.CL.",39,null,{"$f":"IF(AQ9,VLOOKUP(AQ9,FEM!$AS$468:$AT$523,2))","v":1.1220000000000001}]
["F",null,null,null,null,null,null,1980,48,null,null,25,null,null,{"$f":"IF(I10=\"\",\"\",IF(MAXA(L10:N10)<=0,0,MAXA(L10:N10)))","v":25},40,null,null,40,65,116.77845335971031,"FRA +",5,"V1 F35",{"$f":"IF(AND(H10<1936),VLOOKUP(I10,Feuil1!$F$10:$O$24,9),IF(AND(H10>=1942,H10<1947),VLOOKUP(I10,Feuil1!$F$10:$O$24,9),IF(AND(H10>=1947,H10<1952),VLOOKUP(I10,Feuil1!$F$10:$O$24,8),IF(AND(H10>=1952,H10<1957),VLOOKUP(I10,Feuil1!$F$10:$O$24,7),IF(AND(H10>=1957,H10<1962),VLOOKUP(I10,Feuil1!$F$10:$O$24,6),IF(AND(H10>=1962,H10<1967),VLOOKUP(I10,Feuil1!$F$10:$O$24,5),IF(AND(H10>=1967,H10<1972),VLOOKUP(I10,Feuil1!$F$10:$O$24,4),IF(AND(H10>=1972,H10<1977),VLOOKUP(I10,Feuil1!$F$10:$O$24,3),IF(AND(H10>=1977,H10<1982),VLOOKUP(I10,Feuil1!$F$10:$O$24,2),VLOOKUP(I10,Feuil1!$F$10:$O$24,2))))))))))","v":"VF35-48"},null,{"$f":"T10-HLOOKUP(Y10,Feuil1!$C$1:$BF$9,2,FALSE)","v":65},{"$f":"T10-HLOOKUP(Y10,Feuil1!$C$1:$BF$9,3,FALSE)","v":10},{"$f":"T10-HLOOKUP(Y10,Feuil1!$C$1:$BF$9,4,FALSE)","v":5},{"$f":"T10-HLOOKUP(Y10,Feuil1!$C$1:$BF$9,5,FALSE)","v":-5},{"$f":"T10-HLOOKUP(Y10,Feuil1!$C$1:$BF$9,6,FALSE)","v":-17},{"$f":"T10-HLOOKUP(Y10,Feuil1!$C$1:$BF$9,7,FALSE)","v":-935},{"$f":"T10-HLOOKUP(Y10,Feuil1!$C$1:$BF$9,8,FALSE)","v":-935},{"$f":"T10-HLOOKUP(Y10,Feuil1!$C$1:$BF$9,9,FALSE)","v":-935},null,null,null,null,null,null,null,"FRA +",37,null,{"$f":"IF(AQ10,VLOOKUP(AQ10,FEM!$AS$468:$AT$523,2))","v":1.0960000000000001}]
["F",null,null,null,null,null,null,1981,53,null,null,25,null,null,25,40,null,null,40,65,106.18692964017175,"FRA +",3,"V1 F35",{"$f":"IF(AND(H11<1936),VLOOKUP(I11,Feuil1!$F$10:$O$24,9),IF(AND(H11>=1942,H11<1947),VLOOKUP(I11,Feuil1!$F$10:$O$24,9),IF(AND(H11>=1947,H11<1952),VLOOKUP(I11,Feuil1!$F$10:$O$24,8),IF(AND(H11>=1952,H11<1957),VLOOKUP(I11,Feuil1!$F$10:$O$24,7),IF(AND(H11>=1957,H11<1962),VLOOKUP(I11,Feuil1!$F$10:$O$24,6),IF(AND(H11>=1962,H11<1967),VLOOKUP(I11,Feuil1!$F$10:$O$24,5),IF(AND(H11>=1967,H11<1972),VLOOKUP(I11,Feuil1!$F$10:$O$24,4),IF(AND(H11>=1972,H11<1977),VLOOKUP(I11,Feuil1!$F$10:$O$24,3),IF(AND(H11>=1977,H11<1982),VLOOKUP(I11,Feuil1!$F$10:$O$24,2),VLOOKUP(I11,Feuil1!$F$10:$O$24,2))))))))))","v":"VF35-53"},null,{"$f":"T11-HLOOKUP(Y11,Feuil1!$C$1:$BF$9,2,FALSE)","v":65},{"$f":"T11-HLOOKUP(Y11,Feuil1!$C$1:$BF$9,3,FALSE)","v":5},{"$f":"T11-HLOOKUP(Y11,Feuil1!$C$1:$BF$9,4,FALSE)","v":3},{"$f":"T11-HLOOKUP(Y11,Feuil1!$C$1:$BF$9,5,FALSE)","v":-7},{"$f":"T11-HLOOKUP(Y11,Feuil1!$C$1:$BF$9,6,FALSE)","v":-25},{"$f":"T11-HLOOKUP(Y11,Feuil1!$C$1:$BF$9,7,FALSE)","v":-935},{"$f":"T11-HLOOKUP(Y11,Feuil1!$C$1:$BF$9,8,FALSE)","v":-935},{"$f":"T11-HLOOKUP(Y11,Feuil1!$C$1:$BF$9,9,FALSE)","v":-935},null,null,null,null,null,null,null,"FRA +",36,null,{"$f":"IF(AQ11,VLOOKUP(AQ11,FEM!$AS$468:$AT$523,2))","v":1.083}]
["F",null,null,null,null,null,null,1972,58,null,null,null,null,null,0,null,null,null,0,0,0,"N.CL.",0,"V3 F45",{"$f":"IF(AND(H12<1936),VLOOKUP(I12,Feuil1!$F$10:$O$24,9),IF(AND(H12>=1942,H12<1947),VLOOKUP(I12,Feuil1!$F$10:$O$24,9),IF(AND(H12>=1947,H12<1952),VLOOKUP(I12,Feuil1!$F$10:$O$24,8),IF(AND(H12>=1952,H12<1957),VLOOKUP(I12,Feuil1!$F$10:$O$24,7),IF(AND(H12>=1957,H12<1962),VLOOKUP(I12,Feuil1!$F$10:$O$24,6),IF(AND(H12>=1962,H12<1967),VLOOKUP(I12,Feuil1!$F$10:$O$24,5),IF(AND(H12>=1967,H12<1972),VLOOKUP(I12,Feuil1!$F$10:$O$24,4),IF(AND(H12>=1972,H12<1977),VLOOKUP(I12,Feuil1!$F$10:$O$24,3),IF(AND(H12>=1977,H12<1982),VLOOKUP(I12,Feuil1!$F$10:$O$24,2),VLOOKUP(I12,Feuil1!$F$10:$O$24,2))))))))))","v":"VF40-58"},null,{"$f":"T12-HLOOKUP(Y12,Feuil1!$C$1:$BF$9,2,FALSE)","v":0},{"$f":"T12-HLOOKUP(Y12,Feuil1!$C$1:$BF$9,3,FALSE)","v":-60},{"$f":"T12-HLOOKUP(Y12,Feuil1!$C$1:$BF$9,4,FALSE)","v":-62},{"$f":"T12-HLOOKUP(Y12,Feuil1!$C$1:$BF$9,5,FALSE)","v":-72},{"$f":"T12-HLOOKUP(Y12,Feuil1!$C$1:$BF$9,6,FALSE)","v":-90},{"$f":"T12-HLOOKUP(Y12,Feuil1!$C$1:$BF$9,7,FALSE)","v":-1000},{"$f":"T12-HLOOKUP(Y12,Feuil1!$C$1:$BF$9,8,FALSE)","v":-1000},{"$f":"T12-HLOOKUP(Y12,Feuil1!$C$1:$BF$9,9,FALSE)","v":-1000},null,null,null,null,null,null,null,"N.CL.",45,null,{"$f":"IF(AQ12,VLOOKUP(AQ12,FEM!$AS$468:$AT$523,2))","v":1.2030000000000001}]
["F",null,null,null,null,null,null,1973,63,null,null,null,null,null,0,null,null,null,0,0,0,"N.CL.",0,"V2 F40",{"$f":"IF(AND(H13<1936),VLOOKUP(I13,Feuil1!$F$10:$O$24,9),IF(AND(H13>=1942,H13<1947),VLOOKUP(I13,Feuil1!$F$10:$O$24,9),IF(AND(H13>=1947,H13<1952),VLOOKUP(I13,Feuil1!$F$10:$O$24,8),IF(AND(H13>=1952,H13<1957),VLOOKUP(I13,Feuil1!$F$10:$O$24,7),IF(AND(H13>=1957,H13<1962),VLOOKUP(I13,Feuil1!$F$10:$O$24,6),IF(AND(H13>=1962,H13<1967),VLOOKUP(I13,Feuil1!$F$10:$O$24,5),IF(AND(H13>=1967,H13<1972),VLOOKUP(I13,Feuil1!$F$10:$O$24,4),IF(AND(H13>=1972,H13<1977),VLOOKUP(I13,Feuil1!$F$10:$O$24,3),IF(AND(H13>=1977,H13<1982),VLOOKUP(I13,Feuil1!$F$10:$O$24,2),VLOOKUP(I13,Feuil1!$F$10:$O$24,2))))))))))","v":"VF40-63"},null,{"$f":"T13-HLOOKUP(Y13,Feuil1!$C$1:$BF$9,2,FALSE)","v":0},{"$f":"T13-HLOOKUP(Y13,Feuil1!$C$1:$BF$9,3,FALSE)","v":-62},{"$f":"T13-HLOOKUP(Y13,Feuil1!$C$1:$BF$9,4,FALSE)","v":-65},{"$f":"T13-HLOOKUP(Y13,Feuil1!$C$1:$BF$9,5,FALSE)","v":-75},{"$f":"T13-HLOOKUP(Y13,Feuil1!$C$1:$BF$9,6,FALSE)","v":-95},{"$f":"T13-HLOOKUP(Y13,Feuil1!$C$1:$BF$9,7,FALSE)","v":-1000},{"$f":"T13-HLOOKUP(Y13,Feuil1!$C$1:$BF$9,8,FALSE)","v":-1000},{"$f":"T13-HLOOKUP(Y13,Feuil1!$C$1:$BF$9,9,FALSE)","v":-1000},null,null,null,null,null,null,null,"N.CL.",44,null,{"$f":"IF(AQ13,VLOOKUP(AQ13,FEM!$AS$468:$AT$523,2))","v":1.1890000000000001}]
["F",null,null,null,null,null,null,1974,69,null,null,null,null,null,0,null,null,null,0,0,0,"N.CL.",0,"V2 F40",{"$f":"IF(AND(H14<1936),VLOOKUP(I14,Feuil1!$F$10:$O$24,9),IF(AND(H14>=1942,H14<1947),VLOOKUP(I14,Feuil1!$F$10:$O$24,9),IF(AND(H14>=1947,H14<1952),VLOOKUP(I14,Feuil1!$F$10:$O$24,8),IF(AND(H14>=1952,H14<1957),VLOOKUP(I14,Feuil1!$F$10:$O$24,7),IF(AND(H14>=1957,H14<1962),VLOOKUP(I14,Feuil1!$F$10:$O$24,6),IF(AND(H14>=1962,H14<1967),VLOOKUP(I14,Feuil1!$F$10:$O$24,5),IF(AND(H14>=1967,H14<1972),VLOOKUP(I14,Feuil1!$F$10:$O$24,4),IF(AND(H14>=1972,H14<1977),VLOOKUP(I14,Feuil1!$F$10:$O$24,3),IF(AND(H14>=1977,H14<1982),VLOOKUP(I14,Feuil1!$F$10:$O$24,2),VLOOKUP(I14,Feuil1!$F$10:$O$24,2))))))))))","v":"VF40-69"},null,{"$f":"T14-HLOOKUP(Y14,Feuil1!$C$1:$BF$9,2,FALSE)","v":0},{"$f":"T14-HLOOKUP(Y14,Feuil1!$C$1:$BF$9,3,FALSE)","v":-65},{"$f":"T14-HLOOKUP(Y14,Feuil1!$C$1:$BF$9,4,FALSE)","v":-70},{"$f":"T14-HLOOKUP(Y14,Feuil1!$C$1:$BF$9,5,FALSE)","v":-80},{"$f":"T14-HLOOKUP(Y14,Feuil1!$C$1:$BF$9,6,FALSE)","v":-97},{"$f":"T14-HLOOKUP(Y14,Feuil1!$C$1:$BF$9,7,FALSE)","v":-1000},{"$f":"T14-HLOOKUP(Y14,Feuil1!$C$1:$BF$9,8,FALSE)","v":-1000},{"$f":"T14-HLOOKUP(Y14,Feuil1!$C$1:$BF$9,9,FALSE)","v":-1000},null,null,null,null,null,null,null,"N.CL.",43,null,{"$f":"IF(AQ14,VLOOKUP(AQ14,FEM!$AS$468:$AT$523,2))","v":1.1759999999999999}]
["F",null,null,null,null,null,null,1975,75,null,null,null,null,null,0,null,null,null,0,0,0,"N.CL.",0,"V2 F40",{"$f":"IF(AND(H15<1936),VLOOKUP(I15,Feuil1!$F$10:$O$24,9),IF(AND(H15>=1942,H15<1947),VLOOKUP(I15,Feuil1!$F$10:$O$24,9),IF(AND(H15>=1947,H15<1952),VLOOKUP(I15,Feuil1!$F$10:$O$24,8),IF(AND(H15>=1952,H15<1957),VLOOKUP(I15,Feuil1!$F$10:$O$24,7),IF(AND(H15>=1957,H15<1962),VLOOKUP(I15,Feuil1!$F$10:$O$24,6),IF(AND(H15>=1962,H15<1967),VLOOKUP(I15,Feuil1!$F$10:$O$24,5),IF(AND(H15>=1967,H15<1972),VLOOKUP(I15,Feuil1!$F$10:$O$24,4),IF(AND(H15>=1972,H15<1977),VLOOKUP(I15,Feuil1!$F$10:$O$24,3),IF(AND(H15>=1977,H15<1982),VLOOKUP(I15,Feuil1!$F$10:$O$24,2),VLOOKUP(I15,Feuil1!$F$10:$O$24,2))))))))))","v":"VF40-75"},null,{"$f":"T15-HLOOKUP(Y15,Feuil1!$C$1:$BF$9,2,FALSE)","v":0},{"$f":"T15-HLOOKUP(Y15,Feuil1!$C$1:$BF$9,3,FALSE)","v":-67},{"$f":"T15-HLOOKUP(Y15,Feuil1!$C$1:$BF$9,4,FALSE)","v":-72},{"$f":"T15-HLOOKUP(Y15,Feuil1!$C$1:$BF$9,5,FALSE)","v":-82},{"$f":"T15-HLOOKUP(Y15,Feuil1!$C$1:$BF$9,6,FALSE)","v":-100},{"$f":"T15-HLOOKUP(Y15,Feuil1!$C$1:$BF$9,7,FALSE)","v":-1000},{"$f":"T15-HLOOKUP(Y15,Feuil1!$C$1:$BF$9,8,FALSE)","v":-1000},{"$f":"T15-HLOOKUP(Y15,Feuil1!$C$1:$BF$9,9,FALSE)","v":-1000},null,null,null,null,null,null,null,"N.CL.",42,null,{"$f":"IF(AQ15,VLOOKUP(AQ15,FEM!$AS$468:$AT$523,2))","v":1.1619999999999999}]
{"$rows_left_out":509}
{"sheet":"Feuil1","index":1,"n_rows":24,"n_cols":58,"rows_kept":24,"cut":false,"hidden":true,"merged":[]}
[null,null,"VF35-48","VF35-53","VF35-58","VF35-63","VF35-69","VF35-75","VF35+75","VF40-48","VF40-53","VF40-58","VF40-63","VF40-69","VF40-75","VF40+75","VF45-48","VF45-53","VF45-58","VF45-63","VF45-69","VF45-75","VF45+75","VF50-48","VF50-53","VF50-58","VF50-63","VF50-69","VF50-75","VF50+75","VF55-48","VF55-53","VF55-58","VF55-63","VF55-69","VF55-75","VF55+75","VF60-48","VF60-53","VF60-58","VF60-63","VF60-69","VF60-75","VF60+75","VF65-48","VF65-53","VF65-58","VF65-63","VF65-69","VF65-75","VF65+75","VF70+-48","VF70+-53","VF70+-58","VF70+-63","VF70+-69","VF70+-75","VF70++75"]
[null,null,null,null,null,null,null,null,null,null,null,null,null,null,null,null,null,null,null,null,null,null,null,null,null,null,null,null,null,null,null,null,null,null,null,null,null,null,null,null,null,null,null,null,null,null,null,null,null,null,null," "]
[null,"REGION",55,60,62,65,70,72,80,52,55,60,62,65,67,75,50,52,55,60,62,65,72,45,47,52,55,57,60,67,42,45,47,50,52,55,57,40,42,45,47,50,52,55,38,40,42,45,48,50,52,36,38,40,43,45,48,50]
[null,"France",60,62,67,70,75,77,85,55,60,62,65,70,72,80,52,55,60,62,65,67,75,50,52,55,60,62,65,72,45,47,52,55,57,60,67,42,45,47,50,52,55,57,40,42,45,47,50,52,55,38,40,42,45,48,50,52]
[null,"EUROPE",70,72,77,80,85,87,95,65,70,72,75,80,82,90,62,65,70,72,75,77,85,60,62,65,70,72,75,82,55,57,62,65,67,70,77,52,55,57,60,62,65,67,50,52,55,57,60,62,65,45,47,49,52,55,57,60]
[null,"MONDE",82,90,95,100,102,107,112,80,85,90,95,97,100,105,72,77,82,85,90,92,97,67,72,75,77,82,85,90,60,65,67,70,75,77,82,55,57,62,65,67,70,72,50,52,55,57,60,62,65,46,48,50,53,56,58,61]
[null,"INTERNATIONAL B",1000,1000,1000,1000,1000,1000,1000,1000,1000,1000,1000,1000,1000,1000,1000,1000,1000,1000,1000,1000,1000,1000,1000,1000,1000,1000,1000,1000,1000,1000,1000,1000,1000,1000,1000,1000,1000,1000,1000,1000,1000,1000,1000,1000,1000,1000,1000,1000,1000,1000,1000,1000,1000,1000,1000,1000]
[null,"INTERNATIONAL A",1000,1000,1000,1000,1000,1000,1000,1000,1000,1000,1000,1000,1000,1000,1000,1000,1000,1000,1000,1000,1000,1000,1000,1000,1000,1000,1000,1000,1000,1000,1000,1000,1000,1000,1000,1000,1000,1000,1000,1000,1000,1000,1000,1000,1000,1000,1000,1000,1000,1000,1000,1000,1000,1000,1000,1000]
[null,"OLYMPIQUE",1000,1000,1000,1000,1000,1000,1000,1000,1000,1000,1000,1000,1000,1000,1000,1000,1000,1000,1000,1000,1000,1000,1000,1000,1000,1000,1000,1000,1000,1000,1000,1000,1000,1000,1000,1000,1000,1000,1000,1000,1000,1000,1000,1000,1000,1000,1000,1000,1000,1000,1000,1000,1000,1000,1000,1000]
[null,null,null,null,null,null,"VF35","VF40","VF45","VF50","VF55","VF60","VF65","VF70+"]
[null,null,null,null,null,20.010000000000002,"VF35-48","VF40-48","VF45-48","VF50-48","VF55-48","VF60-48","VF65-48","VF70+-48"]
[null,null,null,null,null,30.01,"VF35-48","VF40-48","VF45-48","VF50-48","VF55-48","VF60-48","VF65-48","VF70+-48"]
[null,null,null,null,null,35.01,"VF35-48","VF40-48","VF45-48","VF50-48","VF55-48","VF60-48","VF65-48","VF70+-48"]
[null,null,null,null,null,36.01,"VF35-48","VF40-48","VF45-48","VF50-48","VF55-48","VF60-48","VF65-48","VF70+-48"]
[null,null,null,null,null,40.01,"VF35-48","VF40-48","VF45-48","VF50-48","VF55-48","VF60-48","VF65-48","VF70+-48"]
{"$rows_left_out":10}
{"sheet":"Feuil2","index":2,"n_rows":85,"n_cols":83,"rows_kept":85,"cut":false,"hidden":true,"merged":[]}
[null,null,"VH35-56","VH35-62","VH35-69","VH35-77","VH35-85","VH35-94","VH35-105","VH35+105","VH40-56","VH40-62","VH40-69","VH40-77","VH40-85","VH40-94","VH40-105","VH40+105","VH45-56","VH45-62","VH45-69","VH45-77","VH45-85","VH45-94","VH45-105","VH45+105","VH50-56","VH50-62","VH50-69","VH50-77","VH50-85","VH50-94","VH50-105","VH50+105","VH55-56","VH55-62","VH55-69","VH55-77","VH55-85","VH55-94","VH55-105","VH55+105","VH60-56","VH60-62","VH60-69","VH60-77","VH60-85","VH60-94","VH60-105","VH60+105","VH65-56","VH65-62","VH65-69","VH65-77","VH65-85","VH65-94","VH65-105","VH65+105","VH70-56","VH70-62","VH70-69","VH70-77","VH70-85","VH70-94","VH70-105","VH70+105","VH75-56","VH75-62","VH75-69","VH75-77","VH75-85","VH75-94","VH75-105","VH75+105","VH80+-56","VH80+-62","VH80+-69","VH80+-77","VH80+-85","VH80+-94","VH80+-105","VH80++105"]
[null,null,null,null,null,null,null,null,null,null,null,null,null,null,null,null,null,null,null,null,null,null,null,null,null,null,null,null,null,null,null,null,null,null,null,null,null,null,null,null,null,null,null,null,null,null,null,null,null,null,null," "]
[null,"REGION",117,132,147,162,172,182,190,197,110,125,140,152,162,172,180,187,105,117,130,145,155,162,170,177,95,107,120,130,140,147,155,162,82,92,105,115,122,130,137,145,72,82,92,102,110,117,122,130,60,70,77,87,92,100,102,107,47,55,62,70,75,80,82,87,42,47,55,62,67,70,75,80,40,45,50,60,63,64,69,70,"REGIONAL"]
[null,"France",127,142,157,172,182,192,200,202,120,135,150,162,172,18,190,197,115,127,140,155,165,172,180,187,105,117,130,140,150,157,165,172,92,102,115,125,132,140,147,155,82,92,102,112,120,127,132,140,70,80,87,97,102,110,112,117,57,65,72,80,85,90,92,97,52,57,65,72,77,80,85,90,50,55,58,62,64,65,70,75,"France"]
[null,"EUROPE",137,152,167,182,192,202,210,217,130,145,160,172,182,192,200,207,125,137,150,165,175,182,190,197,115,127,140,150,160,167,175,182,102,112,125,135,142,150,157,165,92,102,112,122,130,137,142,150,80,90,97,107,112,120,122,127,67,75,82,90,95,100,102,107,62,67,75,82,87,90,95,100,54,56,59,64,69,71,76,79,"EUROPE"]
[null,"MONDE",155,172,187,202,215,227,237,245,147,162,177,192,205,215,225,232,140,155,170,185,195,205,212,222,130,142,157,170,180,190,197,205,115,127,140,152,162,170,177,182,105,117,127,137,147,155,160,167,92,102,112,120,127,135,140,145,75,82,90,97,102,107,112,117,67,75,82,87,95,97,102,107,55,57,60,65,70,72,77,80,"MONDE"]
[null,"INTERNATIONAL B",1000,1000,1000,1000,1000,1000,1000,1000,1000,1000,1000,1000,1000,1000,1000,1000,1000,1000,1000,1000,1000,1000,1000,1000,1000,1000,1000,1000,1000,1000,1000,1000,1000,1000,1000,1000,1000,1000,1000,1000,1000,1000,1000,1000,1000,1000,1000,1000,1000,1000,1000,1000,1000,1000,1000,1000,1000,1000,1000,1000,1000,1000,1000,1000,1000,1000,1000,1000,1000,1000,1000,1000,1000,1000,1000,1000,1000,1000,1000,1000]
[null,"INTERNATIONAL A",1000,1000,1000,1000,1000,1000,1000,1000,1000,1000,1000,1000,1000,1000,1000,1000,1000,1000,1000,1000,1000,1000,1000,1000,1000,1000,1000,1000,1000,1000,1000,1000,1000,1000,1000,1000,1000,1000,1000,1000,1000,1000,1000,1000,1000,1000,1000,1000,1000,1000,1000,1000,1000,1000,1000,1000,1000,1000,1000,1000,1000,1000,1000,1000,1000,1000,1000,1000,1000,1000,1000,1000,1000,1000,1000,1000,1000,1000,1000,1000]
[null,"OLYMPIQUE",1000,1000,1000,1000,1000,1000,1000,1000,1000,1000,1000,1000,1000,1000,1000,1000,1000,1000,1000,1000,1000,1000,1000,1000,1000,1000,1000,1000,1000,1000,1000,1000,1000,1000,1000,1000,1000,1000,1000,1000,1000,1000,1000,1000,1000,1000,1000,1000,1000,1000,1000,1000,1000,1000,1000,1000,1000,1000,1000,1000,1000,1000,1000,1000,1000,1000,1000,1000,1000,1000,1000,1000,1000,1000,1000,1000,1000,1000,1000,1000]
[null,null,null,null,null,null,"VH35","VH40","VH45","VH50","VH55","VH60","VH65","VH70","VH75","VH80+"]
[null,null,null,null,null,20.010000000000002,"VH35-56","VH40-56","VH45-56","VH50-56","VH55-56","VH60-56","VH65-56","VH70-56","VH75-56","VH80+-56"]
[null,null,null,null,null,34.01,"VH35-56","VH40-56","VH45-56","VH50-56","VH55-56","VH60-56","VH65-56","VH70-56","VH75-56","VH80+-56"]
[null,null,null,null,null,38.01,"VH35-56","VH40-56","VH45-56","VH50-56","VH55-56","VH60-56","VH65-56","VH70-56","VH75-56","VH80+-56"]
[null,null,null,null,null,40.01,"VH35-56","VH40-56","VH45-56","VH50-56","VH55-56","VH60-56","VH65-56","VH70-56","VH75-56","VH80+-56"]
[null,null,null,null,null,45.01,"VH35-56","VH40-56","VH45-56","VH50-56","VH55-56","VH60-56","VH65-56","VH70-56","VH75-56","VH80+-56"]
{"$rows_left_out":71}
{"sheet":"Feuil3","index":3,"n_rows":0,"n_cols":0,"rows_kept":0,"cut":false,"hidden":true,"merged":[]}