{"text_format":"1","workbook":"xlsx","n_sheets":4,"sheets":["FEM","Feuil1","Feuil2","Feuil3"],"not_rendered":{"charts":0,"images":1,"macros":1,"external_links":0,"defined_names":2,"comments":1,"pivot_tables":0},"unopened":[],"bounds":{"document_bytes":16777216,"sheet_cells":100000,"rows_first":2000,"rows_last":500,"rows_between":2000,"halvings":0,"cell_chars":16384,"cell_head_chars":4096},"cells_cut":0,"cells_raw":0,"read":"whole","date_system":"1900"}

{"sheet":"FEM","index":0,"n_rows":523,"n_cols":46,"rows_kept":523,"cut":false,"hidden":false,"merged":[[35,1,35,4],[35,5,35,6],[35,10,35,13],[35,15,35,18],[35,21,35,23],[33,1,33,4],[33,5,33,6],[33,10,33,15],[34,1,34,4],[34,5,34,6],[31,1,31,4],[31,5,31,6],[31,10,31,15],[31,19,31,23],[32,1,32,4],[32,5,32,6],[32,8,32,9],[32,10,32,15],[32,17,32,18],[0,18,0,21],[4,21,4,22],[1,6,1,10],[1,11,1,13],[1,14,1,17],[1,18,1,19],[1,21,1,22],[3,7,3,13],[3,18,3,22]]}
[null,null,null,null,null,"EPREUVE :"," ",null,null,null,null,null,null,null,null,null,"DATE :",null," "]
[null,null,null,null,null,"LIEU :"," ",null,null,null,null,"REGION :",null,null,null,null,null,null,null,null,null," "]
[]
[null,null,null,null,null," "," "," ",null,null,null,null,null,null,null,null,null,null," "]
["SEXE","ZONE","REG.","Cl.","LICENCE","NOMS","Prénoms","AN","POIDS","CLUB","NAT",1,2,3,"ARR",1,2,3,"EP-J","Total","IWF SMM","SERIE",null,null,"Catég",null,"N.CL.","REG +","FRA +","EUR +","MON +","INTB +","INTA +","OLY +","NCL"]
["F",null,null,null,null,null,null,1975,69,null,null,65,null,null,{"$f":"IF(I6=\"\",\"\",IF(MAXA(L6:N6)<=0,0,MAXA(L6:N6)))","v":65},85,null,null,{"$f":"IF(I6=\"\",\"\",IF(MAXA(P6:R6)<=0,0,MAXA(P6:R6)))","v":85},{"$f":"IF(I6=\"\",\"\",IF(OR(O6=0,S6=0),0,O6+S6))","v":150},{"$f":"IF(I6=\"\",\"\",IF(A6=\"H\",10^(0.794358141*LOG(I6/174.393)^2)*T6*AS6,IF(A6=\"F\",10^(0.89726074 * LOG(I6/148.026)^2)*T6*AS6,\"\")))","v":218.72216358578237},{"$f":"IF(I6=\"\",\"\",AP6)","v":"MON +"},{"$f":"IF(I6=\"\",\"\",IF(AH6>=0,AH6,IF(AG6>=0,AG6,IF(AF6>=0,AF6,IF(AE6>=0,AE6,IF(AD6>=0,AD6,IF(AC6>=0,AC6,IF(AB6>=0,AB6,AA6))))))))","v":53},{"$f":"IF(AQ6<95,IF(AQ6<=90,VLOOKUP(AQ6,$AQ$467:$AR$522,2)))","v":"V2 F40"},{"$f":"IF(AND(H6<1936),VLOOKUP(I6,Feuil1!$F$10:$O$24,9),IF(AND(H6>=1942,H6<1947),VLOOKUP(I6,Feuil1!$F$10:$O$24,9),IF(AND(H6>=1947,H6<1952),VLOOKUP(I6,Feuil1!$F$10:$O$24,8),IF(AND(H6>=1952,H6<1957),VLOOKUP(I6,Feuil1!$F$10:$O$24,7),IF(AND(H6>=1957,H6<1962),VLOOKUP(I6,Feuil1!$F$10:$O$24,6),IF(AND(H6>=1962,H6<1967),VLOOKUP(I6,Feuil1!$F$10:$O$24,5),IF(AND(H6>=1967,H6<1972),VLOOKUP(I6,Feuil1!$F$10:$O$24,4),IF(AND(H6>=1972,H6<1977),VLOOKUP(I6,Feuil1!$F$10:$O$24,3),IF(AND(H6>=1977,H6<1982),VLOOKUP(I6,Feuil1!$F$10:$O$24,2),VLOOKUP(I6,Feuil1!$F$10:$O$24,2))))))))))","v":"VF40-69"},null,{"$f":"T6-HLOOKUP(Y6,Feuil1!$C$1:$BF$9,2,FALSE)","v":150},{"$f":"T6-HLOOKUP(Y6,Feuil1!$C$1:$BF$9,3,FALSE)","v":85},{"$f":"T6-HLOOKUP(Y6,Feuil1!$C$1:$BF$9,4,FALSE)","v":80},{"$f":"T6-HLOOKUP(Y6,Feuil1!$C$1:$BF$9,5,FALSE)","v":70},{"$f":"T6-HLOOKUP(Y6,Feuil1!$C$1:$BF$9,6,FALSE)","v":53},{"$f":"T6-HLOOKUP(Y6,Feuil1!$C$1:$BF$9,7,FALSE)","v":-850},{"$f":"T6-HLOOKUP(Y6,Feuil1!$C$1:$BF$9,8,FALSE)","v":-850},{"$f":"T6-HLOOKUP(Y6,Feuil1!$C$1:$BF$9,9,FALSE)","v":-850},null,null,null,null,null,null,null,{"$f":"IF(AH6>=0,$AH$5,IF(AG6>=0,$AG$5,IF(AF6>=0,$AF$5,IF(AE6>=0,$AE$5,IF(AD6>=0,$AD$5,IF(AC6>=0,$AC$5,IF(AB6>=0,$AB$5,IF(AA6>=0,$AA$5,$AI$5))))))))","v":"MON +"},{"$f":"2017-H6","v":42},null,{"$f":"IF(AQ6,VLOOKUP(AQ6,FEM!$AS$468:$AT$523,2))","v":1.1619999999999999}]
["F",null,null,null,null,null,null,1976,69,null,null,39,null,null,{"$f":"IF(I7=\"\",\"\",IF(MAXA(L7:N7)<=0,0,MAXA(L7:N7)))","v":39},50,null,null,{"$f":"IF(I7=\"\",\"\",IF(MAXA(P7:R7)<=0,0,MAXA(P7:R7)))","v":50},{"$f":"IF(I7=\"\",\"\",IF(OR(O7=0,S7=0),0,O7+S7))","v":89},{"$f":"IF(I7=\"\",\"\",IF(A7=\"H\",10^(0.794358141*LOG(I7/174.393)^2)*T7*AS7,IF(A7=\"F\",10^(0.89726074 * LOG(I7/148.026)^2)*T7*AS7,\"\")))","v":128.32327693887373},{"$f":"IF(I7=\"\",\"\",AP7)","v":"EUR +"},{"$f":"IF(I7=\"\",\"\",IF(AH7>=0,AH7,IF(AG7>=0,AG7,IF(AF7>=0,AF7,IF(AE7>=0,AE7,IF(AD7>=0,AD7,IF(AC7>=0,AC7,IF(AB7>=0,AB7,AA7))))))))","v":9},{"$f":"IF(AQ7<95,IF(AQ7<=90,VLOOKUP(AQ7,$AQ$467:$AR$522,2)))","v":"V2 F40"},{"$f":"IF(AND(H7<1936),VLOOKUP(I7,Feuil1!$F$10:$O$24,9),IF(AND(H7>=1942,H7<1947),VLOOKUP(I7,Feuil1!$F$10:$O$24,9),IF(AND(H7>=1947,H7<1952),VLOOKUP(I7,Feuil1!$F$10:$O$24,8),IF(AND(H7>=1952,H7<1957),VLOOKUP(I7,Feuil1!$F$10:$O$24,7),IF(AND(H7>=1957,H7<1962),VLOOKUP(I7,Feuil1!$F$10:$O$24,6),IF(AND(H7>=1962,H7<1967),VLOOKUP(I7,Feuil1!$F$10:$O$24,5),IF(AND(H7>=1967,H7<1972),VLOOKUP(I7,Feuil1!$F$10:$O$24,4),IF(AND(H7>=1972,H7<1977),VLOOKUP(I7,Feuil1!$F$10:$O$24,3),IF(AND(H7>=1977,H7<1982),VLOOKUP(I7,Feuil1!$F$10:$O$24,2),VLOOKUP(I7,Feuil1!$F$10:$O$24,2))))))))))","v":"VF40-69"},null,{"$f":"T7-HLOOKUP(Y7,Feuil1!$C$1:$BF$9,2,FALSE)","v":89},{"$f":"T7-HLOOKUP(Y7,Feuil1!$C$1:$BF$9,3,FALSE)","v":24},{"$f":"T7-HLOOKUP(Y7,Feuil1!$C$1:$BF$9,4,FALSE)","v":19},{"$f":"T7-HLOOKUP(Y7,Feuil1!$C$1:$BF$9,5,FALSE)","v":9},{"$f":"T7-HLOOKUP(Y7,Feuil1!$C$1:$BF$9,6,FALSE)","v":-8},{"$f":"T7-HLOOKUP(Y7,Feuil1!$C$1:$BF$9,7,FALSE)","v":-911},{"$f":"T7-HLOOKUP(Y7,Feuil1!$C$1:$BF$9,8,FALSE)","v":-911},{"$f":"T7-HLOOKUP(Y7,Feuil1!$C$1:$BF$9,9,FALSE)","v":-911},null,null,null,null,null,null,null,{"$f":"IF(AH7>=0,$AH$5,IF(AG7>=0,$AG$5,IF(AF7>=0,$AF$5,IF(AE7>=0,$AE$5,IF(AD7>=0,$AD$5,IF(AC7>=0,$AC$5,IF(AB7>=0,$AB$5,IF(AA7>=0,$AA$5,$AI$5))))))))","v":"EUR +"},{"$f":"2017-H7","v":41},null,{"$f":"IF(AQ7,VLOOKUP(AQ7,FEM!$AS$468:$AT$523,2))","v":1.149}]
["F",null,null,null,null,null,null,1977,63,null,null,30,null,null,30,40,null,null,40,70,105.5825318673264,"FRA +",0,"V2 F40",{"$f":"IF(AND(H8<1936),VLOOKUP(I8,Feuil1!$F$10:$O$24,9),IF(AND(H8>=1942,H8<1947),VLOOKUP(I8,Feuil1!$F$10:$O$24,9),IF(AND(H8>=1947,H8<1952),VLOOKUP(I8,Feuil1!$F$10:$O$24,8),IF(AND(H8>=1952,H8<1957),VLOOKUP(I8,Feuil1!$F$10:$O$24,7),IF(AND(H8>=1957,H8<1962),VLOOKUP(I8,Feuil1!$F$10:$O$24,6),IF(AND(H8>=1962,H8<1967),VLOOKUP(I8,Feuil1!$F$10:$O$24,5),IF(AND(H8>=1967,H8<1972),VLOOKUP(I8,Feuil1!$F$10:$O$24,4),IF(AND(H8>=1972,H8<1977),VLOOKUP(I8,Feuil1!$F$10:$O$24,3),IF(AND(H8>=1977,H8<1982),VLOOKUP(I8,Feuil1!$F$10:$O$24,2),VLOOKUP(I8,Feuil1!$F$10:$O$24,2))))))))))","v":"VF35-63"},null,{"$f":"T8-HLOOKUP(Y8,Feuil1!$C$1:$BF$9,2,FALSE)","v":70},{"$f":"T8-HLOOKUP(Y8,Feuil1!$C$1:$BF$9,3,FALSE)","v":5},{"$f":"T8-HLOOKUP(Y8,Feuil1!$C$1:$BF$9,4,FALSE)","v":0},{"$f":"T8-HLOOKUP(Y8,Feuil1!$C$1:$BF$9,5,FALSE)","v":-10},{"$f":"T8-HLOOKUP(Y8,Feuil1!$C$1:$BF$9,6,FALSE)","v":-30},{"$f":"T8-HLOOKUP(Y8,Feuil1!$C$1:$BF$9,7,FALSE)","v":-930},{"$f":"T8-HLOOKUP(Y8,Feuil1!$C$1:$BF$9,8,FALSE)","v":-930},{"$f":"T8-HLOOKUP(Y8,Feuil1!$C$1:$BF$9,9,FALSE)","v":-930},null,null,null,null,null,null,null,"FRA +",{"$f":"2017-H8","v":40},null,{"$f":"IF(AQ8,VLOOKUP(AQ8,FEM!$AS$468:$AT$523,2))","v":1.135}]
["F",null,null,null,null,null,null,1978,69,null,null,25,null,null,25,40,null,null,40,65,91.516967242175042,"N.CL.",65,"V1 F35",{"$f":"IF(AND(H9<1936),VLOOKUP(I9,Feuil1!$F$10:$O$24,9),IF(AND(H9>=1942,H9<1947),VLOOKUP(I9,Feuil1!$F$10:$O$24,9),IF(AND(H9>=1947,H9<1952),VLOOKUP(I9,Feuil1!$F$10:$O$24,8),IF(AND(H9>=1952,H9<1957),VLOOKUP(I9,Feuil1!$F$10:$O$24,7),IF(AND(H9>=1957,H9<1962),VLOOKUP(I9,Feuil1!$F$10:$O$24,6),IF(AND(H9>=1962,H9<1967),VLOOKUP(I9,Feuil1!$F$10:$O$24,5),IF(AND(H9>=1967,H9<1972),VLOOKUP(I9,Feuil1!$F$10:$O$24,4),IF(AND(H9>=1972,H9<1977),VLOOKUP(I9,Feuil1!$F$10:$O$24,3),IF(AND(H9>=1977,H9<1982),VLOOKUP(I9,Feuil1!$F$10:$O$24,2),VLOOKUP(I9,Feuil1!$F$10:$O$24,2))))))))))","v":"VF35-69"},null,{"$f":"T9-HLOOKUP(Y9,Feuil1!$C$1:$BF$9,2,FALSE)","v":65},{"$f":"T9-HLOOKUP(Y9,Feuil1!$C$1:$BF$9,3,FALSE)","v":-5},{"$f":"T9-HLOOKUP(Y9,Feuil1!$C$1:$BF$9,4,FALSE)","v":-10},{"$f":"T9-HLOOKUP(Y9,Feuil1!$C$1:$BF$9,5,FALSE)","v":-20},{"$f":"T9-HLOOKUP(Y9,Feuil1!$C$1:$BF$9,6,FALSE)","v":-37},{"$f":"T9-HLOOKUP(Y9,Feuil1!$C$1:$BF$9,7,FALSE)","v":-935},{"$f":"T9-HLOOKUP(Y9,Feuil1!$C$1:$BF$9,8,FALSE)","v":-935},{"$f":"T9-HLOOKUP(Y9,Feuil1!$C$1:$BF$9,9,FALSE)","v":-935},null,null,null,null,null,null,null,"N.CL.",39,null,{"$f":"IF(AQ9,VLOOKUP(AQ9,FEM!$AS$468:$AT$523,2))","v":1.1220000000000001}]
["F",null,null,null,null,null,null,1980,48,null,null,25,null,null,{"$f":"IF(I10=\"\",\"\",IF(MAXA(L10:N10)<=0,0,MAXA(L10:N10)))","v":25},40,null,null,40,65,116.77845335971031,"FRA +",5,"V1 F35",{"$f":"IF(AND(H10<1936),VLOOKUP(I10,Feuil1!$F$10:$O$24,9),IF(AND(H10>=1942,H10<1947),VLOOKUP(I10,Feuil1!$F$10:$O$24,9),IF(AND(H10>=1947,H10<1952),VLOOKUP(I10,Feuil1!$F$10:$O$24,8),IF(AND(H10>=1952,H10<1957),VLOOKUP(I10,Feuil1!$F$10:$O$24,7),IF(AND(H10>=1957,H10<1962),VLOOKUP(I10,Feuil1!$F$10:$O$24,6),IF(AND(H10>=1962,H10<1967),VLOOKUP(I10,Feuil1!$F$10:$O$24,5),IF(AND(H10>=1967,H10<1972),VLOOKUP(I10,Feuil1!$F$10:$O$24,4),IF(AND(H10>=1972,H10<1977),VLOOKUP(I10,Feuil1!$F$10:$O$24,3),IF(AND(H10>=1977,H10<1982),VLOOKUP(I10,Feuil1!$F$10:$O$24,2),VLOOKUP(I10,Feuil1!$F$10:$O$24,2))))))))))","v":"VF35-48"},null,{"$f":"T10-HLOOKUP(Y10,Feuil1!$C$1:$BF$9,2,FALSE)","v":65},{"$f":"T10-HLOOKUP(Y10,Feuil1!$C$1:$BF$9,3,FALSE)","v":10},{"$f":"T10-HLOOKUP(Y10,Feuil1!$C$1:$BF$9,4,FALSE)","v":5},{"$f":"T10-HLOOKUP(Y10,Feuil1!$C$1:$BF$9,5,FALSE)","v":-5},{"$f":"T10-HLOOKUP(Y10,Feuil1!$C$1:$BF$9,6,FALSE)","v":-17},{"$f":"T10-HLOOKUP(Y10,Feuil1!$C$1:$BF$9,7,FALSE)","v":-935},{"$f":"T10-HLOOKUP(Y10,Feuil1!$C$1:$BF$9,8,FALSE)","v":-935},{"$f":"T10-HLOOKUP(Y10,Feuil1!$C$1:$BF$9,9,FALSE)","v":-935},null,null,null,null,null,null,null,"FRA +",37,null,{"$f":"IF(AQ10,VLOOKUP(AQ10,FEM!$AS$468:$AT$523,2))","v":1.0960000000000001}]
["F",null,null,null,null,null,null,1981,53,null,null,25,null,null,25,40,null,null,40,65,106.18692964017175,"FRA +",3,"V1 F35",{"$f":"IF(AND(H11<1936),VLOOKUP(I11,Feuil1!$F$10:$O$24,9),IF(AND(H11>=1942,H11<1947),VLOOKUP(I11,Feuil1!$F$10:$O$24,9),IF(AND(H11>=1947,H11<1952),VLOOKUP(I11,Feuil1!$F$10:$O$24,8),IF(AND(H11>=1952,H11<1957),VLOOKUP(I11,Feuil1!$F$10:$O$24,7),IF(AND(H11>=1957,H11<1962),VLOOKUP(I11,Feuil1!$F$10:$O$24,6),IF(AND(H11>=1962,H11<1967),VLOOKUP(I11,Feuil1!$F$10:$O$24,5),IF(AND(H11>=1967,H11<1972),VLOOKUP(I11,Feuil1!$F$10:$O$24,4),IF(AND(H11>=1972,H11<1977),VLOOKUP(I11,Feuil1!$F$10:$O$24,3),IF(AND(H11>=1977,H11<1982),VLOOKUP(I11,Feuil1!$F$10:$O$24,2),VLOOKUP(I11,Feuil1!$F$10:$O$24,2))))))))))","v":"VF35-53"},null,{"$f":"T11-HLOOKUP(Y11,Feuil1!$C$1:$BF$9,2,FALSE)","v":65},{"$f":"T11-HLOOKUP(Y11,Feuil1!$C$1:$BF$9,3,FALSE)","v":5},{"$f":"T11-HLOOKUP(Y11,Feuil1!$C$1:$BF$9,4,FALSE)","v":3},{"$f":"T11-HLOOKUP(Y11,Feuil1!$C$1:$BF$9,5,FALSE)","v":-7},{"$f":"T11-HLOOKUP(Y11,Feuil1!$C$1:$BF$9,6,FALSE)","v":-25},{"$f":"T11-HLOOKUP(Y11,Feuil1!$C$1:$BF$9,7,FALSE)","v":-935},{"$f":"T11-HLOOKUP(Y11,Feuil1!$C$1:$BF$9,8,FALSE)","v":-935},{"$f":"T11-HLOOKUP(Y11,Feuil1!$C$1:$BF$9,9,FALSE)","v":-935},null,null,null,null,null,null,null,"FRA +",36,null,{"$f":"IF(AQ11,VLOOKUP(AQ11,FEM!$AS$468:$AT$523,2))","v":1.083}]
["F",null,null,null,null,null,null,1972,58,null,null,null,null,null,0,null,null,null,0,0,0,"N.CL.",0,"V3 F45",{"$f":"IF(AND(H12<1936),VLOOKUP(I12,Feuil1!$F$10:$O$24,9),IF(AND(H12>=1942,H12<1947),VLOOKUP(I12,Feuil1!$F$10:$O$24,9),IF(AND(H12>=1947,H12<1952),VLOOKUP(I12,Feuil1!$F$10:$O$24,8),IF(AND(H12>=1952,H12<1957),VLOOKUP(I12,Feuil1!$F$10:$O$24,7),IF(AND(H12>=1957,H12<1962),VLOOKUP(I12,Feuil1!$F$10:$O$24,6),IF(AND(H12>=1962,H12<1967),VLOOKUP(I12,Feuil1!$F$10:$O$24,5),IF(AND(H12>=1967,H12<1972),VLOOKUP(I12,Feuil1!$F$10:$O$24,4),IF(AND(H12>=1972,H12<1977),VLOOKUP(I12,Feuil1!$F$10:$O$24,3),IF(AND(H12>=1977,H12<1982),VLOOKUP(I12,Feuil1!$F$10:$O$24,2),VLOOKUP(I12,Feuil1!$F$10:$O$24,2))))))))))","v":"VF40-58"},null,{"$f":"T12-HLOOKUP(Y12,Feuil1!$C$1:$BF$9,2,FALSE)","v":0},{"$f":"T12-HLOOKUP(Y12,Feuil1!$C$1:$BF$9,3,FALSE)","v":-60},{"$f":"T12-HLOOKUP(Y12,Feuil1!$C$1:$BF$9,4,FALSE)","v":-62},{"$f":"T12-HLOOKUP(Y12,Feuil1!$C$1:$BF$9,5,FALSE)","v":-72},{"$f":"T12-HLOOKUP(Y12,Feuil1!$C$1:$BF$9,6,FALSE)","v":-90},{"$f":"T12-HLOOKUP(Y12,Feuil1!$C$1:$BF$9,7,FALSE)","v":-1000},{"$f":"T12-HLOOKUP(Y12,Feuil1!$C$1:$BF$9,8,FALSE)","v":-1000},{"$f":"T12-HLOOKUP(Y12,Feuil1!$C$1:$BF$9,9,FALSE)","v":-1000},null,null,null,null,null,null,null,"N.CL.",45,null,{"$f":"IF(AQ12,VLOOKUP(AQ12,FEM!$AS$468:$AT$523,2))","v":1.2030000000000001}]
["F",null,null,null,null,null,null,1973,63,null,null,null,null,null,0,null,null,null,0,0,0,"N.CL.",0,"V2 F40",{"$f":"IF(AND(H13<1936),VLOOKUP(I13,Feuil1!$F$10:$O$24,9),IF(AND(H13>=1942,H13<1947),VLOOKUP(I13,Feuil1!$F$10:$O$24,9),IF(AND(H13>=1947,H13<1952),VLOOKUP(I13,Feuil1!$F$10:$O$24,8),IF(AND(H13>=1952,H13<1957),VLOOKUP(I13,Feuil1!$F$10:$O$24,7),IF(AND(H13>=1957,H13<1962),VLOOKUP(I13,Feuil1!$F$10:$O$24,6),IF(AND(H13>=1962,H13<1967),VLOOKUP(I13,Feuil1!$F$10:$O$24,5),IF(AND(H13>=1967,H13<1972),VLOOKUP(I13,Feuil1!$F$10:$O$24,4),IF(AND(H13>=1972,H13<1977),VLOOKUP(I13,Feuil1!$F$10:$O$24,3),IF(AND(H13>=1977,H13<1982),VLOOKUP(I13,Feuil1!$F$10:$O$24,2),VLOOKUP(I13,Feuil1!$F$10:$O$24,2))))))))))","v":"VF40-63"},null,{"$f":"T13-HLOOKUP(Y13,Feuil1!$C$1:$BF$9,2,FALSE)","v":0},{"$f":"T13-HLOOKUP(Y13,Feuil1!$C$1:$BF$9,3,FALSE)","v":-62},{"$f":"T13-HLOOKUP(Y13,Feuil1!$C$1:$BF$9,4,FALSE)","v":-65},{"$f":"T13-HLOOKUP(Y13,Feuil1!$C$1:$BF$9,5,FALSE)","v":-75},{"$f":"T13-HLOOKUP(Y13,Feuil1!$C$1:$BF$9,6,FALSE)","v":-95},{"$f":"T13-HLOOKUP(Y13,Feuil1!$C$1:$BF$9,7,FALSE)","v":-1000},{"$f":"T13-HLOOKUP(Y13,Feuil1!$C$1:$BF$9,8,FALSE)","v":-1000},{"$f":"T13-HLOOKUP(Y13,Feuil1!$C$1:$BF$9,9,FALSE)","v":-1000},null,null,null,null,null,null,null,"N.CL.",44,null,{"$f":"IF(AQ13,VLOOKUP(AQ13,FEM!$AS$468:$AT$523,2))","v":1.1890000000000001}]
["F",null,null,null,null,null,null,1974,69,null,null,null,null,null,0,null,null,null,0,0,0,"N.CL.",0,"V2 F40",{"$f":"IF(AND(H14<1936),VLOOKUP(I14,Feuil1!$F$10:$O$24,9),IF(AND(H14>=1942,H14<1947),VLOOKUP(I14,Feuil1!$F$10:$O$24,9),IF(AND(H14>=1947,H14<1952),VLOOKUP(I14,Feuil1!$F$10:$O$24,8),IF(AND(H14>=1952,H14<1957),VLOOKUP(I14,Feuil1!$F$10:$O$24,7),IF(AND(H14>=1957,H14<1962),VLOOKUP(I14,Feuil1!$F$10:$O$24,6),IF(AND(H14>=1962,H14<1967),VLOOKUP(I14,Feuil1!$F$10:$O$24,5),IF(AND(H14>=1967,H14<1972),VLOOKUP(I14,Feuil1!$F$10:$O$24,4),IF(AND(H14>=1972,H14<1977),VLOOKUP(I14,Feuil1!$F$10:$O$24,3),IF(AND(H14>=1977,H14<1982),VLOOKUP(I14,Feuil1!$F$10:$O$24,2),VLOOKUP(I14,Feuil1!$F$10:$O$24,2))))))))))","v":"VF40-69"},null,{"$f":"T14-HLOOKUP(Y14,Feuil1!$C$1:$BF$9,2,FALSE)","v":0},{"$f":"T14-HLOOKUP(Y14,Feuil1!$C$1:$BF$9,3,FALSE)","v":-65},{"$f":"T14-HLOOKUP(Y14,Feuil1!$C$1:$BF$9,4,FALSE)","v":-70},{"$f":"T14-HLOOKUP(Y14,Feuil1!$C$1:$BF$9,5,FALSE)","v":-80},{"$f":"T14-HLOOKUP(Y14,Feuil1!$C$1:$BF$9,6,FALSE)","v":-97},{"$f":"T14-HLOOKUP(Y14,Feuil1!$C$1:$BF$9,7,FALSE)","v":-1000},{"$f":"T14-HLOOKUP(Y14,Feuil1!$C$1:$BF$9,8,FALSE)","v":-1000},{"$f":"T14-HLOOKUP(Y14,Feuil1!$C$1:$BF$9,9,FALSE)","v":-1000},null,null,null,null,null,null,null,"N.CL.",43,null,{"$f":"IF(AQ14,VLOOKUP(AQ14,FEM!$AS$468:$AT$523,2))","v":1.1759999999999999}]
["F",null,null,null,null,null,null,1975,75,null,null,null,null,null,0,null,null,null,0,0,0,"N.CL.",0,"V2 F40",{"$f":"IF(AND(H15<1936),VLOOKUP(I15,Feuil1!$F$10:$O$24,9),IF(AND(H15>=1942,H15<1947),VLOOKUP(I15,Feuil1!$F$10:$O$24,9),IF(AND(H15>=1947,H15<1952),VLOOKUP(I15,Feuil1!$F$10:$O$24,8),IF(AND(H15>=1952,H15<1957),VLOOKUP(I15,Feuil1!$F$10:$O$24,7),IF(AND(H15>=1957,H15<1962),VLOOKUP(I15,Feuil1!$F$10:$O$24,6),IF(AND(H15>=1962,H15<1967),VLOOKUP(I15,Feuil1!$F$10:$O$24,5),IF(AND(H15>=1967,H15<1972),VLOOKUP(I15,Feuil1!$F$10:$O$24,4),IF(AND(H15>=1972,H15<1977),VLOOKUP(I15,Feuil1!$F$10:$O$24,3),IF(AND(H15>=1977,H15<1982),VLOOKUP(I15,Feuil1!$F$10:$O$24,2),VLOOKUP(I15,Feuil1!$F$10:$O$24,2))))))))))","v":"VF40-75"},null,{"$f":"T15-HLOOKUP(Y15,Feuil1!$C$1:$BF$9,2,FALSE)","v":0},{"$f":"T15-HLOOKUP(Y15,Feuil1!$C$1:$BF$9,3,FALSE)","v":-67},{"$f":"T15-HLOOKUP(Y15,Feuil1!$C$1:$BF$9,4,FALSE)","v":-72},{"$f":"T15-HLOOKUP(Y15,Feuil1!$C$1:$BF$9,5,FALSE)","v":-82},{"$f":"T15-HLOOKUP(Y15,Feuil1!$C$1:$BF$9,6,FALSE)","v":-100},{"$f":"T15-HLOOKUP(Y15,Feuil1!$C$1:$BF$9,7,FALSE)","v":-1000},{"$f":"T15-HLOOKUP(Y15,Feuil1!$C$1:$BF$9,8,FALSE)","v":-1000},{"$f":"T15-HLOOKUP(Y15,Feuil1!$C$1:$BF$9,9,FALSE)","v":-1000},null,null,null,null,null,null,null,"N.CL.",42,null,{"$f":"IF(AQ15,VLOOKUP(AQ15,FEM!$AS$468:$AT$523,2))","v":1.1619999999999999}]
["F",null,null,null,null,null,null,null,null,null,null,null,null,null,"",null,null,null,"","","","","",false,{"$f":"IF(AND(H16<1936),VLOOKUP(I16,Feuil1!$F$10:$O$24,9),IF(AND(H16>=1942,H16<1947),VLOOKUP(I16,Feuil1!$F$10:$O$24,9),IF(AND(H16>=1947,H16<1952),VLOOKUP(I16,Feuil1!$F$10:$O$24,8),IF(AND(H16>=1952,H16<1957),VLOOKUP(I16,Feuil1!$F$10:$O$24,7),IF(AND(H16>=1957,H16<1962),VLOOKUP(I16,Feuil1!$F$10:$O$24,6),IF(AND(H16>=1962,H16<1967),VLOOKUP(I16,Feuil1!$F$10:$O$24,5),IF(AND(H16>=1967,H16<1972),VLOOKUP(I16,Feuil1!$F$10:$O$24,4),IF(AND(H16>=1972,H16<1977),VLOOKUP(I16,Feuil1!$F$10:$O$24,3),IF(AND(H16>=1977,H16<1982),VLOOKUP(I16,Feuil1!$F$10:$O$24,2),VLOOKUP(I16,Feuil1!$F$10:$O$24,2))))))))))","v":{"$error":"#N/A"}},null,{"$f":"T16-HLOOKUP(Y16,Feuil1!$C$1:$BF$9,2,FALSE)","v":{"$error":"#VALUE!"}},{"$f":"T16-HLOOKUP(Y16,Feuil1!$C$1:$BF$9,3,FALSE)","v":{"$error":"#VALUE!"}},{"$f":"T16-HLOOKUP(Y16,Feuil1!$C$1:$BF$9,4,FALSE)","v":{"$error":"#VALUE!"}},{"$f":"T16-HLOOKUP(Y16,Feuil1!$C$1:$BF$9,5,FALSE)","v":{"$error":"#VALUE!"}},{"$f":"T16-HLOOKUP(Y16,Feuil1!$C$1:$BF$9,6,FALSE)","v":{"$error":"#VALUE!"}},{"$f":"T16-HLOOKUP(Y16,Feuil1!$C$1:$BF$9,7,FALSE)","v":{"$error":"#VALUE!"}},{"$f":"T16-HLOOKUP(Y16,Feuil1!$C$1:$BF$9,8,FALSE)","v":{"$error":"#VALUE!"}},{"$f":"T16-HLOOKUP(Y16,Feuil1!$C$1:$BF$9,9,FALSE)","v":{"$error":"#VALUE!"}},null,null,null,null,null,null,null,{"$error":"#VALUE!"},2017,null,{"$f":"IF(AQ16,VLOOKUP(AQ16,FEM!$AS$468:$AT$523,2))","v":4.4930000000000003}]
["F",null,null,null,null,null,null,null,null,null,null,null,null,null,"",null,null,null,"","","","","",false,{"$f":"IF(AND(H17<1936),VLOOKUP(I17,Feuil1!$F$10:$O$24,9),IF(AND(H17>=1942,H17<1947),VLOOKUP(I17,Feuil1!$F$10:$O$24,9),IF(AND(H17>=1947,H17<1952),VLOOKUP(I17,Feuil1!$F$10:$O$24,8),IF(AND(H17>=1952,H17<1957),VLOOKUP(I17,Feuil1!$F$10:$O$24,7),IF(AND(H17>=1957,H17<1962),VLOOKUP(I17,Feuil1!$F$10:$O$24,6),IF(AND(H17>=1962,H17<1967),VLOOKUP(I17,Feuil1!$F$10:$O$24,5),IF(AND(H17>=1967,H17<1972),VLOOKUP(I17,Feuil1!$F$10:$O$24,4),IF(AND(H17>=1972,H17<1977),VLOOKUP(I17,Feuil1!$F$10:$O$24,3),IF(AND(H17>=1977,H17<1982),VLOOKUP(I17,Feuil1!$F$10:$O$24,2),VLOOKUP(I17,Feuil1!$F$10:$O$24,2))))))))))","v":{"$error":"#N/A"}},null,{"$f":"T17-HLOOKUP(Y17,Feuil1!$C$1:$BF$9,2,FALSE)","v":{"$error":"#VALUE!"}},{"$f":"T17-HLOOKUP(Y17,Feuil1!$C$1:$BF$9,3,FALSE)","v":{"$error":"#VALUE!"}},{"$f":"T17-HLOOKUP(Y17,Feuil1!$C$1:$BF$9,4,FALSE)","v":{"$error":"#VALUE!"}},{"$f":"T17-HLOOKUP(Y17,Feuil1!$C$1:$BF$9,5,FALSE)","v":{"$error":"#VALUE!"}},{"$f":"T17-HLOOKUP(Y17,Feuil1!$C$1:$BF$9,6,FALSE)","v":{"$error":"#VALUE!"}},{"$f":"T17-HLOOKUP(Y17,Feuil1!$C$1:$BF$9,7,FALSE)","v":{"$error":"#VALUE!"}},{"$f":"T17-HLOOKUP(Y17,Feuil1!$C$1:$BF$9,8,FALSE)","v":{"$error":"#VALUE!"}},{"$f":"T17-HLOOKUP(Y17,Feuil1!$C$1:$BF$9,9,FALSE)","v":{"$error":"#VALUE!"}},null,null,null,null,null,null,null,{"$error":"#VALUE!"},2017,null,{"$f":"IF(AQ17,VLOOKUP(AQ17,FEM!$AS$468:$AT$523,2))","v":4.4930000000000003}]
["F",null,null,null,null,null,null,null,null,null,null,null,null,null,"",null,null,null,"","","","","",false,{"$f":"IF(AND(H18<1936),VLOOKUP(I18,Feuil1!$F$10:$O$24,9),IF(AND(H18>=1942,H18<1947),VLOOKUP(I18,Feuil1!$F$10:$O$24,9),IF(AND(H18>=1947,H18<1952),VLOOKUP(I18,Feuil1!$F$10:$O$24,8),IF(AND(H18>=1952,H18<1957),VLOOKUP(I18,Feuil1!$F$10:$O$24,7),IF(AND(H18>=1957,H18<1962),VLOOKUP(I18,Feuil1!$F$10:$O$24,6),IF(AND(H18>=1962,H18<1967),VLOOKUP(I18,Feuil1!$F$10:$O$24,5),IF(AND(H18>=1967,H18<1972),VLOOKUP(I18,Feuil1!$F$10:$O$24,4),IF(AND(H18>=1972,H18<1977),VLOOKUP(I18,Feuil1!$F$10:$O$24,3),IF(AND(H18>=1977,H18<1982),VLOOKUP(I18,Feuil1!$F$10:$O$24,2),VLOOKUP(I18,Feuil1!$F$10:$O$24,2))))))))))","v":{"$error":"#N/A"}},null,{"$f":"T18-HLOOKUP(Y18,Feuil1!$C$1:$BF$9,2,FALSE)","v":{"$error":"#VALUE!"}},{"$f":"T18-HLOOKUP(Y18,Feuil1!$C$1:$BF$9,3,FALSE)","v":{"$error":"#VALUE!"}},{"$f":"T18-HLOOKUP(Y18,Feuil1!$C$1:$BF$9,4,FALSE)","v":{"$error":"#VALUE!"}},{"$f":"T18-HLOOKUP(Y18,Feuil1!$C$1:$BF$9,5,FALSE)","v":{"$error":"#VALUE!"}},{"$f":"T18-HLOOKUP(Y18,Feuil1!$C$1:$BF$9,6,FALSE)","v":{"$error":"#VALUE!"}},{"$f":"T18-HLOOKUP(Y18,Feuil1!$C$1:$BF$9,7,FALSE)","v":{"$error":"#VALUE!"}},{"$f":"T18-HLOOKUP(Y18,Feuil1!$C$1:$BF$9,8,FALSE)","v":{"$error":"#VALUE!"}},{"$f":"T18-HLOOKUP(Y18,Feuil1!$C$1:$BF$9,9,FALSE)","v":{"$error":"#VALUE!"}},null,null,null,null,null,null,null,{"$error":"#VALUE!"},2017,null,{"$f":"IF(AQ18,VLOOKUP(AQ18,FEM!$AS$468:$AT$523,2))","v":4.4930000000000003}]
["F",null,null,null,null,null,null,null,null,null,null,null,null,null,"",null,null,null,"","","","","",false,{"$f":"IF(AND(H19<1936),VLOOKUP(I19,Feuil1!$F$10:$O$24,9),IF(AND(H19>=1942,H19<1947),VLOOKUP(I19,Feuil1!$F$10:$O$24,9),IF(AND(H19>=1947,H19<1952),VLOOKUP(I19,Feuil1!$F$10:$O$24,8),IF(AND(H19>=1952,H19<1957),VLOOKUP(I19,Feuil1!$F$10:$O$24,7),IF(AND(H19>=1957,H19<1962),VLOOKUP(I19,Feuil1!$F$10:$O$24,6),IF(AND(H19>=1962,H19<1967),VLOOKUP(I19,Feuil1!$F$10:$O$24,5),IF(AND(H19>=1967,H19<1972),VLOOKUP(I19,Feuil1!$F$10:$O$24,4),IF(AND(H19>=1972,H19<1977),VLOOKUP(I19,Feuil1!$F$10:$O$24,3),IF(AND(H19>=1977,H19<1982),VLOOKUP(I19,Feuil1!$F$10:$O$24,2),VLOOKUP(I19,Feuil1!$F$10:$O$24,2))))))))))","v":{"$error":"#N/A"}},null,{"$f":"T19-HLOOKUP(Y19,Feuil1!$C$1:$BF$9,2,FALSE)","v":{"$error":"#VALUE!"}},{"$f":"T19-HLOOKUP(Y19,Feuil1!$C$1:$BF$9,3,FALSE)","v":{"$error":"#VALUE!"}},{"$f":"T19-HLOOKUP(Y19,Feuil1!$C$1:$BF$9,4,FALSE)","v":{"$error":"#VALUE!"}},{"$f":"T19-HLOOKUP(Y19,Feuil1!$C$1:$BF$9,5,FALSE)","v":{"$error":"#VALUE!"}},{"$f":"T19-HLOOKUP(Y19,Feuil1!$C$1:$BF$9,6,FALSE)","v":{"$error":"#VALUE!"}},{"$f":"T19-HLOOKUP(Y19,Feuil1!$C$1:$BF$9,7,FALSE)","v":{"$error":"#VALUE!"}},{"$f":"T19-HLOOKUP(Y19,Feuil1!$C$1:$BF$9,8,FALSE)","v":{"$error":"#VALUE!"}},{"$f":"T19-HLOOKUP(Y19,Feuil1!$C$1:$BF$9,9,FALSE)","v":{"$error":"#VALUE!"}},null,null,null,null,null,null,null,{"$error":"#VALUE!"},2017,null,{"$f":"IF(AQ19,VLOOKUP(AQ19,FEM!$AS$468:$AT$523,2))","v":4.4930000000000003}]
["F",null,null,null,null,null,null,null,null,null,null,null,null,null,"",null,null,null,"","","","","",false,{"$f":"IF(AND(H20<1936),VLOOKUP(I20,Feuil1!$F$10:$O$24,9),IF(AND(H20>=1942,H20<1947),VLOOKUP(I20,Feuil1!$F$10:$O$24,9),IF(AND(H20>=1947,H20<1952),VLOOKUP(I20,Feuil1!$F$10:$O$24,8),IF(AND(H20>=1952,H20<1957),VLOOKUP(I20,Feuil1!$F$10:$O$24,7),IF(AND(H20>=1957,H20<1962),VLOOKUP(I20,Feuil1!$F$10:$O$24,6),IF(AND(H20>=1962,H20<1967),VLOOKUP(I20,Feuil1!$F$10:$O$24,5),IF(AND(H20>=1967,H20<1972),VLOOKUP(I20,Feuil1!$F$10:$O$24,4),IF(AND(H20>=1972,H20<1977),VLOOKUP(I20,Feuil1!$F$10:$O$24,3),IF(AND(H20>=1977,H20<1982),VLOOKUP(I20,Feuil1!$F$10:$O$24,2),VLOOKUP(I20,Feuil1!$F$10:$O$24,2))))))))))","v":{"$error":"#N/A"}},null,{"$f":"T20-HLOOKUP(Y20,Feuil1!$C$1:$BF$9,2,FALSE)","v":{"$error":"#VALUE!"}},{"$f":"T20-HLOOKUP(Y20,Feuil1!$C$1:$BF$9,3,FALSE)","v":{"$error":"#VALUE!"}},{"$f":"T20-HLOOKUP(Y20,Feuil1!$C$1:$BF$9,4,FALSE)","v":{"$error":"#VALUE!"}},{"$f":"T20-HLOOKUP(Y20,Feuil1!$C$1:$BF$9,5,FALSE)","v":{"$error":"#VALUE!"}},{"$f":"T20-HLOOKUP(Y20,Feuil1!$C$1:$BF$9,6,FALSE)","v":{"$error":"#VALUE!"}},{"$f":"T20-HLOOKUP(Y20,Feuil1!$C$1:$BF$9,7,FALSE)","v":{"$error":"#VALUE!"}},{"$f":"T20-HLOOKUP(Y20,Feuil1!$C$1:$BF$9,8,FALSE)","v":{"$error":"#VALUE!"}},{"$f":"T20-HLOOKUP(Y20,Feuil1!$C$1:$BF$9,9,FALSE)","v":{"$error":"#VALUE!"}},null,null,null,null,null,null,null,{"$error":"#VALUE!"},2017,null,{"$f":"IF(AQ20,VLOOKUP(AQ20,FEM!$AS$468:$AT$523,2))","v":4.4930000000000003}]
["F",null,null,null,null,null,null,null,null,null,null,null,null,null,"",null,null,null,"","","","","",false,{"$f":"IF(AND(H21<1936),VLOOKUP(I21,Feuil1!$F$10:$O$24,9),IF(AND(H21>=1942,H21<1947),VLOOKUP(I21,Feuil1!$F$10:$O$24,9),IF(AND(H21>=1947,H21<1952),VLOOKUP(I21,Feuil1!$F$10:$O$24,8),IF(AND(H21>=1952,H21<1957),VLOOKUP(I21,Feuil1!$F$10:$O$24,7),IF(AND(H21>=1957,H21<1962),VLOOKUP(I21,Feuil1!$F$10:$O$24,6),IF(AND(H21>=1962,H21<1967),VLOOKUP(I21,Feuil1!$F$10:$O$24,5),IF(AND(H21>=1967,H21<1972),VLOOKUP(I21,Feuil1!$F$10:$O$24,4),IF(AND(H21>=1972,H21<1977),VLOOKUP(I21,Feuil1!$F$10:$O$24,3),IF(AND(H21>=1977,H21<1982),VLOOKUP(I21,Feuil1!$F$10:$O$24,2),VLOOKUP(I21,Feuil1!$F$10:$O$24,2))))))))))","v":{"$error":"#N/A"}},null,{"$f":"T21-HLOOKUP(Y21,Feuil1!$C$1:$BF$9,2,FALSE)","v":{"$error":"#VALUE!"}},{"$f":"T21-HLOOKUP(Y21,Feuil1!$C$1:$BF$9,3,FALSE)","v":{"$error":"#VALUE!"}},{"$f":"T21-HLOOKUP(Y21,Feuil1!$C$1:$BF$9,4,FALSE)","v":{"$error":"#VALUE!"}},{"$f":"T21-HLOOKUP(Y21,Feuil1!$C$1:$BF$9,5,FALSE)","v":{"$error":"#VALUE!"}},{"$f":"T21-HLOOKUP(Y21,Feuil1!$C$1:$BF$9,6,FALSE)","v":{"$error":"#VALUE!"}},{"$f":"T21-HLOOKUP(Y21,Feuil1!$C$1:$BF$9,7,FALSE)","v":{"$error":"#VALUE!"}},{"$f":"T21-HLOOKUP(Y21,Feuil1!$C$1:$BF$9,8,FALSE)","v":{"$error":"#VALUE!"}},{"$f":"T21-HLOOKUP(Y21,Feuil1!$C$1:$BF$9,9,FALSE)","v":{"$error":"#VALUE!"}},null,null,null,null,null,null,null,{"$error":"#VALUE!"},2017,null,{"$f":"IF(AQ21,VLOOKUP(AQ21,FEM!$AS$468:$AT$523,2))","v":4.4930000000000003}]
["F",null,null,null,null,null,null,null,null,null,null,null,null,null,"",null,null,null,"","","","","",false,{"$f":"IF(AND(H22<1936),VLOOKUP(I22,Feuil1!$F$10:$O$24,9),IF(AND(H22>=1942,H22<1947),VLOOKUP(I22,Feuil1!$F$10:$O$24,9),IF(AND(H22>=1947,H22<1952),VLOOKUP(I22,Feuil1!$F$10:$O$24,8),IF(AND(H22>=1952,H22<1957),VLOOKUP(I22,Feuil1!$F$10:$O$24,7),IF(AND(H22>=1957,H22<1962),VLOOKUP(I22,Feuil1!$F$10:$O$24,6),IF(AND(H22>=1962,H22<1967),VLOOKUP(I22,Feuil1!$F$10:$O$24,5),IF(AND(H22>=1967,H22<1972),VLOOKUP(I22,Feuil1!$F$10:$O$24,4),IF(AND(H22>=1972,H22<1977),VLOOKUP(I22,Feuil1!$F$10:$O$24,3),IF(AND(H22>=1977,H22<1982),VLOOKUP(I22,Feuil1!$F$10:$O$24,2),VLOOKUP(I22,Feuil1!$F$10:$O$24,2))))))))))","v":{"$error":"#N/A"}},null,{"$f":"T22-HLOOKUP(Y22,Feuil1!$C$1:$BF$9,2,FALSE)","v":{"$error":"#VALUE!"}},{"$f":"T22-HLOOKUP(Y22,Feuil1!$C$1:$BF$9,3,FALSE)","v":{"$error":"#VALUE!"}},{"$f":"T22-HLOOKUP(Y22,Feuil1!$C$1:$BF$9,4,FALSE)","v":{"$error":"#VALUE!"}},{"$f":"T22-HLOOKUP(Y22,Feuil1!$C$1:$BF$9,5,FALSE)","v":{"$error":"#VALUE!"}},{"$f":"T22-HLOOKUP(Y22,Feuil1!$C$1:$BF$9,6,FALSE)","v":{"$error":"#VALUE!"}},{"$f":"T22-HLOOKUP(Y22,Feuil1!$C$1:$BF$9,7,FALSE)","v":{"$error":"#VALUE!"}},{"$f":"T22-HLOOKUP(Y22,Feuil1!$C$1:$BF$9,8,FALSE)","v":{"$error":"#VALUE!"}},{"$f":"T22-HLOOKUP(Y22,Feuil1!$C$1:$BF$9,9,FALSE)","v":{"$error":"#VALUE!"}},null,null,null,null,null,null,null,{"$error":"#VALUE!"},2017,null,{"$f":"IF(AQ22,VLOOKUP(AQ22,FEM!$AS$468:$AT$523,2))","v":4.4930000000000003}]
["F",null,null,null,null,null,null,null,null,null,null,null,null,null,"",null,null,null,"","","","","",false,{"$f":"IF(AND(H23<1936),VLOOKUP(I23,Feuil1!$F$10:$O$24,9),IF(AND(H23>=1942,H23<1947),VLOOKUP(I23,Feuil1!$F$10:$O$24,9),IF(AND(H23>=1947,H23<1952),VLOOKUP(I23,Feuil1!$F$10:$O$24,8),IF(AND(H23>=1952,H23<1957),VLOOKUP(I23,Feuil1!$F$10:$O$24,7),IF(AND(H23>=1957,H23<1962),VLOOKUP(I23,Feuil1!$F$10:$O$24,6),IF(AND(H23>=1962,H23<1967),VLOOKUP(I23,Feuil1!$F$10:$O$24,5),IF(AND(H23>=1967,H23<1972),VLOOKUP(I23,Feuil1!$F$10:$O$24,4),IF(AND(H23>=1972,H23<1977),VLOOKUP(I23,Feuil1!$F$10:$O$24,3),IF(AND(H23>=1977,H23<1982),VLOOKUP(I23,Feuil1!$F$10:$O$24,2),VLOOKUP(I23,Feuil1!$F$10:$O$24,2))))))))))","v":{"$error":"#N/A"}},null,{"$f":"T23-HLOOKUP(Y23,Feuil1!$C$1:$BF$9,2,FALSE)","v":{"$error":"#VALUE!"}},{"$f":"T23-HLOOKUP(Y23,Feuil1!$C$1:$BF$9,3,FALSE)","v":{"$error":"#VALUE!"}},{"$f":"T23-HLOOKUP(Y23,Feuil1!$C$1:$BF$9,4,FALSE)","v":{"$error":"#VALUE!"}},{"$f":"T23-HLOOKUP(Y23,Feuil1!$C$1:$BF$9,5,FALSE)","v":{"$error":"#VALUE!"}},{"$f":"T23-HLOOKUP(Y23,Feuil1!$C$1:$BF$9,6,FALSE)","v":{"$error":"#VALUE!"}},{"$f":"T23-HLOOKUP(Y23,Feuil1!$C$1:$BF$9,7,FALSE)","v":{"$error":"#VALUE!"}},{"$f":"T23-HLOOKUP(Y23,Feuil1!$C$1:$BF$9,8,FALSE)","v":{"$error":"#VALUE!"}},{"$f":"T23-HLOOKUP(Y23,Feuil1!$C$1:$BF$9,9,FALSE)","v":{"$error":"#VALUE!"}},null,null,null,null,null,null,null,{"$error":"#VALUE!"},2017,null,{"$f":"IF(AQ23,VLOOKUP(AQ23,FEM!$AS$468:$AT$523,2))","v":4.4930000000000003}]
["F",null,null,null,null,null,null,null,null,null,null,null,null,null,"",null,null,null,"","","","","",false,{"$f":"IF(AND(H24<1936),VLOOKUP(I24,Feuil1!$F$10:$O$24,9),IF(AND(H24>=1942,H24<1947),VLOOKUP(I24,Feuil1!$F$10:$O$24,9),IF(AND(H24>=1947,H24<1952),VLOOKUP(I24,Feuil1!$F$10:$O$24,8),IF(AND(H24>=1952,H24<1957),VLOOKUP(I24,Feuil1!$F$10:$O$24,7),IF(AND(H24>=1957,H24<1962),VLOOKUP(I24,Feuil1!$F$10:$O$24,6),IF(AND(H24>=1962,H24<1967),VLOOKUP(I24,Feuil1!$F$10:$O$24,5),IF(AND(H24>=1967,H24<1972),VLOOKUP(I24,Feuil1!$F$10:$O$24,4),IF(AND(H24>=1972,H24<1977),VLOOKUP(I24,Feuil1!$F$10:$O$24,3),IF(AND(H24>=1977,H24<1982),VLOOKUP(I24,Feuil1!$F$10:$O$24,2),VLOOKUP(I24,Feuil1!$F$10:$O$24,2))))))))))","v":{"$error":"#N/A"}},null,{"$f":"T24-HLOOKUP(Y24,Feuil1!$C$1:$BF$9,2,FALSE)","v":{"$error":"#VALUE!"}},{"$f":"T24-HLOOKUP(Y24,Feuil1!$C$1:$BF$9,3,FALSE)","v":{"$error":"#VALUE!"}},{"$f":"T24-HLOOKUP(Y24,Feuil1!$C$1:$BF$9,4,FALSE)","v":{"$error":"#VALUE!"}},{"$f":"T24-HLOOKUP(Y24,Feuil1!$C$1:$BF$9,5,FALSE)","v":{"$error":"#VALUE!"}},{"$f":"T24-HLOOKUP(Y24,Feuil1!$C$1:$BF$9,6,FALSE)","v":{"$error":"#VALUE!"}},{"$f":"T24-HLOOKUP(Y24,Feuil1!$C$1:$BF$9,7,FALSE)","v":{"$error":"#VALUE!"}},{"$f":"T24-HLOOKUP(Y24,Feuil1!$C$1:$BF$9,8,FALSE)","v":{"$error":"#VALUE!"}},{"$f":"T24-HLOOKUP(Y24,Feuil1!$C$1:$BF$9,9,FALSE)","v":{"$error":"#VALUE!"}},null,null,null,null,null,null,null,{"$error":"#VALUE!"},2017,null,{"$f":"IF(AQ24,VLOOKUP(AQ24,FEM!$AS$468:$AT$523,2))","v":4.4930000000000003}]
["F",null,null,null,null,null,null,null,null,null,null,null,null,null,"",null,null,null,"","","","","",false,{"$f":"IF(AND(H25<1936),VLOOKUP(I25,Feuil1!$F$10:$O$24,9),IF(AND(H25>=1942,H25<1947),VLOOKUP(I25,Feuil1!$F$10:$O$24,9),IF(AND(H25>=1947,H25<1952),VLOOKUP(I25,Feuil1!$F$10:$O$24,8),IF(AND(H25>=1952,H25<1957),VLOOKUP(I25,Feuil1!$F$10:$O$24,7),IF(AND(H25>=1957,H25<1962),VLOOKUP(I25,Feuil1!$F$10:$O$24,6),IF(AND(H25>=1962,H25<1967),VLOOKUP(I25,Feuil1!$F$10:$O$24,5),IF(AND(H25>=1967,H25<1972),VLOOKUP(I25,Feuil1!$F$10:$O$24,4),IF(AND(H25>=1972,H25<1977),VLOOKUP(I25,Feuil1!$F$10:$O$24,3),IF(AND(H25>=1977,H25<1982),VLOOKUP(I25,Feuil1!$F$10:$O$24,2),VLOOKUP(I25,Feuil1!$F$10:$O$24,2))))))))))","v":{"$error":"#N/A"}},null,{"$f":"T25-HLOOKUP(Y25,Feuil1!$C$1:$BF$9,2,FALSE)","v":{"$error":"#VALUE!"}},{"$f":"T25-HLOOKUP(Y25,Feuil1!$C$1:$BF$9,3,FALSE)","v":{"$error":"#VALUE!"}},{"$f":"T25-HLOOKUP(Y25,Feuil1!$C$1:$BF$9,4,FALSE)","v":{"$error":"#VALUE!"}},{"$f":"T25-HLOOKUP(Y25,Feuil1!$C$1:$BF$9,5,FALSE)","v":{"$error":"#VALUE!"}},{"$f":"T25-HLOOKUP(Y25,Feuil1!$C$1:$BF$9,6,FALSE)","v":{"$error":"#VALUE!"}},{"$f":"T25-HLOOKUP(Y25,Feuil1!$C$1:$BF$9,7,FALSE)","v":{"$error":"#VALUE!"}},{"$f":"T25-HLOOKUP(Y25,Feuil1!$C$1:$BF$9,8,FALSE)","v":{"$error":"#VALUE!"}},{"$f":"T25-HLOOKUP(Y25,Feuil1!$C$1:$BF$9,9,FALSE)","v":{"$error":"#VALUE!"}},null,null,null,null,null,null,null,{"$error":"#VALUE!"},2017,null,{"$f":"IF(AQ25,VLOOKUP(AQ25,FEM!$AS$468:$AT$523,2))","v":4.4930000000000003}]
["F",null,null,null,null,null,null,null,null,null,null,null,null,null,"",null,null,null,"","","","","",false,{"$f":"IF(AND(H26<1936),VLOOKUP(I26,Feuil1!$F$10:$O$24,9),IF(AND(H26>=1942,H26<1947),VLOOKUP(I26,Feuil1!$F$10:$O$24,9),IF(AND(H26>=1947,H26<1952),VLOOKUP(I26,Feuil1!$F$10:$O$24,8),IF(AND(H26>=1952,H26<1957),VLOOKUP(I26,Feuil1!$F$10:$O$24,7),IF(AND(H26>=1957,H26<1962),VLOOKUP(I26,Feuil1!$F$10:$O$24,6),IF(AND(H26>=1962,H26<1967),VLOOKUP(I26,Feuil1!$F$10:$O$24,5),IF(AND(H26>=1967,H26<1972),VLOOKUP(I26,Feuil1!$F$10:$O$24,4),IF(AND(H26>=1972,H26<1977),VLOOKUP(I26,Feuil1!$F$10:$O$24,3),IF(AND(H26>=1977,H26<1982),VLOOKUP(I26,Feuil1!$F$10:$O$24,2),VLOOKUP(I26,Feuil1!$F$10:$O$24,2))))))))))","v":{"$error":"#N/A"}},null,{"$f":"T26-HLOOKUP(Y26,Feuil1!$C$1:$BF$9,2,FALSE)","v":{"$error":"#VALUE!"}},{"$f":"T26-HLOOKUP(Y26,Feuil1!$C$1:$BF$9,3,FALSE)","v":{"$error":"#VALUE!"}},{"$f":"T26-HLOOKUP(Y26,Feuil1!$C$1:$BF$9,4,FALSE)","v":{"$error":"#VALUE!"}},{"$f":"T26-HLOOKUP(Y26,Feuil1!$C$1:$BF$9,5,FALSE)","v":{"$error":"#VALUE!"}},{"$f":"T26-HLOOKUP(Y26,Feuil1!$C$1:$BF$9,6,FALSE)","v":{"$error":"#VALUE!"}},{"$f":"T26-HLOOKUP(Y26,Feuil1!$C$1:$BF$9,7,FALSE)","v":{"$error":"#VALUE!"}},{"$f":"T26-HLOOKUP(Y26,Feuil1!$C$1:$BF$9,8,FALSE)","v":{"$error":"#VALUE!"}},{"$f":"T26-HLOOKUP(Y26,Feuil1!$C$1:$BF$9,9,FALSE)","v":{"$error":"#VALUE!"}},null,null,null,null,null,null,null,{"$error":"#VALUE!"},2017,null,{"$f":"IF(AQ26,VLOOKUP(AQ26,FEM!$AS$468:$AT$523,2))","v":4.4930000000000003}]
["F",null,null,null,null,null,null,null,null,null,null,null,null,null,"",null,null,null,"","","","","",false,{"$f":"IF(AND(H27<1936),VLOOKUP(I27,Feuil1!$F$10:$O$24,9),IF(AND(H27>=1942,H27<1947),VLOOKUP(I27,Feuil1!$F$10:$O$24,9),IF(AND(H27>=1947,H27<1952),VLOOKUP(I27,Feuil1!$F$10:$O$24,8),IF(AND(H27>=1952,H27<1957),VLOOKUP(I27,Feuil1!$F$10:$O$24,7),IF(AND(H27>=1957,H27<1962),VLOOKUP(I27,Feuil1!$F$10:$O$24,6),IF(AND(H27>=1962,H27<1967),VLOOKUP(I27,Feuil1!$F$10:$O$24,5),IF(AND(H27>=1967,H27<1972),VLOOKUP(I27,Feuil1!$F$10:$O$24,4),IF(AND(H27>=1972,H27<1977),VLOOKUP(I27,Feuil1!$F$10:$O$24,3),IF(AND(H27>=1977,H27<1982),VLOOKUP(I27,Feuil1!$F$10:$O$24,2),VLOOKUP(I27,Feuil1!$F$10:$O$24,2))))))))))","v":{"$error":"#N/A"}},null,{"$f":"T27-HLOOKUP(Y27,Feuil1!$C$1:$BF$9,2,FALSE)","v":{"$error":"#VALUE!"}},{"$f":"T27-HLOOKUP(Y27,Feuil1!$C$1:$BF$9,3,FALSE)","v":{"$error":"#VALUE!"}},{"$f":"T27-HLOOKUP(Y27,Feuil1!$C$1:$BF$9,4,FALSE)","v":{"$error":"#VALUE!"}},{"$f":"T27-HLOOKUP(Y27,Feuil1!$C$1:$BF$9,5,FALSE)","v":{"$error":"#VALUE!"}},{"$f":"T27-HLOOKUP(Y27,Feuil1!$C$1:$BF$9,6,FALSE)","v":{"$error":"#VALUE!"}},{"$f":"T27-HLOOKUP(Y27,Feuil1!$C$1:$BF$9,7,FALSE)","v":{"$error":"#VALUE!"}},{"$f":"T27-HLOOKUP(Y27,Feuil1!$C$1:$BF$9,8,FALSE)","v":{"$error":"#VALUE!"}},{"$f":"T27-HLOOKUP(Y27,Feuil1!$C$1:$BF$9,9,FALSE)","v":{"$error":"#VALUE!"}},null,null,null,null,null,null,null,{"$error":"#VALUE!"},2017,null,{"$f":"IF(AQ27,VLOOKUP(AQ27,FEM!$AS$468:$AT$523,2))","v":4.4930000000000003}]
["F",null,null,null,null,null,null,null,null,null,null,null,null,null,"",null,null,null,"","","","","",false,{"$f":"IF(AND(H28<1936),VLOOKUP(I28,Feuil1!$F$10:$O$24,9),IF(AND(H28>=1942,H28<1947),VLOOKUP(I28,Feuil1!$F$10:$O$24,9),IF(AND(H28>=1947,H28<1952),VLOOKUP(I28,Feuil1!$F$10:$O$24,8),IF(AND(H28>=1952,H28<1957),VLOOKUP(I28,Feuil1!$F$10:$O$24,7),IF(AND(H28>=1957,H28<1962),VLOOKUP(I28,Feuil1!$F$10:$O$24,6),IF(AND(H28>=1962,H28<1967),VLOOKUP(I28,Feuil1!$F$10:$O$24,5),IF(AND(H28>=1967,H28<1972),VLOOKUP(I28,Feuil1!$F$10:$O$24,4),IF(AND(H28>=1972,H28<1977),VLOOKUP(I28,Feuil1!$F$10:$O$24,3),IF(AND(H28>=1977,H28<1982),VLOOKUP(I28,Feuil1!$F$10:$O$24,2),VLOOKUP(I28,Feuil1!$F$10:$O$24,2))))))))))","v":{"$error":"#N/A"}},null,{"$f":"T28-HLOOKUP(Y28,Feuil1!$C$1:$BF$9,2,FALSE)","v":{"$error":"#VALUE!"}},{"$f":"T28-HLOOKUP(Y28,Feuil1!$C$1:$BF$9,3,FALSE)","v":{"$error":"#VALUE!"}},{"$f":"T28-HLOOKUP(Y28,Feuil1!$C$1:$BF$9,4,FALSE)","v":{"$error":"#VALUE!"}},{"$f":"T28-HLOOKUP(Y28,Feuil1!$C$1:$BF$9,5,FALSE)","v":{"$error":"#VALUE!"}},{"$f":"T28-HLOOKUP(Y28,Feuil1!$C$1:$BF$9,6,FALSE)","v":{"$error":"#VALUE!"}},{"$f":"T28-HLOOKUP(Y28,Feuil1!$C$1:$BF$9,7,FALSE)","v":{"$error":"#VALUE!"}},{"$f":"T28-HLOOKUP(Y28,Feuil1!$C$1:$BF$9,8,FALSE)","v":{"$error":"#VALUE!"}},{"$f":"T28-HLOOKUP(Y28,Feuil1!$C$1:$BF$9,9,FALSE)","v":{"$error":"#VALUE!"}},null,null,null,null,null,null,null,{"$error":"#VALUE!"},2017,null,{"$f":"IF(AQ28,VLOOKUP(AQ28,FEM!$AS$468:$AT$523,2))","v":4.4930000000000003}]
["F",null,null,null,null,null,null,null,null,null,null,null,null,null,"",null,null,null,"","","","","",false,{"$f":"IF(AND(H29<1936),VLOOKUP(I29,Feuil1!$F$10:$O$24,9),IF(AND(H29>=1942,H29<1947),VLOOKUP(I29,Feuil1!$F$10:$O$24,9),IF(AND(H29>=1947,H29<1952),VLOOKUP(I29,Feuil1!$F$10:$O$24,8),IF(AND(H29>=1952,H29<1957),VLOOKUP(I29,Feuil1!$F$10:$O$24,7),IF(AND(H29>=1957,H29<1962),VLOOKUP(I29,Feuil1!$F$10:$O$24,6),IF(AND(H29>=1962,H29<1967),VLOOKUP(I29,Feuil1!$F$10:$O$24,5),IF(AND(H29>=1967,H29<1972),VLOOKUP(I29,Feuil1!$F$10:$O$24,4),IF(AND(H29>=1972,H29<1977),VLOOKUP(I29,Feuil1!$F$10:$O$24,3),IF(AND(H29>=1977,H29<1982),VLOOKUP(I29,Feuil1!$F$10:$O$24,2),VLOOKUP(I29,Feuil1!$F$10:$O$24,2))))))))))","v":{"$error":"#N/A"}},null,{"$f":"T29-HLOOKUP(Y29,Feuil1!$C$1:$BF$9,2,FALSE)","v":{"$error":"#VALUE!"}},{"$f":"T29-HLOOKUP(Y29,Feuil1!$C$1:$BF$9,3,FALSE)","v":{"$error":"#VALUE!"}},{"$f":"T29-HLOOKUP(Y29,Feuil1!$C$1:$BF$9,4,FALSE)","v":{"$error":"#VALUE!"}},{"$f":"T29-HLOOKUP(Y29,Feuil1!$C$1:$BF$9,5,FALSE)","v":{"$error":"#VALUE!"}},{"$f":"T29-HLOOKUP(Y29,Feuil1!$C$1:$BF$9,6,FALSE)","v":{"$error":"#VALUE!"}},{"$f":"T29-HLOOKUP(Y29,Feuil1!$C$1:$BF$9,7,FALSE)","v":{"$error":"#VALUE!"}},{"$f":"T29-HLOOKUP(Y29,Feuil1!$C$1:$BF$9,8,FALSE)","v":{"$error":"#VALUE!"}},{"$f":"T29-HLOOKUP(Y29,Feuil1!$C$1:$BF$9,9,FALSE)","v":{"$error":"#VALUE!"}},null,null,null,null,null,null,null,{"$error":"#VALUE!"},2017,null,{"$f":"IF(AQ29,VLOOKUP(AQ29,FEM!$AS$468:$AT$523,2))","v":4.4930000000000003}]
["F",null,null,null,null,null,null,null,null,null,null,null,null,null,"",null,null,null,"","",{"$f":"IF(I30=\"\",\"\",IF(A30=\"H\",10^(0.794358141*LOG(I30/174.393)^2)*T30*AS30,IF(A30=\"F\",10^(0.89726074 * LOG(I30/148.026)^2)*T30*AS30,\"\")))","v":""},{"$f":"IF(I30=\"\",\"\",AP30)","v":""},{"$f":"IF(I30=\"\",\"\",IF(AH30>=0,AH30,IF(AG30>=0,AG30,IF(AF30>=0,AF30,IF(AE30>=0,AE30,IF(AD30>=0,AD30,IF(AC30>=0,AC30,IF(AB30>=0,AB30,AA30))))))))","v":""},{"$f":"IF(AQ30<95,IF(AQ30<=90,VLOOKUP(AQ30,$AQ$467:$AR$522,2)))","v":false},{"$f":"IF(AND(H30<1936),VLOOKUP(I30,Feuil1!$F$10:$O$24,9),IF(AND(H30>=1942,H30<1947),VLOOKUP(I30,Feuil1!$F$10:$O$24,9),IF(AND(H30>=1947,H30<1952),VLOOKUP(I30,Feuil1!$F$10:$O$24,8),IF(AND(H30>=1952,H30<1957),VLOOKUP(I30,Feuil1!$F$10:$O$24,7),IF(AND(H30>=1957,H30<1962),VLOOKUP(I30,Feuil1!$F$10:$O$24,6),IF(AND(H30>=1962,H30<1967),VLOOKUP(I30,Feuil1!$F$10:$O$24,5),IF(AND(H30>=1967,H30<1972),VLOOKUP(I30,Feuil1!$F$10:$O$24,4),IF(AND(H30>=1972,H30<1977),VLOOKUP(I30,Feuil1!$F$10:$O$24,3),IF(AND(H30>=1977,H30<1982),VLOOKUP(I30,Feuil1!$F$10:$O$24,2),VLOOKUP(I30,Feuil1!$F$10:$O$24,2))))))))))","v":{"$error":"#N/A"}},null,{"$f":"T30-HLOOKUP(Y30,Feuil1!$C$1:$BF$9,2,FALSE)","v":{"$error":"#VALUE!"}},{"$f":"T30-HLOOKUP(Y30,Feuil1!$C$1:$BF$9,3,FALSE)","v":{"$error":"#VALUE!"}},{"$f":"T30-HLOOKUP(Y30,Feuil1!$C$1:$BF$9,4,FALSE)","v":{"$error":"#VALUE!"}},{"$f":"T30-HLOOKUP(Y30,Feuil1!$C$1:$BF$9,5,FALSE)","v":{"$error":"#VALUE!"}},{"$f":"T30-HLOOKUP(Y30,Feuil1!$C$1:$BF$9,6,FALSE)","v":{"$error":"#VALUE!"}},{"$f":"T30-HLOOKUP(Y30,Feuil1!$C$1:$BF$9,7,FALSE)","v":{"$error":"#VALUE!"}},{"$f":"T30-HLOOKUP(Y30,Feuil1!$C$1:$BF$9,8,FALSE)","v":{"$error":"#VALUE!"}},{"$f":"T30-HLOOKUP(Y30,Feuil1!$C$1:$BF$9,9,FALSE)","v":{"$error":"#VALUE!"}},null,null,null,null,null,null,null,{"$error":"#VALUE!"},2017,null,{"$f":"IF(AQ30,VLOOKUP(AQ30,FEM!$AS$468:$AT$523,2))","v":4.4930000000000003}]
["F",null,null,null,null,null,null,null,null,null,null,null," "," ",null,null,null,null,null,null,null,null,null,null,null,null,{"$f":"T31-HLOOKUP(Y31,Feuil1!$C$1:$BF$9,2,FALSE)","v":{"$error":"#N/A"}},{"$f":"T31-HLOOKUP(Y31,Feuil1!$C$1:$BF$9,3,FALSE)","v":{"$error":"#N/A"}},{"$f":"T31-HLOOKUP(Y31,Feuil1!$C$1:$BF$9,4,FALSE)","v":{"$error":"#N/A"}},{"$f":"T31-HLOOKUP(Y31,Feuil1!$C$1:$BF$9,5,FALSE)","v":{"$error":"#N/A"}},{"$f":"T31-HLOOKUP(Y31,Feuil1!$C$1:$BF$9,6,FALSE)","v":{"$error":"#N/A"}},{"$f":"T31-HLOOKUP(Y31,Feuil1!$C$1:$BF$9,7,FALSE)","v":{"$error":"#N/A"}},{"$f":"T31-HLOOKUP(Y31,Feuil1!$C$1:$BF$9,8,FALSE)","v":{"$error":"#N/A"}},{"$f":"T31-HLOOKUP(Y31,Feuil1!$C$1:$BF$9,9,FALSE)","v":{"$error":"#N/A"}},null,null,null,null,null,null,null,{"$error":"#N/A"},2017,null,{"$f":"IF(AQ31,VLOOKUP(AQ31,FEM!$AS$468:$AT$523,2))","v":4.4930000000000003}]
["F","Secrétaire :",null,null,null," ",null," ",null,1," ",null,null,null,null,null,null,null,null,null,null,null,null,null,null,null,{"$f":"T32-HLOOKUP(Y32,Feuil1!$C$1:$BF$9,2,FALSE)","v":{"$error":"#N/A"}},{"$f":"T32-HLOOKUP(Y32,Feuil1!$C$1:$BF$9,3,FALSE)","v":{"$error":"#N/A"}},{"$f":"T32-HLOOKUP(Y32,Feuil1!$C$1:$BF$9,4,FALSE)","v":{"$error":"#N/A"}},{"$f":"T32-HLOOKUP(Y32,Feuil1!$C$1:$BF$9,5,FALSE)","v":{"$error":"#N/A"}},{"$f":"T32-HLOOKUP(Y32,Feuil1!$C$1:$BF$9,6,FALSE)","v":{"$error":"#N/A"}},{"$f":"T32-HLOOKUP(Y32,Feuil1!$C$1:$BF$9,7,FALSE)","v":{"$error":"#N/A"}},{"$f":"T32-HLOOKUP(Y32,Feuil1!$C$1:$BF$9,8,FALSE)","v":{"$error":"#N/A"}},{"$f":"T32-HLOOKUP(Y32,Feuil1!$C$1:$BF$9,9,FALSE)","v":{"$error":"#N/A"}},null,null,null,null,null,null,null,{"$error":"#N/A"},{"$error":"#VALUE!"},null,{"$f":"IF(AQ32,VLOOKUP(AQ32,FEM!$AS$468:$AT$523,2))","v":{"$error":"#VALUE!"}}]
["F",null,null,null,null,null,null," ","ARBITRES :                        2",null," ",null,null,null,null,null,null,"Signatures :",null,null,null,null,null,null,null,null,{"$f":"T33-HLOOKUP(Y33,Feuil1!$C$1:$BF$9,2,FALSE)","v":{"$error":"#N/A"}},{"$f":"T33-HLOOKUP(Y33,Feuil1!$C$1:$BF$9,3,FALSE)","v":{"$error":"#N/A"}},{"$f":"T33-HLOOKUP(Y33,Feuil1!$C$1:$BF$9,4,FALSE)","v":{"$error":"#N/A"}},{"$f":"T33-HLOOKUP(Y33,Feuil1!$C$1:$BF$9,5,FALSE)","v":{"$error":"#N/A"}},{"$f":"T33-HLOOKUP(Y33,Feuil1!$C$1:$BF$9,6,FALSE)","v":{"$error":"#N/A"}},{"$f":"T33-HLOOKUP(Y33,Feuil1!$C$1:$BF$9,7,FALSE)","v":{"$error":"#N/A"}},{"$f":"T33-HLOOKUP(Y33,Feuil1!$C$1:$BF$9,8,FALSE)","v":{"$error":"#N/A"}},{"$f":"T33-HLOOKUP(Y33,Feuil1!$C$1:$BF$9,9,FALSE)","v":{"$error":"#N/A"}},null,null,null,null,null,null,null,{"$error":"#N/A"},{"$error":"#VALUE!"},null,{"$f":"IF(AQ33,VLOOKUP(AQ33,FEM!$AS$468:$AT$523,2))","v":{"$error":"#VALUE!"}}]
["F","Contrôleur Technique 1 :",null,null,null," ",null," ",null,3," ",null,null,null,null,null,null,null,null,null,null,null,null,null,null,null,{"$f":"T34-HLOOKUP(Y34,Feuil1!$C$1:$BF$9,2,FALSE)","v":{"$error":"#N/A"}},{"$f":"T34-HLOOKUP(Y34,Feuil1!$C$1:$BF$9,3,FALSE)","v":{"$error":"#N/A"}},{"$f":"T34-HLOOKUP(Y34,Feuil1!$C$1:$BF$9,4,FALSE)","v":{"$error":"#N/A"}},{"$f":"T34-HLOOKUP(Y34,Feuil1!$C$1:$BF$9,5,FALSE)","v":{"$error":"#N/A"}},{"$f":"T34-HLOOKUP(Y34,Feuil1!$C$1:$BF$9,6,FALSE)","v":{"$error":"#N/A"}},{"$f":"T34-HLOOKUP(Y34,Feuil1!$C$1:$BF$9,7,FALSE)","v":{"$error":"#N/A"}},{"$f":"T34-HLOOKUP(Y34,Feuil1!$C$1:$BF$9,8,FALSE)","v":{"$error":"#N/A"}},{"$f":"T34-HLOOKUP(Y34,Feuil1!$C$1:$BF$9,9,FALSE)","v":{"$error":"#N/A"}},null,null,null,null,null,null,null,{"$error":"#N/A"},{"$error":"#VALUE!"},null,{"$f":"IF(AQ34,VLOOKUP(AQ34,FEM!$AS$468:$AT$523,2))","v":{"$error":"#VALUE!"}}]
["F","Contrôleur Technique 2 :",null,null,null,null,null," ",null,null,null,null,null,null,null,null,null,null,null,null,null,null,null,null,null,null,{"$f":"T35-HLOOKUP(Y35,Feuil1!$C$1:$BF$9,2,FALSE)","v":{"$error":"#N/A"}},{"$f":"T35-HLOOKUP(Y35,Feuil1!$C$1:$BF$9,3,FALSE)","v":{"$error":"#N/A"}},{"$f":"T35-HLOOKUP(Y35,Feuil1!$C$1:$BF$9,4,FALSE)","v":{"$error":"#N/A"}},{"$f":"T35-HLOOKUP(Y35,Feuil1!$C$1:$BF$9,5,FALSE)","v":{"$error":"#N/A"}},{"$f":"T35-HLOOKUP(Y35,Feuil1!$C$1:$BF$9,6,FALSE)","v":{"$error":"#N/A"}},{"$f":"T35-HLOOKUP(Y35,Feuil1!$C$1:$BF$9,7,FALSE)","v":{"$error":"#N/A"}},{"$f":"T35-HLOOKUP(Y35,Feuil1!$C$1:$BF$9,8,FALSE)","v":{"$error":"#N/A"}},{"$f":"T35-HLOOKUP(Y35,Feuil1!$C$1:$BF$9,9,FALSE)","v":{"$error":"#N/A"}},null,null,null,null,null,null,null,{"$error":"#N/A"},{"$error":"#VALUE!"},null,{"$f":"IF(AQ35,VLOOKUP(AQ35,FEM!$AS$468:$AT$523,2))","v":{"$error":"#VALUE!"}}]
["F","Chronométreur :",null,null,null," ",null," ",null,"JURY :"," ",null,null,null,null," ",null,null,null,null,null," ",null,null,null,null,{"$f":"T36-HLOOKUP(Y36,Feuil1!$C$1:$BF$9,2,FALSE)","v":{"$error":"#N/A"}},{"$f":"T36-HLOOKUP(Y36,Feuil1!$C$1:$BF$9,3,FALSE)","v":{"$error":"#N/A"}},{"$f":"T36-HLOOKUP(Y36,Feuil1!$C$1:$BF$9,4,FALSE)","v":{"$error":"#N/A"}},{"$f":"T36-HLOOKUP(Y36,Feuil1!$C$1:$BF$9,5,FALSE)","v":{"$error":"#N/A"}},{"$f":"T36-HLOOKUP(Y36,Feuil1!$C$1:$BF$9,6,FALSE)","v":{"$error":"#N/A"}},{"$f":"T36-HLOOKUP(Y36,Feuil1!$C$1:$BF$9,7,FALSE)","v":{"$error":"#N/A"}},{"$f":"T36-HLOOKUP(Y36,Feuil1!$C$1:$BF$9,8,FALSE)","v":{"$error":"#N/A"}},{"$f":"T36-HLOOKUP(Y36,Feuil1!$C$1:$BF$9,9,FALSE)","v":{"$error":"#N/A"}},null,null,null,null,null,null,null,{"$error":"#N/A"},{"$error":"#VALUE!"},null,{"$f":"IF(AQ36,VLOOKUP(AQ36,FEM!$AS$468:$AT$523,2))","v":{"$error":"#VALUE!"}}]
["F",null,null,null,null,null,null,1940,53,null,null,null,null,null,0,null,null,null,0,0,0,"N.CL.",0,"V8 F70+",{"$f":"IF(AND(H37<1936),VLOOKUP(I37,Feuil1!$F$10:$O$24,9),IF(AND(H37>=1942,H37<1947),VLOOKUP(I37,Feuil1!$F$10:$O$24,9),IF(AND(H37>=1947,H37<1952),VLOOKUP(I37,Feuil1!$F$10:$O$24,8),IF(AND(H37>=1952,H37<1957),VLOOKUP(I37,Feuil1!$F$10:$O$24,7),IF(AND(H37>=1957,H37<1962),VLOOKUP(I37,Feuil1!$F$10:$O$24,6),IF(AND(H37>=1962,H37<1967),VLOOKUP(I37,Feuil1!$F$10:$O$24,5),IF(AND(H37>=1967,H37<1972),VLOOKUP(I37,Feuil1!$F$10:$O$24,4),IF(AND(H37>=1972,H37<1977),VLOOKUP(I37,Feuil1!$F$10:$O$24,3),IF(AND(H37>=1977,H37<1982),VLOOKUP(I37,Feuil1!$F$10:$O$24,2),VLOOKUP(I37,Feuil1!$F$10:$O$24,2))))))))))","v":"VF35-53"},null,{"$f":"T37-HLOOKUP(Y37,Feuil1!$C$1:$BF$9,2,FALSE)","v":0},{"$f":"T37-HLOOKUP(Y37,Feuil1!$C$1:$BF$9,3,FALSE)","v":-60},{"$f":"T37-HLOOKUP(Y37,Feuil1!$C$1:$BF$9,4,FALSE)","v":-62},{"$f":"T37-HLOOKUP(Y37,Feuil1!$C$1:$BF$9,5,FALSE)","v":-72},{"$f":"T37-HLOOKUP(Y37,Feuil1!$C$1:$BF$9,6,FALSE)","v":-90},{"$f":"T37-HLOOKUP(Y37,Feuil1!$C$1:$BF$9,7,FALSE)","v":-1000},{"$f":"T37-HLOOKUP(Y37,Feuil1!$C$1:$BF$9,8,FALSE)","v":-1000},{"$f":"T37-HLOOKUP(Y37,Feuil1!$C$1:$BF$9,9,FALSE)","v":-1000},null,null,null,null,null,null,null,"N.CL.",77,null,{"$f":"IF(AQ37,VLOOKUP(AQ37,FEM!$AS$468:$AT$523,2))","v":2.2549999999999999}]
["F",null,null,null,null,null,null,1933,58,null,null,null,null,null,0,null,null,null,0,0,0,"N.CL.",0,"V8 F70+",{"$f":"IF(AND(H38<1936),VLOOKUP(I38,Feuil1!$F$10:$O$24,9),IF(AND(H38>=1942,H38<1947),VLOOKUP(I38,Feuil1!$F$10:$O$24,9),IF(AND(H38>=1947,H38<1952),VLOOKUP(I38,Feuil1!$F$10:$O$24,8),IF(AND(H38>=1952,H38<1957),VLOOKUP(I38,Feuil1!$F$10:$O$24,7),IF(AND(H38>=1957,H38<1962),VLOOKUP(I38,Feuil1!$F$10:$O$24,6),IF(AND(H38>=1962,H38<1967),VLOOKUP(I38,Feuil1!$F$10:$O$24,5),IF(AND(H38>=1967,H38<1972),VLOOKUP(I38,Feuil1!$F$10:$O$24,4),IF(AND(H38>=1972,H38<1977),VLOOKUP(I38,Feuil1!$F$10:$O$24,3),IF(AND(H38>=1977,H38<1982),VLOOKUP(I38,Feuil1!$F$10:$O$24,2),VLOOKUP(I38,Feuil1!$F$10:$O$24,2))))))))))","v":"VF70+-58"},null,{"$f":"T38-HLOOKUP(Y38,Feuil1!$C$1:$BF$9,2,FALSE)","v":0},{"$f":"T38-HLOOKUP(Y38,Feuil1!$C$1:$BF$9,3,FALSE)","v":-40},{"$f":"T38-HLOOKUP(Y38,Feuil1!$C$1:$BF$9,4,FALSE)","v":-42},{"$f":"T38-HLOOKUP(Y38,Feuil1!$C$1:$BF$9,5,FALSE)","v":-49},{"$f":"T38-HLOOKUP(Y38,Feuil1!$C$1:$BF$9,6,FALSE)","v":-50},{"$f":"T38-HLOOKUP(Y38,Feuil1!$C$1:$BF$9,7,FALSE)","v":-1000},{"$f":"T38-HLOOKUP(Y38,Feuil1!$C$1:$BF$9,8,FALSE)","v":-1000},{"$f":"T38-HLOOKUP(Y38,Feuil1!$C$1:$BF$9,9,FALSE)","v":-1000},null,null,null,null,null,null,null,"N.CL.",84,null,{"$f":"IF(AQ38,VLOOKUP(AQ38,FEM!$AS$468:$AT$523,2))","v":2.9809999999999999}]
["F",null,null,null,null,null,null,1934,63,null,null,null,null,null,0,null,null,null,0,0,0,"N.CL.",0,"V8 F70+",{"$f":"IF(AND(H39<1936),VLOOKUP(I39,Feuil1!$F$10:$O$24,9),IF(AND(H39>=1942,H39<1947),VLOOKUP(I39,Feuil1!$F$10:$O$24,9),IF(AND(H39>=1947,H39<1952),VLOOKUP(I39,Feuil1!$F$10:$O$24,8),IF(AND(H39>=1952,H39<1957),VLOOKUP(I39,Feuil1!$F$10:$O$24,7),IF(AND(H39>=1957,H39<1962),VLOOKUP(I39,Feuil1!$F$10:$O$24,6),IF(AND(H39>=1962,H39<1967),VLOOKUP(I39,Feuil1!$F$10:$O$24,5),IF(AND(H39>=1967,H39<1972),VLOOKUP(I39,Feuil1!$F$10:$O$24,4),IF(AND(H39>=1972,H39<1977),VLOOKUP(I39,Feuil1!$F$10:$O$24,3),IF(AND(H39>=1977,H39<1982),VLOOKUP(I39,Feuil1!$F$10:$O$24,2),VLOOKUP(I39,Feuil1!$F$10:$O$24,2))))))))))","v":"VF70+-63"},null,{"$f":"T39-HLOOKUP(Y39,Feuil1!$C$1:$BF$9,2,FALSE)","v":0},{"$f":"T39-HLOOKUP(Y39,Feuil1!$C$1:$BF$9,3,FALSE)","v":-43},{"$f":"T39-HLOOKUP(Y39,Feuil1!$C$1:$BF$9,4,FALSE)","v":-45},{"$f":"T39-HLOOKUP(Y39,Feuil1!$C$1:$BF$9,5,FALSE)","v":-52},{"$f":"T39-HLOOKUP(Y39,Feuil1!$C$1:$BF$9,6,FALSE)","v":-53},{"$f":"T39-HLOOKUP(Y39,Feuil1!$C$1:$BF$9,7,FALSE)","v":-1000},{"$f":"T39-HLOOKUP(Y39,Feuil1!$C$1:$BF$9,8,FALSE)","v":-1000},{"$f":"T39-HLOOKUP(Y39,Feuil1!$C$1:$BF$9,9,FALSE)","v":-1000},null,null,null,null,null,null,null,"N.CL.",83,null,{"$f":"IF(AQ39,VLOOKUP(AQ39,FEM!$AS$468:$AT$523,2))","v":2.831}]
["F",null,null,null,null,null,null,1932,69,null,null,null,null,null,0,null,null,null,0,0,0,"N.CL.",0,"V8 F70+",{"$f":"IF(AND(H40<1936),VLOOKUP(I40,Feuil1!$F$10:$O$24,9),IF(AND(H40>=1942,H40<1947),VLOOKUP(I40,Feuil1!$F$10:$O$24,9),IF(AND(H40>=1947,H40<1952),VLOOKUP(I40,Feuil1!$F$10:$O$24,8),IF(AND(H40>=1952,H40<1957),VLOOKUP(I40,Feuil1!$F$10:$O$24,7),IF(AND(H40>=1957,H40<1962),VLOOKUP(I40,Feuil1!$F$10:$O$24,6),IF(AND(H40>=1962,H40<1967),VLOOKUP(I40,Feuil1!$F$10:$O$24,5),IF(AND(H40>=1967,H40<1972),VLOOKUP(I40,Feuil1!$F$10:$O$24,4),IF(AND(H40>=1972,H40<1977),VLOOKUP(I40,Feuil1!$F$10:$O$24,3),IF(AND(H40>=1977,H40<1982),VLOOKUP(I40,Feuil1!$F$10:$O$24,2),VLOOKUP(I40,Feuil1!$F$10:$O$24,2))))))))))","v":"VF70+-69"},null,{"$f":"T40-HLOOKUP(Y40,Feuil1!$C$1:$BF$9,2,FALSE)","v":0},{"$f":"T40-HLOOKUP(Y40,Feuil1!$C$1:$BF$9,3,FALSE)","v":-45},{"$f":"T40-HLOOKUP(Y40,Feuil1!$C$1:$BF$9,4,FALSE)","v":-48},{"$f":"T40-HLOOKUP(Y40,Feuil1!$C$1:$BF$9,5,FALSE)","v":-55},{"$f":"T40-HLOOKUP(Y40,Feuil1!$C$1:$BF$9,6,FALSE)","v":-56},{"$f":"T40-HLOOKUP(Y40,Feuil1!$C$1:$BF$9,7,FALSE)","v":-1000},{"$f":"T40-HLOOKUP(Y40,Feuil1!$C$1:$BF$9,8,FALSE)","v":-1000},{"$f":"T40-HLOOKUP(Y40,Feuil1!$C$1:$BF$9,9,FALSE)","v":-1000},null,null,null,null,null,null,null,"N.CL.",85,null,{"$f":"IF(AQ40,VLOOKUP(AQ40,FEM!$AS$468:$AT$523,2))","v":3.153}]
["F",null,null,null,null,null,null,1935,75,null,null,null,null,null,0,null,null,null,0,0,0,"N.CL.",0,"V8 F70+",{"$f":"IF(AND(H41<1936),VLOOKUP(I41,Feuil1!$F$10:$O$24,9),IF(AND(H41>=1942,H41<1947),VLOOKUP(I41,Feuil1!$F$10:$O$24,9),IF(AND(H41>=1947,H41<1952),VLOOKUP(I41,Feuil1!$F$10:$O$24,8),IF(AND(H41>=1952,H41<1957),VLOOKUP(I41,Feuil1!$F$10:$O$24,7),IF(AND(H41>=1957,H41<1962),VLOOKUP(I41,Feuil1!$F$10:$O$24,6),IF(AND(H41>=1962,H41<1967),VLOOKUP(I41,Feuil1!$F$10:$O$24,5),IF(AND(H41>=1967,H41<1972),VLOOKUP(I41,Feuil1!$F$10:$O$24,4),IF(AND(H41>=1972,H41<1977),VLOOKUP(I41,Feuil1!$F$10:$O$24,3),IF(AND(H41>=1977,H41<1982),VLOOKUP(I41,Feuil1!$F$10:$O$24,2),VLOOKUP(I41,Feuil1!$F$10:$O$24,2))))))))))","v":"VF70+-75"},null,{"$f":"T41-HLOOKUP(Y41,Feuil1!$C$1:$BF$9,2,FALSE)","v":0},{"$f":"T41-HLOOKUP(Y41,Feuil1!$C$1:$BF$9,3,FALSE)","v":-48},{"$f":"T41-HLOOKUP(Y41,Feuil1!$C$1:$BF$9,4,FALSE)","v":-50},{"$f":"T41-HLOOKUP(Y41,Feuil1!$C$1:$BF$9,5,FALSE)","v":-57},{"$f":"T41-HLOOKUP(Y41,Feuil1!$C$1:$BF$9,6,FALSE)","v":-58},{"$f":"T41-HLOOKUP(Y41,Feuil1!$C$1:$BF$9,7,FALSE)","v":-1000},{"$f":"T41-HLOOKUP(Y41,Feuil1!$C$1:$BF$9,8,FALSE)","v":-1000},{"$f":"T41-HLOOKUP(Y41,Feuil1!$C$1:$BF$9,9,FALSE)","v":-1000},null,null,null,null,null,null,null,"N.CL.",82,null,{"$f":"IF(AQ41,VLOOKUP(AQ41,FEM!$AS$468:$AT$523,2))","v":2.702}]
["F",null,null,null,null,null,null,null,null,null,null,null,null,null,{"$f":"IF(I42=\"\",\"\",IF(MAXA(L42:N42)<=0,0,MAXA(L42:N42)))","v":""},null,null,null,{"$f":"IF(I42=\"\",\"\",IF(MAXA(P42:R42)<=0,0,MAXA(P42:R42)))","v":""},{"$f":"IF(I42=\"\",\"\",IF(OR(O42=0,S42=0),0,O42+S42))","v":""},{"$f":"IF(I42=\"\",\"\",IF(A42=\"H\",10^(0.794358141*LOG(I42/174.393)^2)*T42*AS42,IF(A42=\"F\",10^(0.89726074 * LOG(I42/148.026)^2)*T42*AS42,\"\")))","v":""},{"$f":"IF(I42=\"\",\"\",AP42)","v":""},{"$f":"IF(I42=\"\",\"\",IF(AH42>=0,AH42,IF(AG42>=0,AG42,IF(AF42>=0,AF42,IF(AE42>=0,AE42,IF(AD42>=0,AD42,IF(AC42>=0,AC42,IF(AB42>=0,AB42,AA42))))))))","v":""},{"$f":"IF(AQ42<95,IF(AQ42<=90,VLOOKUP(AQ42,$AQ$467:$AR$522,2)))","v":false},{"$f":"IF(AND(H42<1936),VLOOKUP(I42,Feuil1!$F$10:$O$24,9),IF(AND(H42>=1942,H42<1947),VLOOKUP(I42,Feuil1!$F$10:$O$24,9),IF(AND(H42>=1947,H42<1952),VLOOKUP(I42,Feuil1!$F$10:$O$24,8),IF(AND(H42>=1952,H42<1957),VLOOKUP(I42,Feuil1!$F$10:$O$24,7),IF(AND(H42>=1957,H42<1962),VLOOKUP(I42,Feuil1!$F$10:$O$24,6),IF(AND(H42>=1962,H42<1967),VLOOKUP(I42,Feuil1!$F$10:$O$24,5),IF(AND(H42>=1967,H42<1972),VLOOKUP(I42,Feuil1!$F$10:$O$24,4),IF(AND(H42>=1972,H42<1977),VLOOKUP(I42,Feuil1!$F$10:$O$24,3),IF(AND(H42>=1977,H42<1982),VLOOKUP(I42,Feuil1!$F$10:$O$24,2),VLOOKUP(I42,Feuil1!$F$10:$O$24,2))))))))))","v":{"$error":"#N/A"}},null,{"$f":"T42-HLOOKUP(Y42,Feuil1!$C$1:$BF$9,2,FALSE)","v":{"$error":"#VALUE!"}},{"$f":"T42-HLOOKUP(Y42,Feuil1!$C$1:$BF$9,3,FALSE)","v":{"$error":"#VALUE!"}},{"$f":"T42-HLOOKUP(Y42,Feuil1!$C$1:$BF$9,4,FALSE)","v":{"$error":"#VALUE!"}},{"$f":"T42-HLOOKUP(Y42,Feuil1!$C$1:$BF$9,5,FALSE)","v":{"$error":"#VALUE!"}},{"$f":"T42-HLOOKUP(Y42,Feuil1!$C$1:$BF$9,6,FALSE)","v":{"$error":"#VALUE!"}},{"$f":"T42-HLOOKUP(Y42,Feuil1!$C$1:$BF$9,7,FALSE)","v":{"$error":"#VALUE!"}},{"$f":"T42-HLOOKUP(Y42,Feuil1!$C$1:$BF$9,8,FALSE)","v":{"$error":"#VALUE!"}},{"$f":"T42-HLOOKUP(Y42,Feuil1!$C$1:$BF$9,9,FALSE)","v":{"$error":"#VALUE!"}},null,null,null,null,null,null,null,{"$f":"IF(AH42>=0,$AH$5,IF(AG42>=0,$AG$5,IF(AF42>=0,$AF$5,IF(AE42>=0,$AE$5,IF(AD42>=0,$AD$5,IF(AC42>=0,$AC$5,IF(AB42>=0,$AB$5,IF(AA42>=0,$AA$5,$AI$5))))))))","v":{"$error":"#VALUE!"}},2017,null,{"$f":"IF(AQ42,VLOOKUP(AQ42,FEM!$AS$468:$AT$523,2))","v":4.4930000000000003}]
["F",null,null,null,null,null,null,null,null,null,null,null,null,null,"",null,null,null,"","","","","",false,{"$f":"IF(AND(H43<1936),VLOOKUP(I43,Feuil1!$F$10:$O$24,9),IF(AND(H43>=1942,H43<1947),VLOOKUP(I43,Feuil1!$F$10:$O$24,9),IF(AND(H43>=1947,H43<1952),VLOOKUP(I43,Feuil1!$F$10:$O$24,8),IF(AND(H43>=1952,H43<1957),VLOOKUP(I43,Feuil1!$F$10:$O$24,7),IF(AND(H43>=1957,H43<1962),VLOOKUP(I43,Feuil1!$F$10:$O$24,6),IF(AND(H43>=1962,H43<1967),VLOOKUP(I43,Feuil1!$F$10:$O$24,5),IF(AND(H43>=1967,H43<1972),VLOOKUP(I43,Feuil1!$F$10:$O$24,4),IF(AND(H43>=1972,H43<1977),VLOOKUP(I43,Feuil1!$F$10:$O$24,3),IF(AND(H43>=1977,H43<1982),VLOOKUP(I43,Feuil1!$F$10:$O$24,2),VLOOKUP(I43,Feuil1!$F$10:$O$24,2))))))))))","v":{"$error":"#N/A"}},null,{"$f":"T43-HLOOKUP(Y43,Feuil1!$C$1:$BF$9,2,FALSE)","v":{"$error":"#VALUE!"}},{"$f":"T43-HLOOKUP(Y43,Feuil1!$C$1:$BF$9,3,FALSE)","v":{"$error":"#VALUE!"}},{"$f":"T43-HLOOKUP(Y43,Feuil1!$C$1:$BF$9,4,FALSE)","v":{"$error":"#VALUE!"}},{"$f":"T43-HLOOKUP(Y43,Feuil1!$C$1:$BF$9,5,FALSE)","v":{"$error":"#VALUE!"}},{"$f":"T43-HLOOKUP(Y43,Feuil1!$C$1:$BF$9,6,FALSE)","v":{"$error":"#VALUE!"}},{"$f":"T43-HLOOKUP(Y43,Feuil1!$C$1:$BF$9,7,FALSE)","v":{"$error":"#VALUE!"}},{"$f":"T43-HLOOKUP(Y43,Feuil1!$C$1:$BF$9,8,FALSE)","v":{"$error":"#VALUE!"}},{"$f":"T43-HLOOKUP(Y43,Feuil1!$C$1:$BF$9,9,FALSE)","v":{"$error":"#VALUE!"}},null,null,null,null,null,null,null,{"$error":"#VALUE!"},2017,null,{"$f":"IF(AQ43,VLOOKUP(AQ43,FEM!$AS$468:$AT$523,2))","v":4.4930000000000003}]
["F",null,null,null,null,null,null,null,null,null,null,null,null,null,"",null,null,null,"","","","","",false,{"$f":"IF(AND(H44<1936),VLOOKUP(I44,Feuil1!$F$10:$O$24,9),IF(AND(H44>=1942,H44<1947),VLOOKUP(I44,Feuil1!$F$10:$O$24,9),IF(AND(H44>=1947,H44<1952),VLOOKUP(I44,Feuil1!$F$10:$O$24,8),IF(AND(H44>=1952,H44<1957),VLOOKUP(I44,Feuil1!$F$10:$O$24,7),IF(AND(H44>=1957,H44<1962),VLOOKUP(I44,Feuil1!$F$10:$O$24,6),IF(AND(H44>=1962,H44<1967),VLOOKUP(I44,Feuil1!$F$10:$O$24,5),IF(AND(H44>=1967,H44<1972),VLOOKUP(I44,Feuil1!$F$10:$O$24,4),IF(AND(H44>=1972,H44<1977),VLOOKUP(I44,Feuil1!$F$10:$O$24,3),IF(AND(H44>=1977,H44<1982),VLOOKUP(I44,Feuil1!$F$10:$O$24,2),VLOOKUP(I44,Feuil1!$F$10:$O$24,2))))))))))","v":{"$error":"#N/A"}},null,{"$f":"T44-HLOOKUP(Y44,Feuil1!$C$1:$BF$9,2,FALSE)","v":{"$error":"#VALUE!"}},{"$f":"T44-HLOOKUP(Y44,Feuil1!$C$1:$BF$9,3,FALSE)","v":{"$error":"#VALUE!"}},{"$f":"T44-HLOOKUP(Y44,Feuil1!$C$1:$BF$9,4,FALSE)","v":{"$error":"#VALUE!"}},{"$f":"T44-HLOOKUP(Y44,Feuil1!$C$1:$BF$9,5,FALSE)","v":{"$error":"#VALUE!"}},{"$f":"T44-HLOOKUP(Y44,Feuil1!$C$1:$BF$9,6,FALSE)","v":{"$error":"#VALUE!"}},{"$f":"T44-HLOOKUP(Y44,Feuil1!$C$1:$BF$9,7,FALSE)","v":{"$error":"#VALUE!"}},{"$f":"T44-HLOOKUP(Y44,Feuil1!$C$1:$BF$9,8,FALSE)","v":{"$error":"#VALUE!"}},{"$f":"T44-HLOOKUP(Y44,Feuil1!$C$1:$BF$9,9,FALSE)","v":{"$error":"#VALUE!"}},null,null,null,null,null,null,null,{"$error":"#VALUE!"},2017,null,{"$f":"IF(AQ44,VLOOKUP(AQ44,FEM!$AS$468:$AT$523,2))","v":4.4930000000000003}]
["F",null,null,null,null,null,null,null,null,null,null,null,null,null,"",null,null,null,"","","","","",false,{"$f":"IF(AND(H45<1936),VLOOKUP(I45,Feuil1!$F$10:$O$24,9),IF(AND(H45>=1942,H45<1947),VLOOKUP(I45,Feuil1!$F$10:$O$24,9),IF(AND(H45>=1947,H45<1952),VLOOKUP(I45,Feuil1!$F$10:$O$24,8),IF(AND(H45>=1952,H45<1957),VLOOKUP(I45,Feuil1!$F$10:$O$24,7),IF(AND(H45>=1957,H45<1962),VLOOKUP(I45,Feuil1!$F$10:$O$24,6),IF(AND(H45>=1962,H45<1967),VLOOKUP(I45,Feuil1!$F$10:$O$24,5),IF(AND(H45>=1967,H45<1972),VLOOKUP(I45,Feuil1!$F$10:$O$24,4),IF(AND(H45>=1972,H45<1977),VLOOKUP(I45,Feuil1!$F$10:$O$24,3),IF(AND(H45>=1977,H45<1982),VLOOKUP(I45,Feuil1!$F$10:$O$24,2),VLOOKUP(I45,Feuil1!$F$10:$O$24,2))))))))))","v":{"$error":"#N/A"}},null,{"$f":"T45-HLOOKUP(Y45,Feuil1!$C$1:$BF$9,2,FALSE)","v":{"$error":"#VALUE!"}},{"$f":"T45-HLOOKUP(Y45,Feuil1!$C$1:$BF$9,3,FALSE)","v":{"$error":"#VALUE!"}},{"$f":"T45-HLOOKUP(Y45,Feuil1!$C$1:$BF$9,4,FALSE)","v":{"$error":"#VALUE!"}},{"$f":"T45-HLOOKUP(Y45,Feuil1!$C$1:$BF$9,5,FALSE)","v":{"$error":"#VALUE!"}},{"$f":"T45-HLOOKUP(Y45,Feuil1!$C$1:$BF$9,6,FALSE)","v":{"$error":"#VALUE!"}},{"$f":"T45-HLOOKUP(Y45,Feuil1!$C$1:$BF$9,7,FALSE)","v":{"$error":"#VALUE!"}},{"$f":"T45-HLOOKUP(Y45,Feuil1!$C$1:$BF$9,8,FALSE)","v":{"$error":"#VALUE!"}},{"$f":"T45-HLOOKUP(Y45,Feuil1!$C$1:$BF$9,9,FALSE)","v":{"$error":"#VALUE!"}},null,null,null,null,null,null,null,{"$error":"#VALUE!"},2017,null,{"$f":"IF(AQ45,VLOOKUP(AQ45,FEM!$AS$468:$AT$523,2))","v":4.4930000000000003}]
["F",null,null,null,null,null,null,null,null,null,null,null,null,null,"",null,null,null,"","","","","",false,{"$f":"IF(AND(H46<1936),VLOOKUP(I46,Feuil1!$F$10:$O$24,9),IF(AND(H46>=1942,H46<1947),VLOOKUP(I46,Feuil1!$F$10:$O$24,9),IF(AND(H46>=1947,H46<1952),VLOOKUP(I46,Feuil1!$F$10:$O$24,8),IF(AND(H46>=1952,H46<1957),VLOOKUP(I46,Feuil1!$F$10:$O$24,7),IF(AND(H46>=1957,H46<1962),VLOOKUP(I46,Feuil1!$F$10:$O$24,6),IF(AND(H46>=1962,H46<1967),VLOOKUP(I46,Feuil1!$F$10:$O$24,5),IF(AND(H46>=1967,H46<1972),VLOOKUP(I46,Feuil1!$F$10:$O$24,4),IF(AND(H46>=1972,H46<1977),VLOOKUP(I46,Feuil1!$F$10:$O$24,3),IF(AND(H46>=1977,H46<1982),VLOOKUP(I46,Feuil1!$F$10:$O$24,2),VLOOKUP(I46,Feuil1!$F$10:$O$24,2))))))))))","v":{"$error":"#N/A"}},null,{"$f":"T46-HLOOKUP(Y46,Feuil1!$C$1:$BF$9,2,FALSE)","v":{"$error":"#VALUE!"}},{"$f":"T46-HLOOKUP(Y46,Feuil1!$C$1:$BF$9,3,FALSE)","v":{"$error":"#VALUE!"}},{"$f":"T46-HLOOKUP(Y46,Feuil1!$C$1:$BF$9,4,FALSE)","v":{"$error":"#VALUE!"}},{"$f":"T46-HLOOKUP(Y46,Feuil1!$C$1:$BF$9,5,FALSE)","v":{"$error":"#VALUE!"}},{"$f":"T46-HLOOKUP(Y46,Feuil1!$C$1:$BF$9,6,FALSE)","v":{"$error":"#VALUE!"}},{"$f":"T46-HLOOKUP(Y46,Feuil1!$C$1:$BF$9,7,FALSE)","v":{"$error":"#VALUE!"}},{"$f":"T46-HLOOKUP(Y46,Feuil1!$C$1:$BF$9,8,FALSE)","v":{"$error":"#VALUE!"}},{"$f":"T46-HLOOKUP(Y46,Feuil1!$C$1:$BF$9,9,FALSE)","v":{"$error":"#VALUE!"}},null,null,null,null,null,null,null,{"$error":"#VALUE!"},2017,null,{"$f":"IF(AQ46,VLOOKUP(AQ46,FEM!$AS$468:$AT$523,2))","v":4.4930000000000003}]
["F",null,null,null,null,null,null,null,null,null,null,null,null,null,"",null,null,null,"","","","","",false,{"$f":"IF(AND(H47<1936),VLOOKUP(I47,Feuil1!$F$10:$O$24,9),IF(AND(H47>=1942,H47<1947),VLOOKUP(I47,Feuil1!$F$10:$O$24,9),IF(AND(H47>=1947,H47<1952),VLOOKUP(I47,Feuil1!$F$10:$O$24,8),IF(AND(H47>=1952,H47<1957),VLOOKUP(I47,Feuil1!$F$10:$O$24,7),IF(AND(H47>=1957,H47<1962),VLOOKUP(I47,Feuil1!$F$10:$O$24,6),IF(AND(H47>=1962,H47<1967),VLOOKUP(I47,Feuil1!$F$10:$O$24,5),IF(AND(H47>=1967,H47<1972),VLOOKUP(I47,Feuil1!$F$10:$O$24,4),IF(AND(H47>=1972,H47<1977),VLOOKUP(I47,Feuil1!$F$10:$O$24,3),IF(AND(H47>=1977,H47<1982),VLOOKUP(I47,Feuil1!$F$10:$O$24,2),VLOOKUP(I47,Feuil1!$F$10:$O$24,2))))))))))","v":{"$error":"#N/A"}},null,{"$f":"T47-HLOOKUP(Y47,Feuil1!$C$1:$BF$9,2,FALSE)","v":{"$error":"#VALUE!"}},{"$f":"T47-HLOOKUP(Y47,Feuil1!$C$1:$BF$9,3,FALSE)","v":{"$error":"#VALUE!"}},{"$f":"T47-HLOOKUP(Y47,Feuil1!$C$1:$BF$9,4,FALSE)","v":{"$error":"#VALUE!"}},{"$f":"T47-HLOOKUP(Y47,Feuil1!$C$1:$BF$9,5,FALSE)","v":{"$error":"#VALUE!"}},{"$f":"T47-HLOOKUP(Y47,Feuil1!$C$1:$BF$9,6,FALSE)","v":{"$error":"#VALUE!"}},{"$f":"T47-HLOOKUP(Y47,Feuil1!$C$1:$BF$9,7,FALSE)","v":{"$error":"#VALUE!"}},{"$f":"T47-HLOOKUP(Y47,Feuil1!$C$1:$BF$9,8,FALSE)","v":{"$error":"#VALUE!"}},{"$f":"T47-HLOOKUP(Y47,Feuil1!$C$1:$BF$9,9,FALSE)","v":{"$error":"#VALUE!"}},null,null,null,null,null,null,null,{"$error":"#VALUE!"},2017,null,{"$f":"IF(AQ47,VLOOKUP(AQ47,FEM!$AS$468:$AT$523,2))","v":4.4930000000000003}]
["F",null,null,null,null,null,null,null,null,null,null,null,null,null,"",null,null,null,"","","","","",false,{"$f":"IF(AND(H48<1936),VLOOKUP(I48,Feuil1!$F$10:$O$24,9),IF(AND(H48>=1942,H48<1947),VLOOKUP(I48,Feuil1!$F$10:$O$24,9),IF(AND(H48>=1947,H48<1952),VLOOKUP(I48,Feuil1!$F$10:$O$24,8),IF(AND(H48>=1952,H48<1957),VLOOKUP(I48,Feuil1!$F$10:$O$24,7),IF(AND(H48>=1957,H48<1962),VLOOKUP(I48,Feuil1!$F$10:$O$24,6),IF(AND(H48>=1962,H48<1967),VLOOKUP(I48,Feuil1!$F$10:$O$24,5),IF(AND(H48>=1967,H48<1972),VLOOKUP(I48,Feuil1!$F$10:$O$24,4),IF(AND(H48>=1972,H48<1977),VLOOKUP(I48,Feuil1!$F$10:$O$24,3),IF(AND(H48>=1977,H48<1982),VLOOKUP(I48,Feuil1!$F$10:$O$24,2),VLOOKUP(I48,Feuil1!$F$10:$O$24,2))))))))))","v":{"$error":"#N/A"}},null,{"$f":"T48-HLOOKUP(Y48,Feuil1!$C$1:$BF$9,2,FALSE)","v":{"$error":"#VALUE!"}},{"$f":"T48-HLOOKUP(Y48,Feuil1!$C$1:$BF$9,3,FALSE)","v":{"$error":"#VALUE!"}},{"$f":"T48-HLOOKUP(Y48,Feuil1!$C$1:$BF$9,4,FALSE)","v":{"$error":"#VALUE!"}},{"$f":"T48-HLOOKUP(Y48,Feuil1!$C$1:$BF$9,5,FALSE)","v":{"$error":"#VALUE!"}},{"$f":"T48-HLOOKUP(Y48,Feuil1!$C$1:$BF$9,6,FALSE)","v":{"$error":"#VALUE!"}},{"$f":"T48-HLOOKUP(Y48,Feuil1!$C$1:$BF$9,7,FALSE)","v":{"$error":"#VALUE!"}},{"$f":"T48-HLOOKUP(Y48,Feuil1!$C$1:$BF$9,8,FALSE)","v":{"$error":"#VALUE!"}},{"$f":"T48-HLOOKUP(Y48,Feuil1!$C$1:$BF$9,9,FALSE)","v":{"$error":"#VALUE!"}},null,null,null,null,null,null,null,{"$error":"#VALUE!"},2017,null,{"$f":"IF(AQ48,VLOOKUP(AQ48,FEM!$AS$468:$AT$523,2))","v":4.4930000000000003}]
["F",null,null,null,null,null,null,null,null,null,null,null,null,null,"",null,null,null,"","","","","",false,{"$f":"IF(AND(H49<1936),VLOOKUP(I49,Feuil1!$F$10:$O$24,9),IF(AND(H49>=1942,H49<1947),VLOOKUP(I49,Feuil1!$F$10:$O$24,9),IF(AND(H49>=1947,H49<1952),VLOOKUP(I49,Feuil1!$F$10:$O$24,8),IF(AND(H49>=1952,H49<1957),VLOOKUP(I49,Feuil1!$F$10:$O$24,7),IF(AND(H49>=1957,H49<1962),VLOOKUP(I49,Feuil1!$F$10:$O$24,6),IF(AND(H49>=1962,H49<1967),VLOOKUP(I49,Feuil1!$F$10:$O$24,5),IF(AND(H49>=1967,H49<1972),VLOOKUP(I49,Feuil1!$F$10:$O$24,4),IF(AND(H49>=1972,H49<1977),VLOOKUP(I49,Feuil1!$F$10:$O$24,3),IF(AND(H49>=1977,H49<1982),VLOOKUP(I49,Feuil1!$F$10:$O$24,2),VLOOKUP(I49,Feuil1!$F$10:$O$24,2))))))))))","v":{"$error":"#N/A"}},null,{"$f":"T49-HLOOKUP(Y49,Feuil1!$C$1:$BF$9,2,FALSE)","v":{"$error":"#VALUE!"}},{"$f":"T49-HLOOKUP(Y49,Feuil1!$C$1:$BF$9,3,FALSE)","v":{"$error":"#VALUE!"}},{"$f":"T49-HLOOKUP(Y49,Feuil1!$C$1:$BF$9,4,FALSE)","v":{"$error":"#VALUE!"}},{"$f":"T49-HLOOKUP(Y49,Feuil1!$C$1:$BF$9,5,FALSE)","v":{"$error":"#VALUE!"}},{"$f":"T49-HLOOKUP(Y49,Feuil1!$C$1:$BF$9,6,FALSE)","v":{"$error":"#VALUE!"}},{"$f":"T49-HLOOKUP(Y49,Feuil1!$C$1:$BF$9,7,FALSE)","v":{"$error":"#VALUE!"}},{"$f":"T49-HLOOKUP(Y49,Feuil1!$C$1:$BF$9,8,FALSE)","v":{"$error":"#VALUE!"}},{"$f":"T49-HLOOKUP(Y49,Feuil1!$C$1:$BF$9,9,FALSE)","v":{"$error":"#VALUE!"}},null,null,null,null,null,null,null,{"$error":"#VALUE!"},2017,null,{"$f":"IF(AQ49,VLOOKUP(AQ49,FEM!$AS$468:$AT$523,2))","v":4.4930000000000003}]
["F",null,null,null,null,null,null,null,null,null,null,null,null,null,"",null,null,null,"","","","","",false,{"$f":"IF(AND(H50<1936),VLOOKUP(I50,Feuil1!$F$10:$O$24,9),IF(AND(H50>=1942,H50<1947),VLOOKUP(I50,Feuil1!$F$10:$O$24,9),IF(AND(H50>=1947,H50<1952),VLOOKUP(I50,Feuil1!$F$10:$O$24,8),IF(AND(H50>=1952,H50<1957),VLOOKUP(I50,Feuil1!$F$10:$O$24,7),IF(AND(H50>=1957,H50<1962),VLOOKUP(I50,Feuil1!$F$10:$O$24,6),IF(AND(H50>=1962,H50<1967),VLOOKUP(I50,Feuil1!$F$10:$O$24,5),IF(AND(H50>=1967,H50<1972),VLOOKUP(I50,Feuil1!$F$10:$O$24,4),IF(AND(H50>=1972,H50<1977),VLOOKUP(I50,Feuil1!$F$10:$O$24,3),IF(AND(H50>=1977,H50<1982),VLOOKUP(I50,Feuil1!$F$10:$O$24,2),VLOOKUP(I50,Feuil1!$F$10:$O$24,2))))))))))","v":{"$error":"#N/A"}},null,{"$f":"T50-HLOOKUP(Y50,Feuil1!$C$1:$BF$9,2,FALSE)","v":{"$error":"#VALUE!"}},{"$f":"T50-HLOOKUP(Y50,Feuil1!$C$1:$BF$9,3,FALSE)","v":{"$error":"#VALUE!"}},{"$f":"T50-HLOOKUP(Y50,Feuil1!$C$1:$BF$9,4,FALSE)","v":{"$error":"#VALUE!"}},{"$f":"T50-HLOOKUP(Y50,Feuil1!$C$1:$BF$9,5,FALSE)","v":{"$error":"#VALUE!"}},{"$f":"T50-HLOOKUP(Y50,Feuil1!$C$1:$BF$9,6,FALSE)","v":{"$error":"#VALUE!"}},{"$f":"T50-HLOOKUP(Y50,Feuil1!$C$1:$BF$9,7,FALSE)","v":{"$error":"#VALUE!"}},{"$f":"T50-HLOOKUP(Y50,Feuil1!$C$1:$BF$9,8,FALSE)","v":{"$error":"#VALUE!"}},{"$f":"T50-HLOOKUP(Y50,Feuil1!$C$1:$BF$9,9,FALSE)","v":{"$error":"#VALUE!"}},null,null,null,null,null,null,null,{"$error":"#VALUE!"},2017,null,{"$f":"IF(AQ50,VLOOKUP(AQ50,FEM!$AS$468:$AT$523,2))","v":4.4930000000000003}]
["F",null,null,null,null,null,null,null,null,null,null,null,null,null,"",null,null,null,"","","","","",false,{"$f":"IF(AND(H51<1936),VLOOKUP(I51,Feuil1!$F$10:$O$24,9),IF(AND(H51>=1942,H51<1947),VLOOKUP(I51,Feuil1!$F$10:$O$24,9),IF(AND(H51>=1947,H51<1952),VLOOKUP(I51,Feuil1!$F$10:$O$24,8),IF(AND(H51>=1952,H51<1957),VLOOKUP(I51,Feuil1!$F$10:$O$24,7),IF(AND(H51>=1957,H51<1962),VLOOKUP(I51,Feuil1!$F$10:$O$24,6),IF(AND(H51>=1962,H51<1967),VLOOKUP(I51,Feuil1!$F$10:$O$24,5),IF(AND(H51>=1967,H51<1972),VLOOKUP(I51,Feuil1!$F$10:$O$24,4),IF(AND(H51>=1972,H51<1977),VLOOKUP(I51,Feuil1!$F$10:$O$24,3),IF(AND(H51>=1977,H51<1982),VLOOKUP(I51,Feuil1!$F$10:$O$24,2),VLOOKUP(I51,Feuil1!$F$10:$O$24,2))))))))))","v":{"$error":"#N/A"}},null,{"$f":"T51-HLOOKUP(Y51,Feuil1!$C$1:$BF$9,2,FALSE)","v":{"$error":"#VALUE!"}},{"$f":"T51-HLOOKUP(Y51,Feuil1!$C$1:$BF$9,3,FALSE)","v":{"$error":"#VALUE!"}},{"$f":"T51-HLOOKUP(Y51,Feuil1!$C$1:$BF$9,4,FALSE)","v":{"$error":"#VALUE!"}},{"$f":"T51-HLOOKUP(Y51,Feuil1!$C$1:$BF$9,5,FALSE)","v":{"$error":"#VALUE!"}},{"$f":"T51-HLOOKUP(Y51,Feuil1!$C$1:$BF$9,6,FALSE)","v":{"$error":"#VALUE!"}},{"$f":"T51-HLOOKUP(Y51,Feuil1!$C$1:$BF$9,7,FALSE)","v":{"$error":"#VALUE!"}},{"$f":"T51-HLOOKUP(Y51,Feuil1!$C$1:$BF$9,8,FALSE)","v":{"$error":"#VALUE!"}},{"$f":"T51-HLOOKUP(Y51,Feuil1!$C$1:$BF$9,9,FALSE)","v":{"$error":"#VALUE!"}},null,null,null,null,null,null,null,{"$error":"#VALUE!"},2017,null,{"$f":"IF(AQ51,VLOOKUP(AQ51,FEM!$AS$468:$AT$523,2))","v":4.4930000000000003}]
["F",null,null,null,null,null,null,null,null,null,null,null,null,null,"",null,null,null,"","","","","",false,{"$f":"IF(AND(H52<1936),VLOOKUP(I52,Feuil1!$F$10:$O$24,9),IF(AND(H52>=1942,H52<1947),VLOOKUP(I52,Feuil1!$F$10:$O$24,9),IF(AND(H52>=1947,H52<1952),VLOOKUP(I52,Feuil1!$F$10:$O$24,8),IF(AND(H52>=1952,H52<1957),VLOOKUP(I52,Feuil1!$F$10:$O$24,7),IF(AND(H52>=1957,H52<1962),VLOOKUP(I52,Feuil1!$F$10:$O$24,6),IF(AND(H52>=1962,H52<1967),VLOOKUP(I52,Feuil1!$F$10:$O$24,5),IF(AND(H52>=1967,H52<1972),VLOOKUP(I52,Feuil1!$F$10:$O$24,4),IF(AND(H52>=1972,H52<1977),VLOOKUP(I52,Feuil1!$F$10:$O$24,3),IF(AND(H52>=1977,H52<1982),VLOOKUP(I52,Feuil1!$F$10:$O$24,2),VLOOKUP(I52,Feuil1!$F$10:$O$24,2))))))))))","v":{"$error":"#N/A"}},null,{"$f":"T52-HLOOKUP(Y52,Feuil1!$C$1:$BF$9,2,FALSE)","v":{"$error":"#VALUE!"}},{"$f":"T52-HLOOKUP(Y52,Feuil1!$C$1:$BF$9,3,FALSE)","v":{"$error":"#VALUE!"}},{"$f":"T52-HLOOKUP(Y52,Feuil1!$C$1:$BF$9,4,FALSE)","v":{"$error":"#VALUE!"}},{"$f":"T52-HLOOKUP(Y52,Feuil1!$C$1:$BF$9,5,FALSE)","v":{"$error":"#VALUE!"}},{"$f":"T52-HLOOKUP(Y52,Feuil1!$C$1:$BF$9,6,FALSE)","v":{"$error":"#VALUE!"}},{"$f":"T52-HLOOKUP(Y52,Feuil1!$C$1:$BF$9,7,FALSE)","v":{"$error":"#VALUE!"}},{"$f":"T52-HLOOKUP(Y52,Feuil1!$C$1:$BF$9,8,FALSE)","v":{"$error":"#VALUE!"}},{"$f":"T52-HLOOKUP(Y52,Feuil1!$C$1:$BF$9,9,FALSE)","v":{"$error":"#VALUE!"}},null,null,null,null,null,null,null,{"$error":"#VALUE!"},2017,null,{"$f":"IF(AQ52,VLOOKUP(AQ52,FEM!$AS$468:$AT$523,2))","v":4.4930000000000003}]
["F",null,null,null,null,null,null,null,null,null,null,null,null,null,"",null,null,null,"","","","","",false,{"$f":"IF(AND(H53<1936),VLOOKUP(I53,Feuil1!$F$10:$O$24,9),IF(AND(H53>=1942,H53<1947),VLOOKUP(I53,Feuil1!$F$10:$O$24,9),IF(AND(H53>=1947,H53<1952),VLOOKUP(I53,Feuil1!$F$10:$O$24,8),IF(AND(H53>=1952,H53<1957),VLOOKUP(I53,Feuil1!$F$10:$O$24,7),IF(AND(H53>=1957,H53<1962),VLOOKUP(I53,Feuil1!$F$10:$O$24,6),IF(AND(H53>=1962,H53<1967),VLOOKUP(I53,Feuil1!$F$10:$O$24,5),IF(AND(H53>=1967,H53<1972),VLOOKUP(I53,Feuil1!$F$10:$O$24,4),IF(AND(H53>=1972,H53<1977),VLOOKUP(I53,Feuil1!$F$10:$O$24,3),IF(AND(H53>=1977,H53<1982),VLOOKUP(I53,Feuil1!$F$10:$O$24,2),VLOOKUP(I53,Feuil1!$F$10:$O$24,2))))))))))","v":{"$error":"#N/A"}},null,{"$f":"T53-HLOOKUP(Y53,Feuil1!$C$1:$BF$9,2,FALSE)","v":{"$error":"#VALUE!"}},{"$f":"T53-HLOOKUP(Y53,Feuil1!$C$1:$BF$9,3,FALSE)","v":{"$error":"#VALUE!"}},{"$f":"T53-HLOOKUP(Y53,Feuil1!$C$1:$BF$9,4,FALSE)","v":{"$error":"#VALUE!"}},{"$f":"T53-HLOOKUP(Y53,Feuil1!$C$1:$BF$9,5,FALSE)","v":{"$error":"#VALUE!"}},{"$f":"T53-HLOOKUP(Y53,Feuil1!$C$1:$BF$9,6,FALSE)","v":{"$error":"#VALUE!"}},{"$f":"T53-HLOOKUP(Y53,Feuil1!$C$1:$BF$9,7,FALSE)","v":{"$error":"#VALUE!"}},{"$f":"T53-HLOOKUP(Y53,Feuil1!$C$1:$BF$9,8,FALSE)","v":{"$error":"#VALUE!"}},{"$f":"T53-HLOOKUP(Y53,Feuil1!$C$1:$BF$9,9,FALSE)","v":{"$error":"#VALUE!"}},null,null,null,null,null,null,null,{"$error":"#VALUE!"},2017,null,{"$f":"IF(AQ53,VLOOKUP(AQ53,FEM!$AS$468:$AT$523,2))","v":4.4930000000000003}]
["F",null,null,null,null,null,null,null,null,null,null,null,null,null,"",null,null,null,"","","","","",false,{"$f":"IF(AND(H54<1936),VLOOKUP(I54,Feuil1!$F$10:$O$24,9),IF(AND(H54>=1942,H54<1947),VLOOKUP(I54,Feuil1!$F$10:$O$24,9),IF(AND(H54>=1947,H54<1952),VLOOKUP(I54,Feuil1!$F$10:$O$24,8),IF(AND(H54>=1952,H54<1957),VLOOKUP(I54,Feuil1!$F$10:$O$24,7),IF(AND(H54>=1957,H54<1962),VLOOKUP(I54,Feuil1!$F$10:$O$24,6),IF(AND(H54>=1962,H54<1967),VLOOKUP(I54,Feuil1!$F$10:$O$24,5),IF(AND(H54>=1967,H54<1972),VLOOKUP(I54,Feuil1!$F$10:$O$24,4),IF(AND(H54>=1972,H54<1977),VLOOKUP(I54,Feuil1!$F$10:$O$24,3),IF(AND(H54>=1977,H54<1982),VLOOKUP(I54,Feuil1!$F$10:$O$24,2),VLOOKUP(I54,Feuil1!$F$10:$O$24,2))))))))))","v":{"$error":"#N/A"}},null,{"$f":"T54-HLOOKUP(Y54,Feuil1!$C$1:$BF$9,2,FALSE)","v":{"$error":"#VALUE!"}},{"$f":"T54-HLOOKUP(Y54,Feuil1!$C$1:$BF$9,3,FALSE)","v":{"$error":"#VALUE!"}},{"$f":"T54-HLOOKUP(Y54,Feuil1!$C$1:$BF$9,4,FALSE)","v":{"$error":"#VALUE!"}},{"$f":"T54-HLOOKUP(Y54,Feuil1!$C$1:$BF$9,5,FALSE)","v":{"$error":"#VALUE!"}},{"$f":"T54-HLOOKUP(Y54,Feuil1!$C$1:$BF$9,6,FALSE)","v":{"$error":"#VALUE!"}},{"$f":"T54-HLOOKUP(Y54,Feuil1!$C$1:$BF$9,7,FALSE)","v":{"$error":"#VALUE!"}},{"$f":"T54-HLOOKUP(Y54,Feuil1!$C$1:$BF$9,8,FALSE)","v":{"$error":"#VALUE!"}},{"$f":"T54-HLOOKUP(Y54,Feuil1!$C$1:$BF$9,9,FALSE)","v":{"$error":"#VALUE!"}},null,null,null,null,null,null,null,{"$error":"#VALUE!"},2017,null,{"$f":"IF(AQ54,VLOOKUP(AQ54,FEM!$AS$468:$AT$523,2))","v":4.4930000000000003}]
["F",null,null,null,null,null,null,null,null,null,null,null,null,null,"",null,null,null,"","","","","",false,{"$f":"IF(AND(H55<1936),VLOOKUP(I55,Feuil1!$F$10:$O$24,9),IF(AND(H55>=1942,H55<1947),VLOOKUP(I55,Feuil1!$F$10:$O$24,9),IF(AND(H55>=1947,H55<1952),VLOOKUP(I55,Feuil1!$F$10:$O$24,8),IF(AND(H55>=1952,H55<1957),VLOOKUP(I55,Feuil1!$F$10:$O$24,7),IF(AND(H55>=1957,H55<1962),VLOOKUP(I55,Feuil1!$F$10:$O$24,6),IF(AND(H55>=1962,H55<1967),VLOOKUP(I55,Feuil1!$F$10:$O$24,5),IF(AND(H55>=1967,H55<1972),VLOOKUP(I55,Feuil1!$F$10:$O$24,4),IF(AND(H55>=1972,H55<1977),VLOOKUP(I55,Feuil1!$F$10:$O$24,3),IF(AND(H55>=1977,H55<1982),VLOOKUP(I55,Feuil1!$F$10:$O$24,2),VLOOKUP(I55,Feuil1!$F$10:$O$24,2))))))))))","v":{"$error":"#N/A"}},null,{"$f":"T55-HLOOKUP(Y55,Feuil1!$C$1:$BF$9,2,FALSE)","v":{"$error":"#VALUE!"}},{"$f":"T55-HLOOKUP(Y55,Feuil1!$C$1:$BF$9,3,FALSE)","v":{"$error":"#VALUE!"}},{"$f":"T55-HLOOKUP(Y55,Feuil1!$C$1:$BF$9,4,FALSE)","v":{"$error":"#VALUE!"}},{"$f":"T55-HLOOKUP(Y55,Feuil1!$C$1:$BF$9,5,FALSE)","v":{"$error":"#VALUE!"}},{"$f":"T55-HLOOKUP(Y55,Feuil1!$C$1:$BF$9,6,FALSE)","v":{"$error":"#VALUE!"}},{"$f":"T55-HLOOKUP(Y55,Feuil1!$C$1:$BF$9,7,FALSE)","v":{"$error":"#VALUE!"}},{"$f":"T55-HLOOKUP(Y55,Feuil1!$C$1:$BF$9,8,FALSE)","v":{"$error":"#VALUE!"}},{"$f":"T55-HLOOKUP(Y55,Feuil1!$C$1:$BF$9,9,FALSE)","v":{"$error":"#VALUE!"}},null,null,null,null,null,null,null,{"$error":"#VALUE!"},2017,null,{"$f":"IF(AQ55,VLOOKUP(AQ55,FEM!$AS$468:$AT$523,2))","v":4.4930000000000003}]
["F",null,null,null,null,null,null,1945,48,null,null,17,null,null,17,19,null,null,19,36,115.25069481772195,"REG +",0,"V8 F70+",{"$f":"IF(AND(H56<1936),VLOOKUP(I56,Feuil1!$F$10:$O$24,9),IF(AND(H56>=1942,H56<1947),VLOOKUP(I56,Feuil1!$F$10:$O$24,9),IF(AND(H56>=1947,H56<1952),VLOOKUP(I56,Feuil1!$F$10:$O$24,8),IF(AND(H56>=1952,H56<1957),VLOOKUP(I56,Feuil1!$F$10:$O$24,7),IF(AND(H56>=1957,H56<1962),VLOOKUP(I56,Feuil1!$F$10:$O$24,6),IF(AND(H56>=1962,H56<1967),VLOOKUP(I56,Feuil1!$F$10:$O$24,5),IF(AND(H56>=1967,H56<1972),VLOOKUP(I56,Feuil1!$F$10:$O$24,4),IF(AND(H56>=1972,H56<1977),VLOOKUP(I56,Feuil1!$F$10:$O$24,3),IF(AND(H56>=1977,H56<1982),VLOOKUP(I56,Feuil1!$F$10:$O$24,2),VLOOKUP(I56,Feuil1!$F$10:$O$24,2))))))))))","v":"VF70+-48"},null,{"$f":"T56-HLOOKUP(Y56,Feuil1!$C$1:$BF$9,2,FALSE)","v":{"$error":"#VALUE!"}},{"$f":"T56-HLOOKUP(Y56,Feuil1!$C$1:$BF$9,3,FALSE)","v":0},{"$f":"T56-HLOOKUP(Y56,Feuil1!$C$1:$BF$9,4,FALSE)","v":-2},{"$f":"T56-HLOOKUP(Y56,Feuil1!$C$1:$BF$9,5,FALSE)","v":-9},{"$f":"T56-HLOOKUP(Y56,Feuil1!$C$1:$BF$9,6,FALSE)","v":-10},{"$f":"T56-HLOOKUP(Y56,Feuil1!$C$1:$BF$9,7,FALSE)","v":-964},{"$f":"T56-HLOOKUP(Y56,Feuil1!$C$1:$BF$9,8,FALSE)","v":-964},{"$f":"T56-HLOOKUP(Y56,Feuil1!$C$1:$BF$9,9,FALSE)","v":-964},null,null,null,null,null,null,null,"REG +",72,null,{"$f":"IF(AQ56,VLOOKUP(AQ56,FEM!$AS$468:$AT$523,2))","v":1.9530000000000001}]
["F",null,null,null,null,null,null,null,null,null,null,null,null,null,"",null,null,null,"","","","","",false,{"$f":"IF(AND(H57<1936),VLOOKUP(I57,Feuil1!$F$10:$O$24,9),IF(AND(H57>=1942,H57<1947),VLOOKUP(I57,Feuil1!$F$10:$O$24,9),IF(AND(H57>=1947,H57<1952),VLOOKUP(I57,Feuil1!$F$10:$O$24,8),IF(AND(H57>=1952,H57<1957),VLOOKUP(I57,Feuil1!$F$10:$O$24,7),IF(AND(H57>=1957,H57<1962),VLOOKUP(I57,Feuil1!$F$10:$O$24,6),IF(AND(H57>=1962,H57<1967),VLOOKUP(I57,Feuil1!$F$10:$O$24,5),IF(AND(H57>=1967,H57<1972),VLOOKUP(I57,Feuil1!$F$10:$O$24,4),IF(AND(H57>=1972,H57<1977),VLOOKUP(I57,Feuil1!$F$10:$O$24,3),IF(AND(H57>=1977,H57<1982),VLOOKUP(I57,Feuil1!$F$10:$O$24,2),VLOOKUP(I57,Feuil1!$F$10:$O$24,2))))))))))","v":{"$error":"#N/A"}},null,{"$f":"T57-HLOOKUP(Y57,Feuil1!$C$1:$BF$9,2,FALSE)","v":{"$error":"#VALUE!"}},{"$f":"T57-HLOOKUP(Y57,Feuil1!$C$1:$BF$9,3,FALSE)","v":{"$error":"#VALUE!"}},{"$f":"T57-HLOOKUP(Y57,Feuil1!$C$1:$BF$9,4,FALSE)","v":{"$error":"#VALUE!"}},{"$f":"T57-HLOOKUP(Y57,Feuil1!$C$1:$BF$9,5,FALSE)","v":{"$error":"#VALUE!"}},{"$f":"T57-HLOOKUP(Y57,Feuil1!$C$1:$BF$9,6,FALSE)","v":{"$error":"#VALUE!"}},{"$f":"T57-HLOOKUP(Y57,Feuil1!$C$1:$BF$9,7,FALSE)","v":{"$error":"#VALUE!"}},{"$f":"T57-HLOOKUP(Y57,Feuil1!$C$1:$BF$9,8,FALSE)","v":{"$error":"#VALUE!"}},{"$f":"T57-HLOOKUP(Y57,Feuil1!$C$1:$BF$9,9,FALSE)","v":{"$error":"#VALUE!"}},null,null,null,null,null,null,null,{"$error":"#VALUE!"},2017,null,{"$f":"IF(AQ57,VLOOKUP(AQ57,FEM!$AS$468:$AT$523,2))","v":4.4930000000000003}]
["F",null,null,null,null,null,null,null,null,null,null,null,null,null,"",null,null,null,"","","","","",false,{"$f":"IF(AND(H58<1936),VLOOKUP(I58,Feuil1!$F$10:$O$24,9),IF(AND(H58>=1942,H58<1947),VLOOKUP(I58,Feuil1!$F$10:$O$24,9),IF(AND(H58>=1947,H58<1952),VLOOKUP(I58,Feuil1!$F$10:$O$24,8),IF(AND(H58>=1952,H58<1957),VLOOKUP(I58,Feuil1!$F$10:$O$24,7),IF(AND(H58>=1957,H58<1962),VLOOKUP(I58,Feuil1!$F$10:$O$24,6),IF(AND(H58>=1962,H58<1967),VLOOKUP(I58,Feuil1!$F$10:$O$24,5),IF(AND(H58>=1967,H58<1972),VLOOKUP(I58,Feuil1!$F$10:$O$24,4),IF(AND(H58>=1972,H58<1977),VLOOKUP(I58,Feuil1!$F$10:$O$24,3),IF(AND(H58>=1977,H58<1982),VLOOKUP(I58,Feuil1!$F$10:$O$24,2),VLOOKUP(I58,Feuil1!$F$10:$O$24,2))))))))))","v":{"$error":"#N/A"}},null,{"$f":"T58-HLOOKUP(Y58,Feuil1!$C$1:$BF$9,2,FALSE)","v":{"$error":"#VALUE!"}},{"$f":"T58-HLOOKUP(Y58,Feuil1!$C$1:$BF$9,3,FALSE)","v":{"$error":"#VALUE!"}},{"$f":"T58-HLOOKUP(Y58,Feuil1!$C$1:$BF$9,4,FALSE)","v":{"$error":"#VALUE!"}},{"$f":"T58-HLOOKUP(Y58,Feuil1!$C$1:$BF$9,5,FALSE)","v":{"$error":"#VALUE!"}},{"$f":"T58-HLOOKUP(Y58,Feuil1!$C$1:$BF$9,6,FALSE)","v":{"$error":"#VALUE!"}},{"$f":"T58-HLOOKUP(Y58,Feuil1!$C$1:$BF$9,7,FALSE)","v":{"$error":"#VALUE!"}},{"$f":"T58-HLOOKUP(Y58,Feuil1!$C$1:$BF$9,8,FALSE)","v":{"$error":"#VALUE!"}},{"$f":"T58-HLOOKUP(Y58,Feuil1!$C$1:$BF$9,9,FALSE)","v":{"$error":"#VALUE!"}},null,null,null,null,null,null,null,{"$error":"#VALUE!"},2017,null,{"$f":"IF(AQ58,VLOOKUP(AQ58,FEM!$AS$468:$AT$523,2))","v":4.4930000000000003}]
["F",null,null,null,null,null,null,null,null,null,null,null,null,null,"",null,null,null,"","","","","",false,{"$f":"IF(AND(H59<1936),VLOOKUP(I59,Feuil1!$F$10:$O$24,9),IF(AND(H59>=1942,H59<1947),VLOOKUP(I59,Feuil1!$F$10:$O$24,9),IF(AND(H59>=1947,H59<1952),VLOOKUP(I59,Feuil1!$F$10:$O$24,8),IF(AND(H59>=1952,H59<1957),VLOOKUP(I59,Feuil1!$F$10:$O$24,7),IF(AND(H59>=1957,H59<1962),VLOOKUP(I59,Feuil1!$F$10:$O$24,6),IF(AND(H59>=1962,H59<1967),VLOOKUP(I59,Feuil1!$F$10:$O$24,5),IF(AND(H59>=1967,H59<1972),VLOOKUP(I59,Feuil1!$F$10:$O$24,4),IF(AND(H59>=1972,H59<1977),VLOOKUP(I59,Feuil1!$F$10:$O$24,3),IF(AND(H59>=1977,H59<1982),VLOOKUP(I59,Feuil1!$F$10:$O$24,2),VLOOKUP(I59,Feuil1!$F$10:$O$24,2))))))))))","v":{"$error":"#N/A"}},null,{"$f":"T59-HLOOKUP(Y59,Feuil1!$C$1:$BF$9,2,FALSE)","v":{"$error":"#VALUE!"}},{"$f":"T59-HLOOKUP(Y59,Feuil1!$C$1:$BF$9,3,FALSE)","v":{"$error":"#VALUE!"}},{"$f":"T59-HLOOKUP(Y59,Feuil1!$C$1:$BF$9,4,FALSE)","v":{"$error":"#VALUE!"}},{"$f":"T59-HLOOKUP(Y59,Feuil1!$C$1:$BF$9,5,FALSE)","v":{"$error":"#VALUE!"}},{"$f":"T59-HLOOKUP(Y59,Feuil1!$C$1:$BF$9,6,FALSE)","v":{"$error":"#VALUE!"}},{"$f":"T59-HLOOKUP(Y59,Feuil1!$C$1:$BF$9,7,FALSE)","v":{"$error":"#VALUE!"}},{"$f":"T59-HLOOKUP(Y59,Feuil1!$C$1:$BF$9,8,FALSE)","v":{"$error":"#VALUE!"}},{"$f":"T59-HLOOKUP(Y59,Feuil1!$C$1:$BF$9,9,FALSE)","v":{"$error":"#VALUE!"}},null,null,null,null,null,null,null,{"$error":"#VALUE!"},2017,null,{"$f":"IF(AQ59,VLOOKUP(AQ59,FEM!$AS$468:$AT$523,2))","v":4.4930000000000003}]
["F",null,null,null,null,null,null,null,null,null,null,null,null,null,"",null,null,null,"","","","","",false,{"$f":"IF(AND(H60<1936),VLOOKUP(I60,Feuil1!$F$10:$O$24,9),IF(AND(H60>=1942,H60<1947),VLOOKUP(I60,Feuil1!$F$10:$O$24,9),IF(AND(H60>=1947,H60<1952),VLOOKUP(I60,Feuil1!$F$10:$O$24,8),IF(AND(H60>=1952,H60<1957),VLOOKUP(I60,Feuil1!$F$10:$O$24,7),IF(AND(H60>=1957,H60<1962),VLOOKUP(I60,Feuil1!$F$10:$O$24,6),IF(AND(H60>=1962,H60<1967),VLOOKUP(I60,Feuil1!$F$10:$O$24,5),IF(AND(H60>=1967,H60<1972),VLOOKUP(I60,Feuil1!$F$10:$O$24,4),IF(AND(H60>=1972,H60<1977),VLOOKUP(I60,Feuil1!$F$10:$O$24,3),IF(AND(H60>=1977,H60<1982),VLOOKUP(I60,Feuil1!$F$10:$O$24,2),VLOOKUP(I60,Feuil1!$F$10:$O$24,2))))))))))","v":{"$error":"#N/A"}},null,{"$f":"T60-HLOOKUP(Y60,Feuil1!$C$1:$BF$9,2,FALSE)","v":{"$error":"#VALUE!"}},{"$f":"T60-HLOOKUP(Y60,Feuil1!$C$1:$BF$9,3,FALSE)","v":{"$error":"#VALUE!"}},{"$f":"T60-HLOOKUP(Y60,Feuil1!$C$1:$BF$9,4,FALSE)","v":{"$error":"#VALUE!"}},{"$f":"T60-HLOOKUP(Y60,Feuil1!$C$1:$BF$9,5,FALSE)","v":{"$error":"#VALUE!"}},{"$f":"T60-HLOOKUP(Y60,Feuil1!$C$1:$BF$9,6,FALSE)","v":{"$error":"#VALUE!"}},{"$f":"T60-HLOOKUP(Y60,Feuil1!$C$1:$BF$9,7,FALSE)","v":{"$error":"#VALUE!"}},{"$f":"T60-HLOOKUP(Y60,Feuil1!$C$1:$BF$9,8,FALSE)","v":{"$error":"#VALUE!"}},{"$f":"T60-HLOOKUP(Y60,Feuil1!$C$1:$BF$9,9,FALSE)","v":{"$error":"#VALUE!"}},null,null,null,null,null,null,null,{"$error":"#VALUE!"},2017,null,{"$f":"IF(AQ60,VLOOKUP(AQ60,FEM!$AS$468:$AT$523,2))","v":4.4930000000000003}]
["F",null,null,null,null,null,null,null,null,null,null,null,null,null,"",null,null,null,"","","","","",false,{"$f":"IF(AND(H61<1936),VLOOKUP(I61,Feuil1!$F$10:$O$24,9),IF(AND(H61>=1942,H61<1947),VLOOKUP(I61,Feuil1!$F$10:$O$24,9),IF(AND(H61>=1947,H61<1952),VLOOKUP(I61,Feuil1!$F$10:$O$24,8),IF(AND(H61>=1952,H61<1957),VLOOKUP(I61,Feuil1!$F$10:$O$24,7),IF(AND(H61>=1957,H61<1962),VLOOKUP(I61,Feuil1!$F$10:$O$24,6),IF(AND(H61>=1962,H61<1967),VLOOKUP(I61,Feuil1!$F$10:$O$24,5),IF(AND(H61>=1967,H61<1972),VLOOKUP(I61,Feuil1!$F$10:$O$24,4),IF(AND(H61>=1972,H61<1977),VLOOKUP(I61,Feuil1!$F$10:$O$24,3),IF(AND(H61>=1977,H61<1982),VLOOKUP(I61,Feuil1!$F$10:$O$24,2),VLOOKUP(I61,Feuil1!$F$10:$O$24,2))))))))))","v":{"$error":"#N/A"}},null,{"$f":"T61-HLOOKUP(Y61,Feuil1!$C$1:$BF$9,2,FALSE)","v":{"$error":"#VALUE!"}},{"$f":"T61-HLOOKUP(Y61,Feuil1!$C$1:$BF$9,3,FALSE)","v":{"$error":"#VALUE!"}},{"$f":"T61-HLOOKUP(Y61,Feuil1!$C$1:$BF$9,4,FALSE)","v":{"$error":"#VALUE!"}},{"$f":"T61-HLOOKUP(Y61,Feuil1!$C$1:$BF$9,5,FALSE)","v":{"$error":"#VALUE!"}},{"$f":"T61-HLOOKUP(Y61,Feuil1!$C$1:$BF$9,6,FALSE)","v":{"$error":"#VALUE!"}},{"$f":"T61-HLOOKUP(Y61,Feuil1!$C$1:$BF$9,7,FALSE)","v":{"$error":"#VALUE!"}},{"$f":"T61-HLOOKUP(Y61,Feuil1!$C$1:$BF$9,8,FALSE)","v":{"$error":"#VALUE!"}},{"$f":"T61-HLOOKUP(Y61,Feuil1!$C$1:$BF$9,9,FALSE)","v":{"$error":"#VALUE!"}},null,null,null,null,null,null,null,{"$error":"#VALUE!"},2017,null,{"$f":"IF(AQ61,VLOOKUP(AQ61,FEM!$AS$468:$AT$523,2))","v":4.4930000000000003}]
["F",null,null,null,null,null,null,null,null,null,null,null,null,null,"",null,null,null,"","","","","",false,{"$f":"IF(AND(H62<1936),VLOOKUP(I62,Feuil1!$F$10:$O$24,9),IF(AND(H62>=1942,H62<1947),VLOOKUP(I62,Feuil1!$F$10:$O$24,9),IF(AND(H62>=1947,H62<1952),VLOOKUP(I62,Feuil1!$F$10:$O$24,8),IF(AND(H62>=1952,H62<1957),VLOOKUP(I62,Feuil1!$F$10:$O$24,7),IF(AND(H62>=1957,H62<1962),VLOOKUP(I62,Feuil1!$F$10:$O$24,6),IF(AND(H62>=1962,H62<1967),VLOOKUP(I62,Feuil1!$F$10:$O$24,5),IF(AND(H62>=1967,H62<1972),VLOOKUP(I62,Feuil1!$F$10:$O$24,4),IF(AND(H62>=1972,H62<1977),VLOOKUP(I62,Feuil1!$F$10:$O$24,3),IF(AND(H62>=1977,H62<1982),VLOOKUP(I62,Feuil1!$F$10:$O$24,2),VLOOKUP(I62,Feuil1!$F$10:$O$24,2))))))))))","v":{"$error":"#N/A"}},null,{"$f":"T62-HLOOKUP(Y62,Feuil1!$C$1:$BF$9,2,FALSE)","v":{"$error":"#VALUE!"}},{"$f":"T62-HLOOKUP(Y62,Feuil1!$C$1:$BF$9,3,FALSE)","v":{"$error":"#VALUE!"}},{"$f":"T62-HLOOKUP(Y62,Feuil1!$C$1:$BF$9,4,FALSE)","v":{"$error":"#VALUE!"}},{"$f":"T62-HLOOKUP(Y62,Feuil1!$C$1:$BF$9,5,FALSE)","v":{"$error":"#VALUE!"}},{"$f":"T62-HLOOKUP(Y62,Feuil1!$C$1:$BF$9,6,FALSE)","v":{"$error":"#VALUE!"}},{"$f":"T62-HLOOKUP(Y62,Feuil1!$C$1:$BF$9,7,FALSE)","v":{"$error":"#VALUE!"}},{"$f":"T62-HLOOKUP(Y62,Feuil1!$C$1:$BF$9,8,FALSE)","v":{"$error":"#VALUE!"}},{"$f":"T62-HLOOKUP(Y62,Feuil1!$C$1:$BF$9,9,FALSE)","v":{"$error":"#VALUE!"}},null,null,null,null,null,null,null,{"$error":"#VALUE!"},2017,null,{"$f":"IF(AQ62,VLOOKUP(AQ62,FEM!$AS$468:$AT$523,2))","v":4.4930000000000003}]
["F",null,null,null,null,null,null,null,null,null,null,null,null,null,"",null,null,null,"","","","","",false,{"$f":"IF(AND(H63<1936),VLOOKUP(I63,Feuil1!$F$10:$O$24,9),IF(AND(H63>=1942,H63<1947),VLOOKUP(I63,Feuil1!$F$10:$O$24,9),IF(AND(H63>=1947,H63<1952),VLOOKUP(I63,Feuil1!$F$10:$O$24,8),IF(AND(H63>=1952,H63<1957),VLOOKUP(I63,Feuil1!$F$10:$O$24,7),IF(AND(H63>=1957,H63<1962),VLOOKUP(I63,Feuil1!$F$10:$O$24,6),IF(AND(H63>=1962,H63<1967),VLOOKUP(I63,Feuil1!$F$10:$O$24,5),IF(AND(H63>=1967,H63<1972),VLOOKUP(I63,Feuil1!$F$10:$O$24,4),IF(AND(H63>=1972,H63<1977),VLOOKUP(I63,Feuil1!$F$10:$O$24,3),IF(AND(H63>=1977,H63<1982),VLOOKUP(I63,Feuil1!$F$10:$O$24,2),VLOOKUP(I63,Feuil1!$F$10:$O$24,2))))))))))","v":{"$error":"#N/A"}},null,{"$f":"T63-HLOOKUP(Y63,Feuil1!$C$1:$BF$9,2,FALSE)","v":{"$error":"#VALUE!"}},{"$f":"T63-HLOOKUP(Y63,Feuil1!$C$1:$BF$9,3,FALSE)","v":{"$error":"#VALUE!"}},{"$f":"T63-HLOOKUP(Y63,Feuil1!$C$1:$BF$9,4,FALSE)","v":{"$error":"#VALUE!"}},{"$f":"T63-HLOOKUP(Y63,Feuil1!$C$1:$BF$9,5,FALSE)","v":{"$error":"#VALUE!"}},{"$f":"T63-HLOOKUP(Y63,Feuil1!$C$1:$BF$9,6,FALSE)","v":{"$error":"#VALUE!"}},{"$f":"T63-HLOOKUP(Y63,Feuil1!$C$1:$BF$9,7,FALSE)","v":{"$error":"#VALUE!"}},{"$f":"T63-HLOOKUP(Y63,Feuil1!$C$1:$BF$9,8,FALSE)","v":{"$error":"#VALUE!"}},{"$f":"T63-HLOOKUP(Y63,Feuil1!$C$1:$BF$9,9,FALSE)","v":{"$error":"#VALUE!"}},null,null,null,null,null,null,null,{"$error":"#VALUE!"},2017,null,{"$f":"IF(AQ63,VLOOKUP(AQ63,FEM!$AS$468:$AT$523,2))","v":4.4930000000000003}]
["F",null,null,null,null,null,null,null,null,null,null,null,null,null,"",null,null,null,"","","","","",false,{"$f":"IF(AND(H64<1936),VLOOKUP(I64,Feuil1!$F$10:$O$24,9),IF(AND(H64>=1942,H64<1947),VLOOKUP(I64,Feuil1!$F$10:$O$24,9),IF(AND(H64>=1947,H64<1952),VLOOKUP(I64,Feuil1!$F$10:$O$24,8),IF(AND(H64>=1952,H64<1957),VLOOKUP(I64,Feuil1!$F$10:$O$24,7),IF(AND(H64>=1957,H64<1962),VLOOKUP(I64,Feuil1!$F$10:$O$24,6),IF(AND(H64>=1962,H64<1967),VLOOKUP(I64,Feuil1!$F$10:$O$24,5),IF(AND(H64>=1967,H64<1972),VLOOKUP(I64,Feuil1!$F$10:$O$24,4),IF(AND(H64>=1972,H64<1977),VLOOKUP(I64,Feuil1!$F$10:$O$24,3),IF(AND(H64>=1977,H64<1982),VLOOKUP(I64,Feuil1!$F$10:$O$24,2),VLOOKUP(I64,Feuil1!$F$10:$O$24,2))))))))))","v":{"$error":"#N/A"}},null,{"$f":"T64-HLOOKUP(Y64,Feuil1!$C$1:$BF$9,2,FALSE)","v":{"$error":"#VALUE!"}},{"$f":"T64-HLOOKUP(Y64,Feuil1!$C$1:$BF$9,3,FALSE)","v":{"$error":"#VALUE!"}},{"$f":"T64-HLOOKUP(Y64,Feuil1!$C$1:$BF$9,4,FALSE)","v":{"$error":"#VALUE!"}},{"$f":"T64-HLOOKUP(Y64,Feuil1!$C$1:$BF$9,5,FALSE)","v":{"$error":"#VALUE!"}},{"$f":"T64-HLOOKUP(Y64,Feuil1!$C$1:$BF$9,6,FALSE)","v":{"$error":"#VALUE!"}},{"$f":"T64-HLOOKUP(Y64,Feuil1!$C$1:$BF$9,7,FALSE)","v":{"$error":"#VALUE!"}},{"$f":"T64-HLOOKUP(Y64,Feuil1!$C$1:$BF$9,8,FALSE)","v":{"$error":"#VALUE!"}},{"$f":"T64-HLOOKUP(Y64,Feuil1!$C$1:$BF$9,9,FALSE)","v":{"$error":"#VALUE!"}},null,null,null,null,null,null,null,{"$error":"#VALUE!"},2017,null,{"$f":"IF(AQ64,VLOOKUP(AQ64,FEM!$AS$468:$AT$523,2))","v":4.4930000000000003}]
["F",null,null,null,null,null,null,null,null,null,null,null,null,null,"",null,null,null,"","","","","",false,{"$f":"IF(AND(H65<1936),VLOOKUP(I65,Feuil1!$F$10:$O$24,9),IF(AND(H65>=1942,H65<1947),VLOOKUP(I65,Feuil1!$F$10:$O$24,9),IF(AND(H65>=1947,H65<1952),VLOOKUP(I65,Feuil1!$F$10:$O$24,8),IF(AND(H65>=1952,H65<1957),VLOOKUP(I65,Feuil1!$F$10:$O$24,7),IF(AND(H65>=1957,H65<1962),VLOOKUP(I65,Feuil1!$F$10:$O$24,6),IF(AND(H65>=1962,H65<1967),VLOOKUP(I65,Feuil1!$F$10:$O$24,5),IF(AND(H65>=1967,H65<1972),VLOOKUP(I65,Feuil1!$F$10:$O$24,4),IF(AND(H65>=1972,H65<1977),VLOOKUP(I65,Feuil1!$F$10:$O$24,3),IF(AND(H65>=1977,H65<1982),VLOOKUP(I65,Feuil1!$F$10:$O$24,2),VLOOKUP(I65,Feuil1!$F$10:$O$24,2))))))))))","v":{"$error":"#N/A"}},null,{"$f":"T65-HLOOKUP(Y65,Feuil1!$C$1:$BF$9,2,FALSE)","v":{"$error":"#VALUE!"}},{"$f":"T65-HLOOKUP(Y65,Feuil1!$C$1:$BF$9,3,FALSE)","v":{"$error":"#VALUE!"}},{"$f":"T65-HLOOKUP(Y65,Feuil1!$C$1:$BF$9,4,FALSE)","v":{"$error":"#VALUE!"}},{"$f":"T65-HLOOKUP(Y65,Feuil1!$C$1:$BF$9,5,FALSE)","v":{"$error":"#VALUE!"}},{"$f":"T65-HLOOKUP(Y65,Feuil1!$C$1:$BF$9,6,FALSE)","v":{"$error":"#VALUE!"}},{"$f":"T65-HLOOKUP(Y65,Feuil1!$C$1:$BF$9,7,FALSE)","v":{"$error":"#VALUE!"}},{"$f":"T65-HLOOKUP(Y65,Feuil1!$C$1:$BF$9,8,FALSE)","v":{"$error":"#VALUE!"}},{"$f":"T65-HLOOKUP(Y65,Feuil1!$C$1:$BF$9,9,FALSE)","v":{"$error":"#VALUE!"}},null,null,null,null,null,null,null,{"$error":"#VALUE!"},2017,null,{"$f":"IF(AQ65,VLOOKUP(AQ65,FEM!$AS$468:$AT$523,2))","v":4.4930000000000003}]
["F",null,null,null,null,null,null,null,null,null,null,null,null,null,"",null,null,null,"","","","","",false,{"$f":"IF(AND(H66<1936),VLOOKUP(I66,Feuil1!$F$10:$O$24,9),IF(AND(H66>=1942,H66<1947),VLOOKUP(I66,Feuil1!$F$10:$O$24,9),IF(AND(H66>=1947,H66<1952),VLOOKUP(I66,Feuil1!$F$10:$O$24,8),IF(AND(H66>=1952,H66<1957),VLOOKUP(I66,Feuil1!$F$10:$O$24,7),IF(AND(H66>=1957,H66<1962),VLOOKUP(I66,Feuil1!$F$10:$O$24,6),IF(AND(H66>=1962,H66<1967),VLOOKUP(I66,Feuil1!$F$10:$O$24,5),IF(AND(H66>=1967,H66<1972),VLOOKUP(I66,Feuil1!$F$10:$O$24,4),IF(AND(H66>=1972,H66<1977),VLOOKUP(I66,Feuil1!$F$10:$O$24,3),IF(AND(H66>=1977,H66<1982),VLOOKUP(I66,Feuil1!$F$10:$O$24,2),VLOOKUP(I66,Feuil1!$F$10:$O$24,2))))))))))","v":{"$error":"#N/A"}},null,{"$f":"T66-HLOOKUP(Y66,Feuil1!$C$1:$BF$9,2,FALSE)","v":{"$error":"#VALUE!"}},{"$f":"T66-HLOOKUP(Y66,Feuil1!$C$1:$BF$9,3,FALSE)","v":{"$error":"#VALUE!"}},{"$f":"T66-HLOOKUP(Y66,Feuil1!$C$1:$BF$9,4,FALSE)","v":{"$error":"#VALUE!"}},{"$f":"T66-HLOOKUP(Y66,Feuil1!$C$1:$BF$9,5,FALSE)","v":{"$error":"#VALUE!"}},{"$f":"T66-HLOOKUP(Y66,Feuil1!$C$1:$BF$9,6,FALSE)","v":{"$error":"#VALUE!"}},{"$f":"T66-HLOOKUP(Y66,Feuil1!$C$1:$BF$9,7,FALSE)","v":{"$error":"#VALUE!"}},{"$f":"T66-HLOOKUP(Y66,Feuil1!$C$1:$BF$9,8,FALSE)","v":{"$error":"#VALUE!"}},{"$f":"T66-HLOOKUP(Y66,Feuil1!$C$1:$BF$9,9,FALSE)","v":{"$error":"#VALUE!"}},null,null,null,null,null,null,null,{"$error":"#VALUE!"},2017,null,{"$f":"IF(AQ66,VLOOKUP(AQ66,FEM!$AS$468:$AT$523,2))","v":4.4930000000000003}]
["F",null,null,null,null,null,null,null,null,null,null,null,null,null,"",null,null,null,"","","","","",false,{"$f":"IF(AND(H67<1936),VLOOKUP(I67,Feuil1!$F$10:$O$24,9),IF(AND(H67>=1942,H67<1947),VLOOKUP(I67,Feuil1!$F$10:$O$24,9),IF(AND(H67>=1947,H67<1952),VLOOKUP(I67,Feuil1!$F$10:$O$24,8),IF(AND(H67>=1952,H67<1957),VLOOKUP(I67,Feuil1!$F$10:$O$24,7),IF(AND(H67>=1957,H67<1962),VLOOKUP(I67,Feuil1!$F$10:$O$24,6),IF(AND(H67>=1962,H67<1967),VLOOKUP(I67,Feuil1!$F$10:$O$24,5),IF(AND(H67>=1967,H67<1972),VLOOKUP(I67,Feuil1!$F$10:$O$24,4),IF(AND(H67>=1972,H67<1977),VLOOKUP(I67,Feuil1!$F$10:$O$24,3),IF(AND(H67>=1977,H67<1982),VLOOKUP(I67,Feuil1!$F$10:$O$24,2),VLOOKUP(I67,Feuil1!$F$10:$O$24,2))))))))))","v":{"$error":"#N/A"}},null,{"$f":"T67-HLOOKUP(Y67,Feuil1!$C$1:$BF$9,2,FALSE)","v":{"$error":"#VALUE!"}},{"$f":"T67-HLOOKUP(Y67,Feuil1!$C$1:$BF$9,3,FALSE)","v":{"$error":"#VALUE!"}},{"$f":"T67-HLOOKUP(Y67,Feuil1!$C$1:$BF$9,4,FALSE)","v":{"$error":"#VALUE!"}},{"$f":"T67-HLOOKUP(Y67,Feuil1!$C$1:$BF$9,5,FALSE)","v":{"$error":"#VALUE!"}},{"$f":"T67-HLOOKUP(Y67,Feuil1!$C$1:$BF$9,6,FALSE)","v":{"$error":"#VALUE!"}},{"$f":"T67-HLOOKUP(Y67,Feuil1!$C$1:$BF$9,7,FALSE)","v":{"$error":"#VALUE!"}},{"$f":"T67-HLOOKUP(Y67,Feuil1!$C$1:$BF$9,8,FALSE)","v":{"$error":"#VALUE!"}},{"$f":"T67-HLOOKUP(Y67,Feuil1!$C$1:$BF$9,9,FALSE)","v":{"$error":"#VALUE!"}},null,null,null,null,null,null,null,{"$error":"#VALUE!"},2017,null,{"$f":"IF(AQ67,VLOOKUP(AQ67,FEM!$AS$468:$AT$523,2))","v":4.4930000000000003}]
["F",null,null,null,null,null,null,null,null,null,null,null,null,null,"",null,null,null,"","","","","",false,{"$f":"IF(AND(H68<1936),VLOOKUP(I68,Feuil1!$F$10:$O$24,9),IF(AND(H68>=1942,H68<1947),VLOOKUP(I68,Feuil1!$F$10:$O$24,9),IF(AND(H68>=1947,H68<1952),VLOOKUP(I68,Feuil1!$F$10:$O$24,8),IF(AND(H68>=1952,H68<1957),VLOOKUP(I68,Feuil1!$F$10:$O$24,7),IF(AND(H68>=1957,H68<1962),VLOOKUP(I68,Feuil1!$F$10:$O$24,6),IF(AND(H68>=1962,H68<1967),VLOOKUP(I68,Feuil1!$F$10:$O$24,5),IF(AND(H68>=1967,H68<1972),VLOOKUP(I68,Feuil1!$F$10:$O$24,4),IF(AND(H68>=1972,H68<1977),VLOOKUP(I68,Feuil1!$F$10:$O$24,3),IF(AND(H68>=1977,H68<1982),VLOOKUP(I68,Feuil1!$F$10:$O$24,2),VLOOKUP(I68,Feuil1!$F$10:$O$24,2))))))))))","v":{"$error":"#N/A"}},null,{"$f":"T68-HLOOKUP(Y68,Feuil1!$C$1:$BF$9,2,FALSE)","v":{"$error":"#VALUE!"}},{"$f":"T68-HLOOKUP(Y68,Feuil1!$C$1:$BF$9,3,FALSE)","v":{"$error":"#VALUE!"}},{"$f":"T68-HLOOKUP(Y68,Feuil1!$C$1:$BF$9,4,FALSE)","v":{"$error":"#VALUE!"}},{"$f":"T68-HLOOKUP(Y68,Feuil1!$C$1:$BF$9,5,FALSE)","v":{"$error":"#VALUE!"}},{"$f":"T68-HLOOKUP(Y68,Feuil1!$C$1:$BF$9,6,FALSE)","v":{"$error":"#VALUE!"}},{"$f":"T68-HLOOKUP(Y68,Feuil1!$C$1:$BF$9,7,FALSE)","v":{"$error":"#VALUE!"}},{"$f":"T68-HLOOKUP(Y68,Feuil1!$C$1:$BF$9,8,FALSE)","v":{"$error":"#VALUE!"}},{"$f":"T68-HLOOKUP(Y68,Feuil1!$C$1:$BF$9,9,FALSE)","v":{"$error":"#VALUE!"}},null,null,null,null,null,null,null,{"$error":"#VALUE!"},2017,null,{"$f":"IF(AQ68,VLOOKUP(AQ68,FEM!$AS$468:$AT$523,2))","v":4.4930000000000003}]
["F",null,null,null,null,null,null,null,null,null,null,null,null,null,"",null,null,null,"","","","","",false,{"$f":"IF(AND(H69<1936),VLOOKUP(I69,Feuil1!$F$10:$O$24,9),IF(AND(H69>=1942,H69<1947),VLOOKUP(I69,Feuil1!$F$10:$O$24,9),IF(AND(H69>=1947,H69<1952),VLOOKUP(I69,Feuil1!$F$10:$O$24,8),IF(AND(H69>=1952,H69<1957),VLOOKUP(I69,Feuil1!$F$10:$O$24,7),IF(AND(H69>=1957,H69<1962),VLOOKUP(I69,Feuil1!$F$10:$O$24,6),IF(AND(H69>=1962,H69<1967),VLOOKUP(I69,Feuil1!$F$10:$O$24,5),IF(AND(H69>=1967,H69<1972),VLOOKUP(I69,Feuil1!$F$10:$O$24,4),IF(AND(H69>=1972,H69<1977),VLOOKUP(I69,Feuil1!$F$10:$O$24,3),IF(AND(H69>=1977,H69<1982),VLOOKUP(I69,Feuil1!$F$10:$O$24,2),VLOOKUP(I69,Feuil1!$F$10:$O$24,2))))))))))","v":{"$error":"#N/A"}},null,{"$f":"T69-HLOOKUP(Y69,Feuil1!$C$1:$BF$9,2,FALSE)","v":{"$error":"#VALUE!"}},{"$f":"T69-HLOOKUP(Y69,Feuil1!$C$1:$BF$9,3,FALSE)","v":{"$error":"#VALUE!"}},{"$f":"T69-HLOOKUP(Y69,Feuil1!$C$1:$BF$9,4,FALSE)","v":{"$error":"#VALUE!"}},{"$f":"T69-HLOOKUP(Y69,Feuil1!$C$1:$BF$9,5,FALSE)","v":{"$error":"#VALUE!"}},{"$f":"T69-HLOOKUP(Y69,Feuil1!$C$1:$BF$9,6,FALSE)","v":{"$error":"#VALUE!"}},{"$f":"T69-HLOOKUP(Y69,Feuil1!$C$1:$BF$9,7,FALSE)","v":{"$error":"#VALUE!"}},{"$f":"T69-HLOOKUP(Y69,Feuil1!$C$1:$BF$9,8,FALSE)","v":{"$error":"#VALUE!"}},{"$f":"T69-HLOOKUP(Y69,Feuil1!$C$1:$BF$9,9,FALSE)","v":{"$error":"#VALUE!"}},null,null,null,null,null,null,null,{"$error":"#VALUE!"},2017,null,{"$f":"IF(AQ69,VLOOKUP(AQ69,FEM!$AS$468:$AT$523,2))","v":4.4930000000000003}]
["F",null,null,null,null,null,null,null,null,null,null,null,null,null,"",null,null,null,"","","","","",false,{"$f":"IF(AND(H70<1936),VLOOKUP(I70,Feuil1!$F$10:$O$24,9),IF(AND(H70>=1942,H70<1947),VLOOKUP(I70,Feuil1!$F$10:$O$24,9),IF(AND(H70>=1947,H70<1952),VLOOKUP(I70,Feuil1!$F$10:$O$24,8),IF(AND(H70>=1952,H70<1957),VLOOKUP(I70,Feuil1!$F$10:$O$24,7),IF(AND(H70>=1957,H70<1962),VLOOKUP(I70,Feuil1!$F$10:$O$24,6),IF(AND(H70>=1962,H70<1967),VLOOKUP(I70,Feuil1!$F$10:$O$24,5),IF(AND(H70>=1967,H70<1972),VLOOKUP(I70,Feuil1!$F$10:$O$24,4),IF(AND(H70>=1972,H70<1977),VLOOKUP(I70,Feuil1!$F$10:$O$24,3),IF(AND(H70>=1977,H70<1982),VLOOKUP(I70,Feuil1!$F$10:$O$24,2),VLOOKUP(I70,Feuil1!$F$10:$O$24,2))))))))))","v":{"$error":"#N/A"}},null,{"$f":"T70-HLOOKUP(Y70,Feuil1!$C$1:$BF$9,2,FALSE)","v":{"$error":"#VALUE!"}},{"$f":"T70-HLOOKUP(Y70,Feuil1!$C$1:$BF$9,3,FALSE)","v":{"$error":"#VALUE!"}},{"$f":"T70-HLOOKUP(Y70,Feuil1!$C$1:$BF$9,4,FALSE)","v":{"$error":"#VALUE!"}},{"$f":"T70-HLOOKUP(Y70,Feuil1!$C$1:$BF$9,5,FALSE)","v":{"$error":"#VALUE!"}},{"$f":"T70-HLOOKUP(Y70,Feuil1!$C$1:$BF$9,6,FALSE)","v":{"$error":"#VALUE!"}},{"$f":"T70-HLOOKUP(Y70,Feuil1!$C$1:$BF$9,7,FALSE)","v":{"$error":"#VALUE!"}},{"$f":"T70-HLOOKUP(Y70,Feuil1!$C$1:$BF$9,8,FALSE)","v":{"$error":"#VALUE!"}},{"$f":"T70-HLOOKUP(Y70,Feuil1!$C$1:$BF$9,9,FALSE)","v":{"$error":"#VALUE!"}},null,null,null,null,null,null,null,{"$error":"#VALUE!"},2017,null,{"$f":"IF(AQ70,VLOOKUP(AQ70,FEM!$AS$468:$AT$523,2))","v":4.4930000000000003}]
["F",null,null,null,null,null,null,null,null,null,null,null,null,null,"",null,null,null,"","","","","",false,{"$f":"IF(AND(H71<1936),VLOOKUP(I71,Feuil1!$F$10:$O$24,9),IF(AND(H71>=1942,H71<1947),VLOOKUP(I71,Feuil1!$F$10:$O$24,9),IF(AND(H71>=1947,H71<1952),VLOOKUP(I71,Feuil1!$F$10:$O$24,8),IF(AND(H71>=1952,H71<1957),VLOOKUP(I71,Feuil1!$F$10:$O$24,7),IF(AND(H71>=1957,H71<1962),VLOOKUP(I71,Feuil1!$F$10:$O$24,6),IF(AND(H71>=1962,H71<1967),VLOOKUP(I71,Feuil1!$F$10:$O$24,5),IF(AND(H71>=1967,H71<1972),VLOOKUP(I71,Feuil1!$F$10:$O$24,4),IF(AND(H71>=1972,H71<1977),VLOOKUP(I71,Feuil1!$F$10:$O$24,3),IF(AND(H71>=1977,H71<1982),VLOOKUP(I71,Feuil1!$F$10:$O$24,2),VLOOKUP(I71,Feuil1!$F$10:$O$24,2))))))))))","v":{"$error":"#N/A"}},null,{"$f":"T71-HLOOKUP(Y71,Feuil1!$C$1:$BF$9,2,FALSE)","v":{"$error":"#VALUE!"}},{"$f":"T71-HLOOKUP(Y71,Feuil1!$C$1:$BF$9,3,FALSE)","v":{"$error":"#VALUE!"}},{"$f":"T71-HLOOKUP(Y71,Feuil1!$C$1:$BF$9,4,FALSE)","v":{"$error":"#VALUE!"}},{"$f":"T71-HLOOKUP(Y71,Feuil1!$C$1:$BF$9,5,FALSE)","v":{"$error":"#VALUE!"}},{"$f":"T71-HLOOKUP(Y71,Feuil1!$C$1:$BF$9,6,FALSE)","v":{"$error":"#VALUE!"}},{"$f":"T71-HLOOKUP(Y71,Feuil1!$C$1:$BF$9,7,FALSE)","v":{"$error":"#VALUE!"}},{"$f":"T71-HLOOKUP(Y71,Feuil1!$C$1:$BF$9,8,FALSE)","v":{"$error":"#VALUE!"}},{"$f":"T71-HLOOKUP(Y71,Feuil1!$C$1:$BF$9,9,FALSE)","v":{"$error":"#VALUE!"}},null,null,null,null,null,null,null,{"$error":"#VALUE!"},2017,null,{"$f":"IF(AQ71,VLOOKUP(AQ71,FEM!$AS$468:$AT$523,2))","v":4.4930000000000003}]
["F",null,null,null,null,null,null,null,null,null,null,null,null,null,"",null,null,null,"","","","","",false,{"$f":"IF(AND(H72<1936),VLOOKUP(I72,Feuil1!$F$10:$O$24,9),IF(AND(H72>=1942,H72<1947),VLOOKUP(I72,Feuil1!$F$10:$O$24,9),IF(AND(H72>=1947,H72<1952),VLOOKUP(I72,Feuil1!$F$10:$O$24,8),IF(AND(H72>=1952,H72<1957),VLOOKUP(I72,Feuil1!$F$10:$O$24,7),IF(AND(H72>=1957,H72<1962),VLOOKUP(I72,Feuil1!$F$10:$O$24,6),IF(AND(H72>=1962,H72<1967),VLOOKUP(I72,Feuil1!$F$10:$O$24,5),IF(AND(H72>=1967,H72<1972),VLOOKUP(I72,Feuil1!$F$10:$O$24,4),IF(AND(H72>=1972,H72<1977),VLOOKUP(I72,Feuil1!$F$10:$O$24,3),IF(AND(H72>=1977,H72<1982),VLOOKUP(I72,Feuil1!$F$10:$O$24,2),VLOOKUP(I72,Feuil1!$F$10:$O$24,2))))))))))","v":{"$error":"#N/A"}},null,{"$f":"T72-HLOOKUP(Y72,Feuil1!$C$1:$BF$9,2,FALSE)","v":{"$error":"#VALUE!"}},{"$f":"T72-HLOOKUP(Y72,Feuil1!$C$1:$BF$9,3,FALSE)","v":{"$error":"#VALUE!"}},{"$f":"T72-HLOOKUP(Y72,Feuil1!$C$1:$BF$9,4,FALSE)","v":{"$error":"#VALUE!"}},{"$f":"T72-HLOOKUP(Y72,Feuil1!$C$1:$BF$9,5,FALSE)","v":{"$error":"#VALUE!"}},{"$f":"T72-HLOOKUP(Y72,Feuil1!$C$1:$BF$9,6,FALSE)","v":{"$error":"#VALUE!"}},{"$f":"T72-HLOOKUP(Y72,Feuil1!$C$1:$BF$9,7,FALSE)","v":{"$error":"#VALUE!"}},{"$f":"T72-HLOOKUP(Y72,Feuil1!$C$1:$BF$9,8,FALSE)","v":{"$error":"#VALUE!"}},{"$f":"T72-HLOOKUP(Y72,Feuil1!$C$1:$BF$9,9,FALSE)","v":{"$error":"#VALUE!"}},null,null,null,null,null,null,null,{"$error":"#VALUE!"},{"$f":"2017-H72","v":2017},null,{"$f":"IF(AQ72,VLOOKUP(AQ72,FEM!$AS$468:$AT$523,2))","v":4.4930000000000003}]
["F",null,null,null,null,null,null,null,null,null,null,null,null,null,"",null,null,null,"","","","","",false,{"$f":"IF(AND(H73<1936),VLOOKUP(I73,Feuil1!$F$10:$O$24,9),IF(AND(H73>=1942,H73<1947),VLOOKUP(I73,Feuil1!$F$10:$O$24,9),IF(AND(H73>=1947,H73<1952),VLOOKUP(I73,Feuil1!$F$10:$O$24,8),IF(AND(H73>=1952,H73<1957),VLOOKUP(I73,Feuil1!$F$10:$O$24,7),IF(AND(H73>=1957,H73<1962),VLOOKUP(I73,Feuil1!$F$10:$O$24,6),IF(AND(H73>=1962,H73<1967),VLOOKUP(I73,Feuil1!$F$10:$O$24,5),IF(AND(H73>=1967,H73<1972),VLOOKUP(I73,Feuil1!$F$10:$O$24,4),IF(AND(H73>=1972,H73<1977),VLOOKUP(I73,Feuil1!$F$10:$O$24,3),IF(AND(H73>=1977,H73<1982),VLOOKUP(I73,Feuil1!$F$10:$O$24,2),VLOOKUP(I73,Feuil1!$F$10:$O$24,2))))))))))","v":{"$error":"#N/A"}},null,{"$f":"T73-HLOOKUP(Y73,Feuil1!$C$1:$BF$9,2,FALSE)","v":{"$error":"#VALUE!"}},{"$f":"T73-HLOOKUP(Y73,Feuil1!$C$1:$BF$9,3,FALSE)","v":{"$error":"#VALUE!"}},{"$f":"T73-HLOOKUP(Y73,Feuil1!$C$1:$BF$9,4,FALSE)","v":{"$error":"#VALUE!"}},{"$f":"T73-HLOOKUP(Y73,Feuil1!$C$1:$BF$9,5,FALSE)","v":{"$error":"#VALUE!"}},{"$f":"T73-HLOOKUP(Y73,Feuil1!$C$1:$BF$9,6,FALSE)","v":{"$error":"#VALUE!"}},{"$f":"T73-HLOOKUP(Y73,Feuil1!$C$1:$BF$9,7,FALSE)","v":{"$error":"#VALUE!"}},{"$f":"T73-HLOOKUP(Y73,Feuil1!$C$1:$BF$9,8,FALSE)","v":{"$error":"#VALUE!"}},{"$f":"T73-HLOOKUP(Y73,Feuil1!$C$1:$BF$9,9,FALSE)","v":{"$error":"#VALUE!"}},null,null,null,null,null,null,null,{"$error":"#VALUE!"},2017,null,{"$f":"IF(AQ73,VLOOKUP(AQ73,FEM!$AS$468:$AT$523,2))","v":4.4930000000000003}]
["F",null,null,null,null,null,null,null,null,null,null,null,null,null,"",null,null,null,"","","","","",false,{"$f":"IF(AND(H74<1936),VLOOKUP(I74,Feuil1!$F$10:$O$24,9),IF(AND(H74>=1942,H74<1947),VLOOKUP(I74,Feuil1!$F$10:$O$24,9),IF(AND(H74>=1947,H74<1952),VLOOKUP(I74,Feuil1!$F$10:$O$24,8),IF(AND(H74>=1952,H74<1957),VLOOKUP(I74,Feuil1!$F$10:$O$24,7),IF(AND(H74>=1957,H74<1962),VLOOKUP(I74,Feuil1!$F$10:$O$24,6),IF(AND(H74>=1962,H74<1967),VLOOKUP(I74,Feuil1!$F$10:$O$24,5),IF(AND(H74>=1967,H74<1972),VLOOKUP(I74,Feuil1!$F$10:$O$24,4),IF(AND(H74>=1972,H74<1977),VLOOKUP(I74,Feuil1!$F$10:$O$24,3),IF(AND(H74>=1977,H74<1982),VLOOKUP(I74,Feuil1!$F$10:$O$24,2),VLOOKUP(I74,Feuil1!$F$10:$O$24,2))))))))))","v":{"$error":"#N/A"}},null,{"$f":"T74-HLOOKUP(Y74,Feuil1!$C$1:$BF$9,2,FALSE)","v":{"$error":"#VALUE!"}},{"$f":"T74-HLOOKUP(Y74,Feuil1!$C$1:$BF$9,3,FALSE)","v":{"$error":"#VALUE!"}},{"$f":"T74-HLOOKUP(Y74,Feuil1!$C$1:$BF$9,4,FALSE)","v":{"$error":"#VALUE!"}},{"$f":"T74-HLOOKUP(Y74,Feuil1!$C$1:$BF$9,5,FALSE)","v":{"$error":"#VALUE!"}},{"$f":"T74-HLOOKUP(Y74,Feuil1!$C$1:$BF$9,6,FALSE)","v":{"$error":"#VALUE!"}},{"$f":"T74-HLOOKUP(Y74,Feuil1!$C$1:$BF$9,7,FALSE)","v":{"$error":"#VALUE!"}},{"$f":"T74-HLOOKUP(Y74,Feuil1!$C$1:$BF$9,8,FALSE)","v":{"$error":"#VALUE!"}},{"$f":"T74-HLOOKUP(Y74,Feuil1!$C$1:$BF$9,9,FALSE)","v":{"$error":"#VALUE!"}},null,null,null,null,null,null,null,{"$error":"#VALUE!"},2017,null,{"$f":"IF(AQ74,VLOOKUP(AQ74,FEM!$AS$468:$AT$523,2))","v":4.4930000000000003}]
["F",null,null,null,null,null,null,null,null,null,null,null,null,null,"",null,null,null,"","","","","",false,{"$f":"IF(AND(H75<1936),VLOOKUP(I75,Feuil1!$F$10:$O$24,9),IF(AND(H75>=1942,H75<1947),VLOOKUP(I75,Feuil1!$F$10:$O$24,9),IF(AND(H75>=1947,H75<1952),VLOOKUP(I75,Feuil1!$F$10:$O$24,8),IF(AND(H75>=1952,H75<1957),VLOOKUP(I75,Feuil1!$F$10:$O$24,7),IF(AND(H75>=1957,H75<1962),VLOOKUP(I75,Feuil1!$F$10:$O$24,6),IF(AND(H75>=1962,H75<1967),VLOOKUP(I75,Feuil1!$F$10:$O$24,5),IF(AND(H75>=1967,H75<1972),VLOOKUP(I75,Feuil1!$F$10:$O$24,4),IF(AND(H75>=1972,H75<1977),VLOOKUP(I75,Feuil1!$F$10:$O$24,3),IF(AND(H75>=1977,H75<1982),VLOOKUP(I75,Feuil1!$F$10:$O$24,2),VLOOKUP(I75,Feuil1!$F$10:$O$24,2))))))))))","v":{"$error":"#N/A"}},null,{"$f":"T75-HLOOKUP(Y75,Feuil1!$C$1:$BF$9,2,FALSE)","v":{"$error":"#VALUE!"}},{"$f":"T75-HLOOKUP(Y75,Feuil1!$C$1:$BF$9,3,FALSE)","v":{"$error":"#VALUE!"}},{"$f":"T75-HLOOKUP(Y75,Feuil1!$C$1:$BF$9,4,FALSE)","v":{"$error":"#VALUE!"}},{"$f":"T75-HLOOKUP(Y75,Feuil1!$C$1:$BF$9,5,FALSE)","v":{"$error":"#VALUE!"}},{"$f":"T75-HLOOKUP(Y75,Feuil1!$C$1:$BF$9,6,FALSE)","v":{"$error":"#VALUE!"}},{"$f":"T75-HLOOKUP(Y75,Feuil1!$C$1:$BF$9,7,FALSE)","v":{"$error":"#VALUE!"}},{"$f":"T75-HLOOKUP(Y75,Feuil1!$C$1:$BF$9,8,FALSE)","v":{"$error":"#VALUE!"}},{"$f":"T75-HLOOKUP(Y75,Feuil1!$C$1:$BF$9,9,FALSE)","v":{"$error":"#VALUE!"}},null,null,null,null,null,null,null,{"$error":"#VALUE!"},2017,null,{"$f":"IF(AQ75,VLOOKUP(AQ75,FEM!$AS$468:$AT$523,2))","v":4.4930000000000003}]
["F",null,null,null,null,null,null,null,null,null,null,null,null,null,"",null,null,null,"","","","","",false,{"$f":"IF(AND(H76<1936),VLOOKUP(I76,Feuil1!$F$10:$O$24,9),IF(AND(H76>=1942,H76<1947),VLOOKUP(I76,Feuil1!$F$10:$O$24,9),IF(AND(H76>=1947,H76<1952),VLOOKUP(I76,Feuil1!$F$10:$O$24,8),IF(AND(H76>=1952,H76<1957),VLOOKUP(I76,Feuil1!$F$10:$O$24,7),IF(AND(H76>=1957,H76<1962),VLOOKUP(I76,Feuil1!$F$10:$O$24,6),IF(AND(H76>=1962,H76<1967),VLOOKUP(I76,Feuil1!$F$10:$O$24,5),IF(AND(H76>=1967,H76<1972),VLOOKUP(I76,Feuil1!$F$10:$O$24,4),IF(AND(H76>=1972,H76<1977),VLOOKUP(I76,Feuil1!$F$10:$O$24,3),IF(AND(H76>=1977,H76<1982),VLOOKUP(I76,Feuil1!$F$10:$O$24,2),VLOOKUP(I76,Feuil1!$F$10:$O$24,2))))))))))","v":{"$error":"#N/A"}},null,{"$f":"T76-HLOOKUP(Y76,Feuil1!$C$1:$BF$9,2,FALSE)","v":{"$error":"#VALUE!"}},{"$f":"T76-HLOOKUP(Y76,Feuil1!$C$1:$BF$9,3,FALSE)","v":{"$error":"#VALUE!"}},{"$f":"T76-HLOOKUP(Y76,Feuil1!$C$1:$BF$9,4,FALSE)","v":{"$error":"#VALUE!"}},{"$f":"T76-HLOOKUP(Y76,Feuil1!$C$1:$BF$9,5,FALSE)","v":{"$error":"#VALUE!"}},{"$f":"T76-HLOOKUP(Y76,Feuil1!$C$1:$BF$9,6,FALSE)","v":{"$error":"#VALUE!"}},{"$f":"T76-HLOOKUP(Y76,Feuil1!$C$1:$BF$9,7,FALSE)","v":{"$error":"#VALUE!"}},{"$f":"T76-HLOOKUP(Y76,Feuil1!$C$1:$BF$9,8,FALSE)","v":{"$error":"#VALUE!"}},{"$f":"T76-HLOOKUP(Y76,Feuil1!$C$1:$BF$9,9,FALSE)","v":{"$error":"#VALUE!"}},null,null,null,null,null,null,null,{"$error":"#VALUE!"},2017,null,{"$f":"IF(AQ76,VLOOKUP(AQ76,FEM!$AS$468:$AT$523,2))","v":4.4930000000000003}]
["F",null,null,null,null,null,null,null,null,null,null,null,null,null,"",null,null,null,"","","","","",false,{"$f":"IF(AND(H77<1936),VLOOKUP(I77,Feuil1!$F$10:$O$24,9),IF(AND(H77>=1942,H77<1947),VLOOKUP(I77,Feuil1!$F$10:$O$24,9),IF(AND(H77>=1947,H77<1952),VLOOKUP(I77,Feuil1!$F$10:$O$24,8),IF(AND(H77>=1952,H77<1957),VLOOKUP(I77,Feuil1!$F$10:$O$24,7),IF(AND(H77>=1957,H77<1962),VLOOKUP(I77,Feuil1!$F$10:$O$24,6),IF(AND(H77>=1962,H77<1967),VLOOKUP(I77,Feuil1!$F$10:$O$24,5),IF(AND(H77>=1967,H77<1972),VLOOKUP(I77,Feuil1!$F$10:$O$24,4),IF(AND(H77>=1972,H77<1977),VLOOKUP(I77,Feuil1!$F$10:$O$24,3),IF(AND(H77>=1977,H77<1982),VLOOKUP(I77,Feuil1!$F$10:$O$24,2),VLOOKUP(I77,Feuil1!$F$10:$O$24,2))))))))))","v":{"$error":"#N/A"}},null,{"$f":"T77-HLOOKUP(Y77,Feuil1!$C$1:$BF$9,2,FALSE)","v":{"$error":"#VALUE!"}},{"$f":"T77-HLOOKUP(Y77,Feuil1!$C$1:$BF$9,3,FALSE)","v":{"$error":"#VALUE!"}},{"$f":"T77-HLOOKUP(Y77,Feuil1!$C$1:$BF$9,4,FALSE)","v":{"$error":"#VALUE!"}},{"$f":"T77-HLOOKUP(Y77,Feuil1!$C$1:$BF$9,5,FALSE)","v":{"$error":"#VALUE!"}},{"$f":"T77-HLOOKUP(Y77,Feuil1!$C$1:$BF$9,6,FALSE)","v":{"$error":"#VALUE!"}},{"$f":"T77-HLOOKUP(Y77,Feuil1!$C$1:$BF$9,7,FALSE)","v":{"$error":"#VALUE!"}},{"$f":"T77-HLOOKUP(Y77,Feuil1!$C$1:$BF$9,8,FALSE)","v":{"$error":"#VALUE!"}},{"$f":"T77-HLOOKUP(Y77,Feuil1!$C$1:$BF$9,9,FALSE)","v":{"$error":"#VALUE!"}},null,null,null,null,null,null,null,{"$error":"#VALUE!"},2017,null,{"$f":"IF(AQ77,VLOOKUP(AQ77,FEM!$AS$468:$AT$523,2))","v":4.4930000000000003}]
["F",null,null,null,null,null,null,null,null,null,null,null,null,null,"",null,null,null,"","","","","",false,{"$f":"IF(AND(H78<1936),VLOOKUP(I78,Feuil1!$F$10:$O$24,9),IF(AND(H78>=1942,H78<1947),VLOOKUP(I78,Feuil1!$F$10:$O$24,9),IF(AND(H78>=1947,H78<1952),VLOOKUP(I78,Feuil1!$F$10:$O$24,8),IF(AND(H78>=1952,H78<1957),VLOOKUP(I78,Feuil1!$F$10:$O$24,7),IF(AND(H78>=1957,H78<1962),VLOOKUP(I78,Feuil1!$F$10:$O$24,6),IF(AND(H78>=1962,H78<1967),VLOOKUP(I78,Feuil1!$F$10:$O$24,5),IF(AND(H78>=1967,H78<1972),VLOOKUP(I78,Feuil1!$F$10:$O$24,4),IF(AND(H78>=1972,H78<1977),VLOOKUP(I78,Feuil1!$F$10:$O$24,3),IF(AND(H78>=1977,H78<1982),VLOOKUP(I78,Feuil1!$F$10:$O$24,2),VLOOKUP(I78,Feuil1!$F$10:$O$24,2))))))))))","v":{"$error":"#N/A"}},null,{"$f":"T78-HLOOKUP(Y78,Feuil1!$C$1:$BF$9,2,FALSE)","v":{"$error":"#VALUE!"}},{"$f":"T78-HLOOKUP(Y78,Feuil1!$C$1:$BF$9,3,FALSE)","v":{"$error":"#VALUE!"}},{"$f":"T78-HLOOKUP(Y78,Feuil1!$C$1:$BF$9,4,FALSE)","v":{"$error":"#VALUE!"}},{"$f":"T78-HLOOKUP(Y78,Feuil1!$C$1:$BF$9,5,FALSE)","v":{"$error":"#VALUE!"}},{"$f":"T78-HLOOKUP(Y78,Feuil1!$C$1:$BF$9,6,FALSE)","v":{"$error":"#VALUE!"}},{"$f":"T78-HLOOKUP(Y78,Feuil1!$C$1:$BF$9,7,FALSE)","v":{"$error":"#VALUE!"}},{"$f":"T78-HLOOKUP(Y78,Feuil1!$C$1:$BF$9,8,FALSE)","v":{"$error":"#VALUE!"}},{"$f":"T78-HLOOKUP(Y78,Feuil1!$C$1:$BF$9,9,FALSE)","v":{"$error":"#VALUE!"}},null,null,null,null,null,null,null,{"$error":"#VALUE!"},2017,null,{"$f":"IF(AQ78,VLOOKUP(AQ78,FEM!$AS$468:$AT$523,2))","v":4.4930000000000003}]
["F",null,null,null,null,null,null,null,null,null,null,null,null,null,"",null,null,null,"","","","","",false,{"$f":"IF(AND(H79<1936),VLOOKUP(I79,Feuil1!$F$10:$O$24,9),IF(AND(H79>=1942,H79<1947),VLOOKUP(I79,Feuil1!$F$10:$O$24,9),IF(AND(H79>=1947,H79<1952),VLOOKUP(I79,Feuil1!$F$10:$O$24,8),IF(AND(H79>=1952,H79<1957),VLOOKUP(I79,Feuil1!$F$10:$O$24,7),IF(AND(H79>=1957,H79<1962),VLOOKUP(I79,Feuil1!$F$10:$O$24,6),IF(AND(H79>=1962,H79<1967),VLOOKUP(I79,Feuil1!$F$10:$O$24,5),IF(AND(H79>=1967,H79<1972),VLOOKUP(I79,Feuil1!$F$10:$O$24,4),IF(AND(H79>=1972,H79<1977),VLOOKUP(I79,Feuil1!$F$10:$O$24,3),IF(AND(H79>=1977,H79<1982),VLOOKUP(I79,Feuil1!$F$10:$O$24,2),VLOOKUP(I79,Feuil1!$F$10:$O$24,2))))))))))","v":{"$error":"#N/A"}},null,{"$f":"T79-HLOOKUP(Y79,Feuil1!$C$1:$BF$9,2,FALSE)","v":{"$error":"#VALUE!"}},{"$f":"T79-HLOOKUP(Y79,Feuil1!$C$1:$BF$9,3,FALSE)","v":{"$error":"#VALUE!"}},{"$f":"T79-HLOOKUP(Y79,Feuil1!$C$1:$BF$9,4,FALSE)","v":{"$error":"#VALUE!"}},{"$f":"T79-HLOOKUP(Y79,Feuil1!$C$1:$BF$9,5,FALSE)","v":{"$error":"#VALUE!"}},{"$f":"T79-HLOOKUP(Y79,Feuil1!$C$1:$BF$9,6,FALSE)","v":{"$error":"#VALUE!"}},{"$f":"T79-HLOOKUP(Y79,Feuil1!$C$1:$BF$9,7,FALSE)","v":{"$error":"#VALUE!"}},{"$f":"T79-HLOOKUP(Y79,Feuil1!$C$1:$BF$9,8,FALSE)","v":{"$error":"#VALUE!"}},{"$f":"T79-HLOOKUP(Y79,Feuil1!$C$1:$BF$9,9,FALSE)","v":{"$error":"#VALUE!"}},null,null,null,null,null,null,null,{"$error":"#VALUE!"},2017,null,{"$f":"IF(AQ79,VLOOKUP(AQ79,FEM!$AS$468:$AT$523,2))","v":4.4930000000000003}]
["F",null,null,null,null,null,null,null,null,null,null,null,null,null,"",null,null,null,"","","","","",false,{"$f":"IF(AND(H80<1936),VLOOKUP(I80,Feuil1!$F$10:$O$24,9),IF(AND(H80>=1942,H80<1947),VLOOKUP(I80,Feuil1!$F$10:$O$24,9),IF(AND(H80>=1947,H80<1952),VLOOKUP(I80,Feuil1!$F$10:$O$24,8),IF(AND(H80>=1952,H80<1957),VLOOKUP(I80,Feuil1!$F$10:$O$24,7),IF(AND(H80>=1957,H80<1962),VLOOKUP(I80,Feuil1!$F$10:$O$24,6),IF(AND(H80>=1962,H80<1967),VLOOKUP(I80,Feuil1!$F$10:$O$24,5),IF(AND(H80>=1967,H80<1972),VLOOKUP(I80,Feuil1!$F$10:$O$24,4),IF(AND(H80>=1972,H80<1977),VLOOKUP(I80,Feuil1!$F$10:$O$24,3),IF(AND(H80>=1977,H80<1982),VLOOKUP(I80,Feuil1!$F$10:$O$24,2),VLOOKUP(I80,Feuil1!$F$10:$O$24,2))))))))))","v":{"$error":"#N/A"}},null,{"$f":"T80-HLOOKUP(Y80,Feuil1!$C$1:$BF$9,2,FALSE)","v":{"$error":"#VALUE!"}},{"$f":"T80-HLOOKUP(Y80,Feuil1!$C$1:$BF$9,3,FALSE)","v":{"$error":"#VALUE!"}},{"$f":"T80-HLOOKUP(Y80,Feuil1!$C$1:$BF$9,4,FALSE)","v":{"$error":"#VALUE!"}},{"$f":"T80-HLOOKUP(Y80,Feuil1!$C$1:$BF$9,5,FALSE)","v":{"$error":"#VALUE!"}},{"$f":"T80-HLOOKUP(Y80,Feuil1!$C$1:$BF$9,6,FALSE)","v":{"$error":"#VALUE!"}},{"$f":"T80-HLOOKUP(Y80,Feuil1!$C$1:$BF$9,7,FALSE)","v":{"$error":"#VALUE!"}},{"$f":"T80-HLOOKUP(Y80,Feuil1!$C$1:$BF$9,8,FALSE)","v":{"$error":"#VALUE!"}},{"$f":"T80-HLOOKUP(Y80,Feuil1!$C$1:$BF$9,9,FALSE)","v":{"$error":"#VALUE!"}},null,null,null,null,null,null,null,{"$error":"#VALUE!"},2017,null,{"$f":"IF(AQ80,VLOOKUP(AQ80,FEM!$AS$468:$AT$523,2))","v":4.4930000000000003}]
["F",null,null,null,null,null,null,null,null,null,null,null,null,null,"",null,null,null,"","","","","",false,{"$f":"IF(AND(H81<1936),VLOOKUP(I81,Feuil1!$F$10:$O$24,9),IF(AND(H81>=1942,H81<1947),VLOOKUP(I81,Feuil1!$F$10:$O$24,9),IF(AND(H81>=1947,H81<1952),VLOOKUP(I81,Feuil1!$F$10:$O$24,8),IF(AND(H81>=1952,H81<1957),VLOOKUP(I81,Feuil1!$F$10:$O$24,7),IF(AND(H81>=1957,H81<1962),VLOOKUP(I81,Feuil1!$F$10:$O$24,6),IF(AND(H81>=1962,H81<1967),VLOOKUP(I81,Feuil1!$F$10:$O$24,5),IF(AND(H81>=1967,H81<1972),VLOOKUP(I81,Feuil1!$F$10:$O$24,4),IF(AND(H81>=1972,H81<1977),VLOOKUP(I81,Feuil1!$F$10:$O$24,3),IF(AND(H81>=1977,H81<1982),VLOOKUP(I81,Feuil1!$F$10:$O$24,2),VLOOKUP(I81,Feuil1!$F$10:$O$24,2))))))))))","v":{"$error":"#N/A"}},null,{"$f":"T81-HLOOKUP(Y81,Feuil1!$C$1:$BF$9,2,FALSE)","v":{"$error":"#VALUE!"}},{"$f":"T81-HLOOKUP(Y81,Feuil1!$C$1:$BF$9,3,FALSE)","v":{"$error":"#VALUE!"}},{"$f":"T81-HLOOKUP(Y81,Feuil1!$C$1:$BF$9,4,FALSE)","v":{"$error":"#VALUE!"}},{"$f":"T81-HLOOKUP(Y81,Feuil1!$C$1:$BF$9,5,FALSE)","v":{"$error":"#VALUE!"}},{"$f":"T81-HLOOKUP(Y81,Feuil1!$C$1:$BF$9,6,FALSE)","v":{"$error":"#VALUE!"}},{"$f":"T81-HLOOKUP(Y81,Feuil1!$C$1:$BF$9,7,FALSE)","v":{"$error":"#VALUE!"}},{"$f":"T81-HLOOKUP(Y81,Feuil1!$C$1:$BF$9,8,FALSE)","v":{"$error":"#VALUE!"}},{"$f":"T81-HLOOKUP(Y81,Feuil1!$C$1:$BF$9,9,FALSE)","v":{"$error":"#VALUE!"}},null,null,null,null,null,null,null,{"$error":"#VALUE!"},2017,null,{"$f":"IF(AQ81,VLOOKUP(AQ81,FEM!$AS$468:$AT$523,2))","v":4.4930000000000003}]
["F",null,null,null,null,null,null,null,null,null,null,null,null,null,"",null,null,null,"","","","","",false,{"$f":"IF(AND(H82<1936),VLOOKUP(I82,Feuil1!$F$10:$O$24,9),IF(AND(H82>=1942,H82<1947),VLOOKUP(I82,Feuil1!$F$10:$O$24,9),IF(AND(H82>=1947,H82<1952),VLOOKUP(I82,Feuil1!$F$10:$O$24,8),IF(AND(H82>=1952,H82<1957),VLOOKUP(I82,Feuil1!$F$10:$O$24,7),IF(AND(H82>=1957,H82<1962),VLOOKUP(I82,Feuil1!$F$10:$O$24,6),IF(AND(H82>=1962,H82<1967),VLOOKUP(I82,Feuil1!$F$10:$O$24,5),IF(AND(H82>=1967,H82<1972),VLOOKUP(I82,Feuil1!$F$10:$O$24,4),IF(AND(H82>=1972,H82<1977),VLOOKUP(I82,Feuil1!$F$10:$O$24,3),IF(AND(H82>=1977,H82<1982),VLOOKUP(I82,Feuil1!$F$10:$O$24,2),VLOOKUP(I82,Feuil1!$F$10:$O$24,2))))))))))","v":{"$error":"#N/A"}},null,{"$f":"T82-HLOOKUP(Y82,Feuil1!$C$1:$BF$9,2,FALSE)","v":{"$error":"#VALUE!"}},{"$f":"T82-HLOOKUP(Y82,Feuil1!$C$1:$BF$9,3,FALSE)","v":{"$error":"#VALUE!"}},{"$f":"T82-HLOOKUP(Y82,Feuil1!$C$1:$BF$9,4,FALSE)","v":{"$error":"#VALUE!"}},{"$f":"T82-HLOOKUP(Y82,Feuil1!$C$1:$BF$9,5,FALSE)","v":{"$error":"#VALUE!"}},{"$f":"T82-HLOOKUP(Y82,Feuil1!$C$1:$BF$9,6,FALSE)","v":{"$error":"#VALUE!"}},{"$f":"T82-HLOOKUP(Y82,Feuil1!$C$1:$BF$9,7,FALSE)","v":{"$error":"#VALUE!"}},{"$f":"T82-HLOOKUP(Y82,Feuil1!$C$1:$BF$9,8,FALSE)","v":{"$error":"#VALUE!"}},{"$f":"T82-HLOOKUP(Y82,Feuil1!$C$1:$BF$9,9,FALSE)","v":{"$error":"#VALUE!"}},null,null,null,null,null,null,null,{"$error":"#VALUE!"},2017,null,{"$f":"IF(AQ82,VLOOKUP(AQ82,FEM!$AS$468:$AT$523,2))","v":4.4930000000000003}]
["F",null,null,null,null,null,null,null,null,null,null,null,null,null,"",null,null,null,"","","","","",false,{"$f":"IF(AND(H83<1936),VLOOKUP(I83,Feuil1!$F$10:$O$24,9),IF(AND(H83>=1942,H83<1947),VLOOKUP(I83,Feuil1!$F$10:$O$24,9),IF(AND(H83>=1947,H83<1952),VLOOKUP(I83,Feuil1!$F$10:$O$24,8),IF(AND(H83>=1952,H83<1957),VLOOKUP(I83,Feuil1!$F$10:$O$24,7),IF(AND(H83>=1957,H83<1962),VLOOKUP(I83,Feuil1!$F$10:$O$24,6),IF(AND(H83>=1962,H83<1967),VLOOKUP(I83,Feuil1!$F$10:$O$24,5),IF(AND(H83>=1967,H83<1972),VLOOKUP(I83,Feuil1!$F$10:$O$24,4),IF(AND(H83>=1972,H83<1977),VLOOKUP(I83,Feuil1!$F$10:$O$24,3),IF(AND(H83>=1977,H83<1982),VLOOKUP(I83,Feuil1!$F$10:$O$24,2),VLOOKUP(I83,Feuil1!$F$10:$O$24,2))))))))))","v":{"$error":"#N/A"}},null,{"$f":"T83-HLOOKUP(Y83,Feuil1!$C$1:$BF$9,2,FALSE)","v":{"$error":"#VALUE!"}},{"$f":"T83-HLOOKUP(Y83,Feuil1!$C$1:$BF$9,3,FALSE)","v":{"$error":"#VALUE!"}},{"$f":"T83-HLOOKUP(Y83,Feuil1!$C$1:$BF$9,4,FALSE)","v":{"$error":"#VALUE!"}},{"$f":"T83-HLOOKUP(Y83,Feuil1!$C$1:$BF$9,5,FALSE)","v":{"$error":"#VALUE!"}},{"$f":"T83-HLOOKUP(Y83,Feuil1!$C$1:$BF$9,6,FALSE)","v":{"$error":"#VALUE!"}},{"$f":"T83-HLOOKUP(Y83,Feuil1!$C$1:$BF$9,7,FALSE)","v":{"$error":"#VALUE!"}},{"$f":"T83-HLOOKUP(Y83,Feuil1!$C$1:$BF$9,8,FALSE)","v":{"$error":"#VALUE!"}},{"$f":"T83-HLOOKUP(Y83,Feuil1!$C$1:$BF$9,9,FALSE)","v":{"$error":"#VALUE!"}},null,null,null,null,null,null,null,{"$error":"#VALUE!"},2017,null,{"$f":"IF(AQ83,VLOOKUP(AQ83,FEM!$AS$468:$AT$523,2))","v":4.4930000000000003}]
["F",null,null,null,null,null,null,null,null,null,null,null,null,null,"",null,null,null,"","","","","",false,{"$f":"IF(AND(H84<1936),VLOOKUP(I84,Feuil1!$F$10:$O$24,9),IF(AND(H84>=1942,H84<1947),VLOOKUP(I84,Feuil1!$F$10:$O$24,9),IF(AND(H84>=1947,H84<1952),VLOOKUP(I84,Feuil1!$F$10:$O$24,8),IF(AND(H84>=1952,H84<1957),VLOOKUP(I84,Feuil1!$F$10:$O$24,7),IF(AND(H84>=1957,H84<1962),VLOOKUP(I84,Feuil1!$F$10:$O$24,6),IF(AND(H84>=1962,H84<1967),VLOOKUP(I84,Feuil1!$F$10:$O$24,5),IF(AND(H84>=1967,H84<1972),VLOOKUP(I84,Feuil1!$F$10:$O$24,4),IF(AND(H84>=1972,H84<1977),VLOOKUP(I84,Feuil1!$F$10:$O$24,3),IF(AND(H84>=1977,H84<1982),VLOOKUP(I84,Feuil1!$F$10:$O$24,2),VLOOKUP(I84,Feuil1!$F$10:$O$24,2))))))))))","v":{"$error":"#N/A"}},null,{"$f":"T84-HLOOKUP(Y84,Feuil1!$C$1:$BF$9,2,FALSE)","v":{"$error":"#VALUE!"}},{"$f":"T84-HLOOKUP(Y84,Feuil1!$C$1:$BF$9,3,FALSE)","v":{"$error":"#VALUE!"}},{"$f":"T84-HLOOKUP(Y84,Feuil1!$C$1:$BF$9,4,FALSE)","v":{"$error":"#VALUE!"}},{"$f":"T84-HLOOKUP(Y84,Feuil1!$C$1:$BF$9,5,FALSE)","v":{"$error":"#VALUE!"}},{"$f":"T84-HLOOKUP(Y84,Feuil1!$C$1:$BF$9,6,FALSE)","v":{"$error":"#VALUE!"}},{"$f":"T84-HLOOKUP(Y84,Feuil1!$C$1:$BF$9,7,FALSE)","v":{"$error":"#VALUE!"}},{"$f":"T84-HLOOKUP(Y84,Feuil1!$C$1:$BF$9,8,FALSE)","v":{"$error":"#VALUE!"}},{"$f":"T84-HLOOKUP(Y84,Feuil1!$C$1:$BF$9,9,FALSE)","v":{"$error":"#VALUE!"}},null,null,null,null,null,null,null,{"$error":"#VALUE!"},2017,null,{"$f":"IF(AQ84,VLOOKUP(AQ84,FEM!$AS$468:$AT$523,2))","v":4.4930000000000003}]
["F",null,null,null,null,null,null,null,null,null,null,null,null,null,"",null,null,null,"","","","","",false,{"$f":"IF(AND(H85<1936),VLOOKUP(I85,Feuil1!$F$10:$O$24,9),IF(AND(H85>=1942,H85<1947),VLOOKUP(I85,Feuil1!$F$10:$O$24,9),IF(AND(H85>=1947,H85<1952),VLOOKUP(I85,Feuil1!$F$10:$O$24,8),IF(AND(H85>=1952,H85<1957),VLOOKUP(I85,Feuil1!$F$10:$O$24,7),IF(AND(H85>=1957,H85<1962),VLOOKUP(I85,Feuil1!$F$10:$O$24,6),IF(AND(H85>=1962,H85<1967),VLOOKUP(I85,Feuil1!$F$10:$O$24,5),IF(AND(H85>=1967,H85<1972),VLOOKUP(I85,Feuil1!$F$10:$O$24,4),IF(AND(H85>=1972,H85<1977),VLOOKUP(I85,Feuil1!$F$10:$O$24,3),IF(AND(H85>=1977,H85<1982),VLOOKUP(I85,Feuil1!$F$10:$O$24,2),VLOOKUP(I85,Feuil1!$F$10:$O$24,2))))))))))","v":{"$error":"#N/A"}},null,{"$f":"T85-HLOOKUP(Y85,Feuil1!$C$1:$BF$9,2,FALSE)","v":{"$error":"#VALUE!"}},{"$f":"T85-HLOOKUP(Y85,Feuil1!$C$1:$BF$9,3,FALSE)","v":{"$error":"#VALUE!"}},{"$f":"T85-HLOOKUP(Y85,Feuil1!$C$1:$BF$9,4,FALSE)","v":{"$error":"#VALUE!"}},{"$f":"T85-HLOOKUP(Y85,Feuil1!$C$1:$BF$9,5,FALSE)","v":{"$error":"#VALUE!"}},{"$f":"T85-HLOOKUP(Y85,Feuil1!$C$1:$BF$9,6,FALSE)","v":{"$error":"#VALUE!"}},{"$f":"T85-HLOOKUP(Y85,Feuil1!$C$1:$BF$9,7,FALSE)","v":{"$error":"#VALUE!"}},{"$f":"T85-HLOOKUP(Y85,Feuil1!$C$1:$BF$9,8,FALSE)","v":{"$error":"#VALUE!"}},{"$f":"T85-HLOOKUP(Y85,Feuil1!$C$1:$BF$9,9,FALSE)","v":{"$error":"#VALUE!"}},null,null,null,null,null,null,null,{"$error":"#VALUE!"},2017,null,{"$f":"IF(AQ85,VLOOKUP(AQ85,FEM!$AS$468:$AT$523,2))","v":4.4930000000000003}]
["F",null,null,null,null,null,null,null,null,null,null,null,null,null,"",null,null,null,"","","","","",false,{"$f":"IF(AND(H86<1936),VLOOKUP(I86,Feuil1!$F$10:$O$24,9),IF(AND(H86>=1942,H86<1947),VLOOKUP(I86,Feuil1!$F$10:$O$24,9),IF(AND(H86>=1947,H86<1952),VLOOKUP(I86,Feuil1!$F$10:$O$24,8),IF(AND(H86>=1952,H86<1957),VLOOKUP(I86,Feuil1!$F$10:$O$24,7),IF(AND(H86>=1957,H86<1962),VLOOKUP(I86,Feuil1!$F$10:$O$24,6),IF(AND(H86>=1962,H86<1967),VLOOKUP(I86,Feuil1!$F$10:$O$24,5),IF(AND(H86>=1967,H86<1972),VLOOKUP(I86,Feuil1!$F$10:$O$24,4),IF(AND(H86>=1972,H86<1977),VLOOKUP(I86,Feuil1!$F$10:$O$24,3),IF(AND(H86>=1977,H86<1982),VLOOKUP(I86,Feuil1!$F$10:$O$24,2),VLOOKUP(I86,Feuil1!$F$10:$O$24,2))))))))))","v":{"$error":"#N/A"}},null,{"$f":"T86-HLOOKUP(Y86,Feuil1!$C$1:$BF$9,2,FALSE)","v":{"$error":"#VALUE!"}},{"$f":"T86-HLOOKUP(Y86,Feuil1!$C$1:$BF$9,3,FALSE)","v":{"$error":"#VALUE!"}},{"$f":"T86-HLOOKUP(Y86,Feuil1!$C$1:$BF$9,4,FALSE)","v":{"$error":"#VALUE!"}},{"$f":"T86-HLOOKUP(Y86,Feuil1!$C$1:$BF$9,5,FALSE)","v":{"$error":"#VALUE!"}},{"$f":"T86-HLOOKUP(Y86,Feuil1!$C$1:$BF$9,6,FALSE)","v":{"$error":"#VALUE!"}},{"$f":"T86-HLOOKUP(Y86,Feuil1!$C$1:$BF$9,7,FALSE)","v":{"$error":"#VALUE!"}},{"$f":"T86-HLOOKUP(Y86,Feuil1!$C$1:$BF$9,8,FALSE)","v":{"$error":"#VALUE!"}},{"$f":"T86-HLOOKUP(Y86,Feuil1!$C$1:$BF$9,9,FALSE)","v":{"$error":"#VALUE!"}},null,null,null,null,null,null,null,{"$error":"#VALUE!"},2017,null,{"$f":"IF(AQ86,VLOOKUP(AQ86,FEM!$AS$468:$AT$523,2))","v":4.4930000000000003}]
["F",null,null,null,null,null,null,null,null,null,null,null,null,null,"",null,null,null,"","","","","",false,{"$f":"IF(AND(H87<1936),VLOOKUP(I87,Feuil1!$F$10:$O$24,9),IF(AND(H87>=1942,H87<1947),VLOOKUP(I87,Feuil1!$F$10:$O$24,9),IF(AND(H87>=1947,H87<1952),VLOOKUP(I87,Feuil1!$F$10:$O$24,8),IF(AND(H87>=1952,H87<1957),VLOOKUP(I87,Feuil1!$F$10:$O$24,7),IF(AND(H87>=1957,H87<1962),VLOOKUP(I87,Feuil1!$F$10:$O$24,6),IF(AND(H87>=1962,H87<1967),VLOOKUP(I87,Feuil1!$F$10:$O$24,5),IF(AND(H87>=1967,H87<1972),VLOOKUP(I87,Feuil1!$F$10:$O$24,4),IF(AND(H87>=1972,H87<1977),VLOOKUP(I87,Feuil1!$F$10:$O$24,3),IF(AND(H87>=1977,H87<1982),VLOOKUP(I87,Feuil1!$F$10:$O$24,2),VLOOKUP(I87,Feuil1!$F$10:$O$24,2))))))))))","v":{"$error":"#N/A"}},null,{"$f":"T87-HLOOKUP(Y87,Feuil1!$C$1:$BF$9,2,FALSE)","v":{"$error":"#VALUE!"}},{"$f":"T87-HLOOKUP(Y87,Feuil1!$C$1:$BF$9,3,FALSE)","v":{"$error":"#VALUE!"}},{"$f":"T87-HLOOKUP(Y87,Feuil1!$C$1:$BF$9,4,FALSE)","v":{"$error":"#VALUE!"}},{"$f":"T87-HLOOKUP(Y87,Feuil1!$C$1:$BF$9,5,FALSE)","v":{"$error":"#VALUE!"}},{"$f":"T87-HLOOKUP(Y87,Feuil1!$C$1:$BF$9,6,FALSE)","v":{"$error":"#VALUE!"}},{"$f":"T87-HLOOKUP(Y87,Feuil1!$C$1:$BF$9,7,FALSE)","v":{"$error":"#VALUE!"}},{"$f":"T87-HLOOKUP(Y87,Feuil1!$C$1:$BF$9,8,FALSE)","v":{"$error":"#VALUE!"}},{"$f":"T87-HLOOKUP(Y87,Feuil1!$C$1:$BF$9,9,FALSE)","v":{"$error":"#VALUE!"}},null,null,null,null,null,null,null,{"$error":"#VALUE!"},2017,null,{"$f":"IF(AQ87,VLOOKUP(AQ87,FEM!$AS$468:$AT$523,2))","v":4.4930000000000003}]
["F",null,null,null,null,null,null,null,null,null,null,null,null,null,"",null,null,null,"","","","","",false,{"$f":"IF(AND(H88<1936),VLOOKUP(I88,Feuil1!$F$10:$O$24,9),IF(AND(H88>=1942,H88<1947),VLOOKUP(I88,Feuil1!$F$10:$O$24,9),IF(AND(H88>=1947,H88<1952),VLOOKUP(I88,Feuil1!$F$10:$O$24,8),IF(AND(H88>=1952,H88<1957),VLOOKUP(I88,Feuil1!$F$10:$O$24,7),IF(AND(H88>=1957,H88<1962),VLOOKUP(I88,Feuil1!$F$10:$O$24,6),IF(AND(H88>=1962,H88<1967),VLOOKUP(I88,Feuil1!$F$10:$O$24,5),IF(AND(H88>=1967,H88<1972),VLOOKUP(I88,Feuil1!$F$10:$O$24,4),IF(AND(H88>=1972,H88<1977),VLOOKUP(I88,Feuil1!$F$10:$O$24,3),IF(AND(H88>=1977,H88<1982),VLOOKUP(I88,Feuil1!$F$10:$O$24,2),VLOOKUP(I88,Feuil1!$F$10:$O$24,2))))))))))","v":{"$error":"#N/A"}},null,{"$f":"T88-HLOOKUP(Y88,Feuil1!$C$1:$BF$9,2,FALSE)","v":{"$error":"#VALUE!"}},{"$f":"T88-HLOOKUP(Y88,Feuil1!$C$1:$BF$9,3,FALSE)","v":{"$error":"#VALUE!"}},{"$f":"T88-HLOOKUP(Y88,Feuil1!$C$1:$BF$9,4,FALSE)","v":{"$error":"#VALUE!"}},{"$f":"T88-HLOOKUP(Y88,Feuil1!$C$1:$BF$9,5,FALSE)","v":{"$error":"#VALUE!"}},{"$f":"T88-HLOOKUP(Y88,Feuil1!$C$1:$BF$9,6,FALSE)","v":{"$error":"#VALUE!"}},{"$f":"T88-HLOOKUP(Y88,Feuil1!$C$1:$BF$9,7,FALSE)","v":{"$error":"#VALUE!"}},{"$f":"T88-HLOOKUP(Y88,Feuil1!$C$1:$BF$9,8,FALSE)","v":{"$error":"#VALUE!"}},{"$f":"T88-HLOOKUP(Y88,Feuil1!$C$1:$BF$9,9,FALSE)","v":{"$error":"#VALUE!"}},null,null,null,null,null,null,null,{"$error":"#VALUE!"},2017,null,{"$f":"IF(AQ88,VLOOKUP(AQ88,FEM!$AS$468:$AT$523,2))","v":4.4930000000000003}]
["F",null,null,null,null,null,null,null,null,null,null,null,null,null,"",null,null,null,"","","","","",false,{"$f":"IF(AND(H89<1936),VLOOKUP(I89,Feuil1!$F$10:$O$24,9),IF(AND(H89>=1942,H89<1947),VLOOKUP(I89,Feuil1!$F$10:$O$24,9),IF(AND(H89>=1947,H89<1952),VLOOKUP(I89,Feuil1!$F$10:$O$24,8),IF(AND(H89>=1952,H89<1957),VLOOKUP(I89,Feuil1!$F$10:$O$24,7),IF(AND(H89>=1957,H89<1962),VLOOKUP(I89,Feuil1!$F$10:$O$24,6),IF(AND(H89>=1962,H89<1967),VLOOKUP(I89,Feuil1!$F$10:$O$24,5),IF(AND(H89>=1967,H89<1972),VLOOKUP(I89,Feuil1!$F$10:$O$24,4),IF(AND(H89>=1972,H89<1977),VLOOKUP(I89,Feuil1!$F$10:$O$24,3),IF(AND(H89>=1977,H89<1982),VLOOKUP(I89,Feuil1!$F$10:$O$24,2),VLOOKUP(I89,Feuil1!$F$10:$O$24,2))))))))))","v":{"$error":"#N/A"}},null,{"$f":"T89-HLOOKUP(Y89,Feuil1!$C$1:$BF$9,2,FALSE)","v":{"$error":"#VALUE!"}},{"$f":"T89-HLOOKUP(Y89,Feuil1!$C$1:$BF$9,3,FALSE)","v":{"$error":"#VALUE!"}},{"$f":"T89-HLOOKUP(Y89,Feuil1!$C$1:$BF$9,4,FALSE)","v":{"$error":"#VALUE!"}},{"$f":"T89-HLOOKUP(Y89,Feuil1!$C$1:$BF$9,5,FALSE)","v":{"$error":"#VALUE!"}},{"$f":"T89-HLOOKUP(Y89,Feuil1!$C$1:$BF$9,6,FALSE)","v":{"$error":"#VALUE!"}},{"$f":"T89-HLOOKUP(Y89,Feuil1!$C$1:$BF$9,7,FALSE)","v":{"$error":"#VALUE!"}},{"$f":"T89-HLOOKUP(Y89,Feuil1!$C$1:$BF$9,8,FALSE)","v":{"$error":"#VALUE!"}},{"$f":"T89-HLOOKUP(Y89,Feuil1!$C$1:$BF$9,9,FALSE)","v":{"$error":"#VALUE!"}},null,null,null,null,null,null,null,{"$error":"#VALUE!"},2017,null,{"$f":"IF(AQ89,VLOOKUP(AQ89,FEM!$AS$468:$AT$523,2))","v":4.4930000000000003}]
["F",null,null,null,null,null,null,null,null,null,null,null,null,null,"",null,null,null,"","","","","",false,{"$f":"IF(AND(H90<1936),VLOOKUP(I90,Feuil1!$F$10:$O$24,9),IF(AND(H90>=1942,H90<1947),VLOOKUP(I90,Feuil1!$F$10:$O$24,9),IF(AND(H90>=1947,H90<1952),VLOOKUP(I90,Feuil1!$F$10:$O$24,8),IF(AND(H90>=1952,H90<1957),VLOOKUP(I90,Feuil1!$F$10:$O$24,7),IF(AND(H90>=1957,H90<1962),VLOOKUP(I90,Feuil1!$F$10:$O$24,6),IF(AND(H90>=1962,H90<1967),VLOOKUP(I90,Feuil1!$F$10:$O$24,5),IF(AND(H90>=1967,H90<1972),VLOOKUP(I90,Feuil1!$F$10:$O$24,4),IF(AND(H90>=1972,H90<1977),VLOOKUP(I90,Feuil1!$F$10:$O$24,3),IF(AND(H90>=1977,H90<1982),VLOOKUP(I90,Feuil1!$F$10:$O$24,2),VLOOKUP(I90,Feuil1!$F$10:$O$24,2))))))))))","v":{"$error":"#N/A"}},null,{"$f":"T90-HLOOKUP(Y90,Feuil1!$C$1:$BF$9,2,FALSE)","v":{"$error":"#VALUE!"}},{"$f":"T90-HLOOKUP(Y90,Feuil1!$C$1:$BF$9,3,FALSE)","v":{"$error":"#VALUE!"}},{"$f":"T90-HLOOKUP(Y90,Feuil1!$C$1:$BF$9,4,FALSE)","v":{"$error":"#VALUE!"}},{"$f":"T90-HLOOKUP(Y90,Feuil1!$C$1:$BF$9,5,FALSE)","v":{"$error":"#VALUE!"}},{"$f":"T90-HLOOKUP(Y90,Feuil1!$C$1:$BF$9,6,FALSE)","v":{"$error":"#VALUE!"}},{"$f":"T90-HLOOKUP(Y90,Feuil1!$C$1:$BF$9,7,FALSE)","v":{"$error":"#VALUE!"}},{"$f":"T90-HLOOKUP(Y90,Feuil1!$C$1:$BF$9,8,FALSE)","v":{"$error":"#VALUE!"}},{"$f":"T90-HLOOKUP(Y90,Feuil1!$C$1:$BF$9,9,FALSE)","v":{"$error":"#VALUE!"}},null,null,null,null,null,null,null,{"$error":"#VALUE!"},2017,null,{"$f":"IF(AQ90,VLOOKUP(AQ90,FEM!$AS$468:$AT$523,2))","v":4.4930000000000003}]
["F",null,null,null,null,null,null,null,null,null,null,null,null,null,"",null,null,null,"","","","","",false,{"$f":"IF(AND(H91<1936),VLOOKUP(I91,Feuil1!$F$10:$O$24,9),IF(AND(H91>=1942,H91<1947),VLOOKUP(I91,Feuil1!$F$10:$O$24,9),IF(AND(H91>=1947,H91<1952),VLOOKUP(I91,Feuil1!$F$10:$O$24,8),IF(AND(H91>=1952,H91<1957),VLOOKUP(I91,Feuil1!$F$10:$O$24,7),IF(AND(H91>=1957,H91<1962),VLOOKUP(I91,Feuil1!$F$10:$O$24,6),IF(AND(H91>=1962,H91<1967),VLOOKUP(I91,Feuil1!$F$10:$O$24,5),IF(AND(H91>=1967,H91<1972),VLOOKUP(I91,Feuil1!$F$10:$O$24,4),IF(AND(H91>=1972,H91<1977),VLOOKUP(I91,Feuil1!$F$10:$O$24,3),IF(AND(H91>=1977,H91<1982),VLOOKUP(I91,Feuil1!$F$10:$O$24,2),VLOOKUP(I91,Feuil1!$F$10:$O$24,2))))))))))","v":{"$error":"#N/A"}},null,{"$f":"T91-HLOOKUP(Y91,Feuil1!$C$1:$BF$9,2,FALSE)","v":{"$error":"#VALUE!"}},{"$f":"T91-HLOOKUP(Y91,Feuil1!$C$1:$BF$9,3,FALSE)","v":{"$error":"#VALUE!"}},{"$f":"T91-HLOOKUP(Y91,Feuil1!$C$1:$BF$9,4,FALSE)","v":{"$error":"#VALUE!"}},{"$f":"T91-HLOOKUP(Y91,Feuil1!$C$1:$BF$9,5,FALSE)","v":{"$error":"#VALUE!"}},{"$f":"T91-HLOOKUP(Y91,Feuil1!$C$1:$BF$9,6,FALSE)","v":{"$error":"#VALUE!"}},{"$f":"T91-HLOOKUP(Y91,Feuil1!$C$1:$BF$9,7,FALSE)","v":{"$error":"#VALUE!"}},{"$f":"T91-HLOOKUP(Y91,Feuil1!$C$1:$BF$9,8,FALSE)","v":{"$error":"#VALUE!"}},{"$f":"T91-HLOOKUP(Y91,Feuil1!$C$1:$BF$9,9,FALSE)","v":{"$error":"#VALUE!"}},null,null,null,null,null,null,null,{"$error":"#VALUE!"},2017,null,{"$f":"IF(AQ91,VLOOKUP(AQ91,FEM!$AS$468:$AT$523,2))","v":4.4930000000000003}]
["F",null,null,null,null,null,null,null,null,null,null,null,null,null,"",null,null,null,"","","","","",false,{"$f":"IF(AND(H92<1936),VLOOKUP(I92,Feuil1!$F$10:$O$24,9),IF(AND(H92>=1942,H92<1947),VLOOKUP(I92,Feuil1!$F$10:$O$24,9),IF(AND(H92>=1947,H92<1952),VLOOKUP(I92,Feuil1!$F$10:$O$24,8),IF(AND(H92>=1952,H92<1957),VLOOKUP(I92,Feuil1!$F$10:$O$24,7),IF(AND(H92>=1957,H92<1962),VLOOKUP(I92,Feuil1!$F$10:$O$24,6),IF(AND(H92>=1962,H92<1967),VLOOKUP(I92,Feuil1!$F$10:$O$24,5),IF(AND(H92>=1967,H92<1972),VLOOKUP(I92,Feuil1!$F$10:$O$24,4),IF(AND(H92>=1972,H92<1977),VLOOKUP(I92,Feuil1!$F$10:$O$24,3),IF(AND(H92>=1977,H92<1982),VLOOKUP(I92,Feuil1!$F$10:$O$24,2),VLOOKUP(I92,Feuil1!$F$10:$O$24,2))))))))))","v":{"$error":"#N/A"}},null,{"$f":"T92-HLOOKUP(Y92,Feuil1!$C$1:$BF$9,2,FALSE)","v":{"$error":"#VALUE!"}},{"$f":"T92-HLOOKUP(Y92,Feuil1!$C$1:$BF$9,3,FALSE)","v":{"$error":"#VALUE!"}},{"$f":"T92-HLOOKUP(Y92,Feuil1!$C$1:$BF$9,4,FALSE)","v":{"$error":"#VALUE!"}},{"$f":"T92-HLOOKUP(Y92,Feuil1!$C$1:$BF$9,5,FALSE)","v":{"$error":"#VALUE!"}},{"$f":"T92-HLOOKUP(Y92,Feuil1!$C$1:$BF$9,6,FALSE)","v":{"$error":"#VALUE!"}},{"$f":"T92-HLOOKUP(Y92,Feuil1!$C$1:$BF$9,7,FALSE)","v":{"$error":"#VALUE!"}},{"$f":"T92-HLOOKUP(Y92,Feuil1!$C$1:$BF$9,8,FALSE)","v":{"$error":"#VALUE!"}},{"$f":"T92-HLOOKUP(Y92,Feuil1!$C$1:$BF$9,9,FALSE)","v":{"$error":"#VALUE!"}},null,null,null,null,null,null,null,{"$error":"#VALUE!"},2017,null,{"$f":"IF(AQ92,VLOOKUP(AQ92,FEM!$AS$468:$AT$523,2))","v":4.4930000000000003}]
["F",null,null,null,null,null,null,null,null,null,null,null,null,null,"",null,null,null,"","","","","",false,{"$f":"IF(AND(H93<1936),VLOOKUP(I93,Feuil1!$F$10:$O$24,9),IF(AND(H93>=1942,H93<1947),VLOOKUP(I93,Feuil1!$F$10:$O$24,9),IF(AND(H93>=1947,H93<1952),VLOOKUP(I93,Feuil1!$F$10:$O$24,8),IF(AND(H93>=1952,H93<1957),VLOOKUP(I93,Feuil1!$F$10:$O$24,7),IF(AND(H93>=1957,H93<1962),VLOOKUP(I93,Feuil1!$F$10:$O$24,6),IF(AND(H93>=1962,H93<1967),VLOOKUP(I93,Feuil1!$F$10:$O$24,5),IF(AND(H93>=1967,H93<1972),VLOOKUP(I93,Feuil1!$F$10:$O$24,4),IF(AND(H93>=1972,H93<1977),VLOOKUP(I93,Feuil1!$F$10:$O$24,3),IF(AND(H93>=1977,H93<1982),VLOOKUP(I93,Feuil1!$F$10:$O$24,2),VLOOKUP(I93,Feuil1!$F$10:$O$24,2))))))))))","v":{"$error":"#N/A"}},null,{"$f":"T93-HLOOKUP(Y93,Feuil1!$C$1:$BF$9,2,FALSE)","v":{"$error":"#VALUE!"}},{"$f":"T93-HLOOKUP(Y93,Feuil1!$C$1:$BF$9,3,FALSE)","v":{"$error":"#VALUE!"}},{"$f":"T93-HLOOKUP(Y93,Feuil1!$C$1:$BF$9,4,FALSE)","v":{"$error":"#VALUE!"}},{"$f":"T93-HLOOKUP(Y93,Feuil1!$C$1:$BF$9,5,FALSE)","v":{"$error":"#VALUE!"}},{"$f":"T93-HLOOKUP(Y93,Feuil1!$C$1:$BF$9,6,FALSE)","v":{"$error":"#VALUE!"}},{"$f":"T93-HLOOKUP(Y93,Feuil1!$C$1:$BF$9,7,FALSE)","v":{"$error":"#VALUE!"}},{"$f":"T93-HLOOKUP(Y93,Feuil1!$C$1:$BF$9,8,FALSE)","v":{"$error":"#VALUE!"}},{"$f":"T93-HLOOKUP(Y93,Feuil1!$C$1:$BF$9,9,FALSE)","v":{"$error":"#VALUE!"}},null,null,null,null,null,null,null,{"$error":"#VALUE!"},2017,null,{"$f":"IF(AQ93,VLOOKUP(AQ93,FEM!$AS$468:$AT$523,2))","v":4.4930000000000003}]
["F",null,null,null,null,null,null,null,null,null,null,null,null,null,"",null,null,null,"","","","","",false,{"$f":"IF(AND(H94<1936),VLOOKUP(I94,Feuil1!$F$10:$O$24,9),IF(AND(H94>=1942,H94<1947),VLOOKUP(I94,Feuil1!$F$10:$O$24,9),IF(AND(H94>=1947,H94<1952),VLOOKUP(I94,Feuil1!$F$10:$O$24,8),IF(AND(H94>=1952,H94<1957),VLOOKUP(I94,Feuil1!$F$10:$O$24,7),IF(AND(H94>=1957,H94<1962),VLOOKUP(I94,Feuil1!$F$10:$O$24,6),IF(AND(H94>=1962,H94<1967),VLOOKUP(I94,Feuil1!$F$10:$O$24,5),IF(AND(H94>=1967,H94<1972),VLOOKUP(I94,Feuil1!$F$10:$O$24,4),IF(AND(H94>=1972,H94<1977),VLOOKUP(I94,Feuil1!$F$10:$O$24,3),IF(AND(H94>=1977,H94<1982),VLOOKUP(I94,Feuil1!$F$10:$O$24,2),VLOOKUP(I94,Feuil1!$F$10:$O$24,2))))))))))","v":{"$error":"#N/A"}},null,{"$f":"T94-HLOOKUP(Y94,Feuil1!$C$1:$BF$9,2,FALSE)","v":{"$error":"#VALUE!"}},{"$f":"T94-HLOOKUP(Y94,Feuil1!$C$1:$BF$9,3,FALSE)","v":{"$error":"#VALUE!"}},{"$f":"T94-HLOOKUP(Y94,Feuil1!$C$1:$BF$9,4,FALSE)","v":{"$error":"#VALUE!"}},{"$f":"T94-HLOOKUP(Y94,Feuil1!$C$1:$BF$9,5,FALSE)","v":{"$error":"#VALUE!"}},{"$f":"T94-HLOOKUP(Y94,Feuil1!$C$1:$BF$9,6,FALSE)","v":{"$error":"#VALUE!"}},{"$f":"T94-HLOOKUP(Y94,Feuil1!$C$1:$BF$9,7,FALSE)","v":{"$error":"#VALUE!"}},{"$f":"T94-HLOOKUP(Y94,Feuil1!$C$1:$BF$9,8,FALSE)","v":{"$error":"#VALUE!"}},{"$f":"T94-HLOOKUP(Y94,Feuil1!$C$1:$BF$9,9,FALSE)","v":{"$error":"#VALUE!"}},null,null,null,null,null,null,null,{"$error":"#VALUE!"},2017,null,{"$f":"IF(AQ94,VLOOKUP(AQ94,FEM!$AS$468:$AT$523,2))","v":4.4930000000000003}]
["F",null,null,null,null,null,null,null,null,null,null,null,null,null,"",null,null,null,"","","","","",false,{"$f":"IF(AND(H95<1936),VLOOKUP(I95,Feuil1!$F$10:$O$24,9),IF(AND(H95>=1942,H95<1947),VLOOKUP(I95,Feuil1!$F$10:$O$24,9),IF(AND(H95>=1947,H95<1952),VLOOKUP(I95,Feuil1!$F$10:$O$24,8),IF(AND(H95>=1952,H95<1957),VLOOKUP(I95,Feuil1!$F$10:$O$24,7),IF(AND(H95>=1957,H95<1962),VLOOKUP(I95,Feuil1!$F$10:$O$24,6),IF(AND(H95>=1962,H95<1967),VLOOKUP(I95,Feuil1!$F$10:$O$24,5),IF(AND(H95>=1967,H95<1972),VLOOKUP(I95,Feuil1!$F$10:$O$24,4),IF(AND(H95>=1972,H95<1977),VLOOKUP(I95,Feuil1!$F$10:$O$24,3),IF(AND(H95>=1977,H95<1982),VLOOKUP(I95,Feuil1!$F$10:$O$24,2),VLOOKUP(I95,Feuil1!$F$10:$O$24,2))))))))))","v":{"$error":"#N/A"}},null,{"$f":"T95-HLOOKUP(Y95,Feuil1!$C$1:$BF$9,2,FALSE)","v":{"$error":"#VALUE!"}},{"$f":"T95-HLOOKUP(Y95,Feuil1!$C$1:$BF$9,3,FALSE)","v":{"$error":"#VALUE!"}},{"$f":"T95-HLOOKUP(Y95,Feuil1!$C$1:$BF$9,4,FALSE)","v":{"$error":"#VALUE!"}},{"$f":"T95-HLOOKUP(Y95,Feuil1!$C$1:$BF$9,5,FALSE)","v":{"$error":"#VALUE!"}},{"$f":"T95-HLOOKUP(Y95,Feuil1!$C$1:$BF$9,6,FALSE)","v":{"$error":"#VALUE!"}},{"$f":"T95-HLOOKUP(Y95,Feuil1!$C$1:$BF$9,7,FALSE)","v":{"$error":"#VALUE!"}},{"$f":"T95-HLOOKUP(Y95,Feuil1!$C$1:$BF$9,8,FALSE)","v":{"$error":"#VALUE!"}},{"$f":"T95-HLOOKUP(Y95,Feuil1!$C$1:$BF$9,9,FALSE)","v":{"$error":"#VALUE!"}},null,null,null,null,null,null,null,{"$error":"#VALUE!"},2017,null,{"$f":"IF(AQ95,VLOOKUP(AQ95,FEM!$AS$468:$AT$523,2))","v":4.4930000000000003}]
["F",null,null,null,null,null,null,null,null,null,null,null,null,null,"",null,null,null,"","","","","",false,{"$f":"IF(AND(H96<1936),VLOOKUP(I96,Feuil1!$F$10:$O$24,9),IF(AND(H96>=1942,H96<1947),VLOOKUP(I96,Feuil1!$F$10:$O$24,9),IF(AND(H96>=1947,H96<1952),VLOOKUP(I96,Feuil1!$F$10:$O$24,8),IF(AND(H96>=1952,H96<1957),VLOOKUP(I96,Feuil1!$F$10:$O$24,7),IF(AND(H96>=1957,H96<1962),VLOOKUP(I96,Feuil1!$F$10:$O$24,6),IF(AND(H96>=1962,H96<1967),VLOOKUP(I96,Feuil1!$F$10:$O$24,5),IF(AND(H96>=1967,H96<1972),VLOOKUP(I96,Feuil1!$F$10:$O$24,4),IF(AND(H96>=1972,H96<1977),VLOOKUP(I96,Feuil1!$F$10:$O$24,3),IF(AND(H96>=1977,H96<1982),VLOOKUP(I96,Feuil1!$F$10:$O$24,2),VLOOKUP(I96,Feuil1!$F$10:$O$24,2))))))))))","v":{"$error":"#N/A"}},null,{"$f":"T96-HLOOKUP(Y96,Feuil1!$C$1:$BF$9,2,FALSE)","v":{"$error":"#VALUE!"}},{"$f":"T96-HLOOKUP(Y96,Feuil1!$C$1:$BF$9,3,FALSE)","v":{"$error":"#VALUE!"}},{"$f":"T96-HLOOKUP(Y96,Feuil1!$C$1:$BF$9,4,FALSE)","v":{"$error":"#VALUE!"}},{"$f":"T96-HLOOKUP(Y96,Feuil1!$C$1:$BF$9,5,FALSE)","v":{"$error":"#VALUE!"}},{"$f":"T96-HLOOKUP(Y96,Feuil1!$C$1:$BF$9,6,FALSE)","v":{"$error":"#VALUE!"}},{"$f":"T96-HLOOKUP(Y96,Feuil1!$C$1:$BF$9,7,FALSE)","v":{"$error":"#VALUE!"}},{"$f":"T96-HLOOKUP(Y96,Feuil1!$C$1:$BF$9,8,FALSE)","v":{"$error":"#VALUE!"}},{"$f":"T96-HLOOKUP(Y96,Feuil1!$C$1:$BF$9,9,FALSE)","v":{"$error":"#VALUE!"}},null,null,null,null,null,null,null,{"$error":"#VALUE!"},2017,null,{"$f":"IF(AQ96,VLOOKUP(AQ96,FEM!$AS$468:$AT$523,2))","v":4.4930000000000003}]
["F",null,null,null,null,null,null,null,null,null,null,null,null,null,"",null,null,null,"","","","","",false,{"$f":"IF(AND(H97<1936),VLOOKUP(I97,Feuil1!$F$10:$O$24,9),IF(AND(H97>=1942,H97<1947),VLOOKUP(I97,Feuil1!$F$10:$O$24,9),IF(AND(H97>=1947,H97<1952),VLOOKUP(I97,Feuil1!$F$10:$O$24,8),IF(AND(H97>=1952,H97<1957),VLOOKUP(I97,Feuil1!$F$10:$O$24,7),IF(AND(H97>=1957,H97<1962),VLOOKUP(I97,Feuil1!$F$10:$O$24,6),IF(AND(H97>=1962,H97<1967),VLOOKUP(I97,Feuil1!$F$10:$O$24,5),IF(AND(H97>=1967,H97<1972),VLOOKUP(I97,Feuil1!$F$10:$O$24,4),IF(AND(H97>=1972,H97<1977),VLOOKUP(I97,Feuil1!$F$10:$O$24,3),IF(AND(H97>=1977,H97<1982),VLOOKUP(I97,Feuil1!$F$10:$O$24,2),VLOOKUP(I97,Feuil1!$F$10:$O$24,2))))))))))","v":{"$error":"#N/A"}},null,{"$f":"T97-HLOOKUP(Y97,Feuil1!$C$1:$BF$9,2,FALSE)","v":{"$error":"#VALUE!"}},{"$f":"T97-HLOOKUP(Y97,Feuil1!$C$1:$BF$9,3,FALSE)","v":{"$error":"#VALUE!"}},{"$f":"T97-HLOOKUP(Y97,Feuil1!$C$1:$BF$9,4,FALSE)","v":{"$error":"#VALUE!"}},{"$f":"T97-HLOOKUP(Y97,Feuil1!$C$1:$BF$9,5,FALSE)","v":{"$error":"#VALUE!"}},{"$f":"T97-HLOOKUP(Y97,Feuil1!$C$1:$BF$9,6,FALSE)","v":{"$error":"#VALUE!"}},{"$f":"T97-HLOOKUP(Y97,Feuil1!$C$1:$BF$9,7,FALSE)","v":{"$error":"#VALUE!"}},{"$f":"T97-HLOOKUP(Y97,Feuil1!$C$1:$BF$9,8,FALSE)","v":{"$error":"#VALUE!"}},{"$f":"T97-HLOOKUP(Y97,Feuil1!$C$1:$BF$9,9,FALSE)","v":{"$error":"#VALUE!"}},null,null,null,null,null,null,null,{"$error":"#VALUE!"},2017,null,{"$f":"IF(AQ97,VLOOKUP(AQ97,FEM!$AS$468:$AT$523,2))","v":4.4930000000000003}]
["F",null,null,null,null,null,null,null,null,null,null,null,null,null,"",null,null,null,"","","","","",false,{"$f":"IF(AND(H98<1936),VLOOKUP(I98,Feuil1!$F$10:$O$24,9),IF(AND(H98>=1942,H98<1947),VLOOKUP(I98,Feuil1!$F$10:$O$24,9),IF(AND(H98>=1947,H98<1952),VLOOKUP(I98,Feuil1!$F$10:$O$24,8),IF(AND(H98>=1952,H98<1957),VLOOKUP(I98,Feuil1!$F$10:$O$24,7),IF(AND(H98>=1957,H98<1962),VLOOKUP(I98,Feuil1!$F$10:$O$24,6),IF(AND(H98>=1962,H98<1967),VLOOKUP(I98,Feuil1!$F$10:$O$24,5),IF(AND(H98>=1967,H98<1972),VLOOKUP(I98,Feuil1!$F$10:$O$24,4),IF(AND(H98>=1972,H98<1977),VLOOKUP(I98,Feuil1!$F$10:$O$24,3),IF(AND(H98>=1977,H98<1982),VLOOKUP(I98,Feuil1!$F$10:$O$24,2),VLOOKUP(I98,Feuil1!$F$10:$O$24,2))))))))))","v":{"$error":"#N/A"}},null,{"$f":"T98-HLOOKUP(Y98,Feuil1!$C$1:$BF$9,2,FALSE)","v":{"$error":"#VALUE!"}},{"$f":"T98-HLOOKUP(Y98,Feuil1!$C$1:$BF$9,3,FALSE)","v":{"$error":"#VALUE!"}},{"$f":"T98-HLOOKUP(Y98,Feuil1!$C$1:$BF$9,4,FALSE)","v":{"$error":"#VALUE!"}},{"$f":"T98-HLOOKUP(Y98,Feuil1!$C$1:$BF$9,5,FALSE)","v":{"$error":"#VALUE!"}},{"$f":"T98-HLOOKUP(Y98,Feuil1!$C$1:$BF$9,6,FALSE)","v":{"$error":"#VALUE!"}},{"$f":"T98-HLOOKUP(Y98,Feuil1!$C$1:$BF$9,7,FALSE)","v":{"$error":"#VALUE!"}},{"$f":"T98-HLOOKUP(Y98,Feuil1!$C$1:$BF$9,8,FALSE)","v":{"$error":"#VALUE!"}},{"$f":"T98-HLOOKUP(Y98,Feuil1!$C$1:$BF$9,9,FALSE)","v":{"$error":"#VALUE!"}},null,null,null,null,null,null,null,{"$error":"#VALUE!"},2017,null,{"$f":"IF(AQ98,VLOOKUP(AQ98,FEM!$AS$468:$AT$523,2))","v":4.4930000000000003}]
["F",null,null,null,null,null,null,null,null,null,null,null,null,null,"",null,null,null,"","","","","",false,{"$f":"IF(AND(H99<1936),VLOOKUP(I99,Feuil1!$F$10:$O$24,9),IF(AND(H99>=1942,H99<1947),VLOOKUP(I99,Feuil1!$F$10:$O$24,9),IF(AND(H99>=1947,H99<1952),VLOOKUP(I99,Feuil1!$F$10:$O$24,8),IF(AND(H99>=1952,H99<1957),VLOOKUP(I99,Feuil1!$F$10:$O$24,7),IF(AND(H99>=1957,H99<1962),VLOOKUP(I99,Feuil1!$F$10:$O$24,6),IF(AND(H99>=1962,H99<1967),VLOOKUP(I99,Feuil1!$F$10:$O$24,5),IF(AND(H99>=1967,H99<1972),VLOOKUP(I99,Feuil1!$F$10:$O$24,4),IF(AND(H99>=1972,H99<1977),VLOOKUP(I99,Feuil1!$F$10:$O$24,3),IF(AND(H99>=1977,H99<1982),VLOOKUP(I99,Feuil1!$F$10:$O$24,2),VLOOKUP(I99,Feuil1!$F$10:$O$24,2))))))))))","v":{"$error":"#N/A"}},null,{"$f":"T99-HLOOKUP(Y99,Feuil1!$C$1:$BF$9,2,FALSE)","v":{"$error":"#VALUE!"}},{"$f":"T99-HLOOKUP(Y99,Feuil1!$C$1:$BF$9,3,FALSE)","v":{"$error":"#VALUE!"}},{"$f":"T99-HLOOKUP(Y99,Feuil1!$C$1:$BF$9,4,FALSE)","v":{"$error":"#VALUE!"}},{"$f":"T99-HLOOKUP(Y99,Feuil1!$C$1:$BF$9,5,FALSE)","v":{"$error":"#VALUE!"}},{"$f":"T99-HLOOKUP(Y99,Feuil1!$C$1:$BF$9,6,FALSE)","v":{"$error":"#VALUE!"}},{"$f":"T99-HLOOKUP(Y99,Feuil1!$C$1:$BF$9,7,FALSE)","v":{"$error":"#VALUE!"}},{"$f":"T99-HLOOKUP(Y99,Feuil1!$C$1:$BF$9,8,FALSE)","v":{"$error":"#VALUE!"}},{"$f":"T99-HLOOKUP(Y99,Feuil1!$C$1:$BF$9,9,FALSE)","v":{"$error":"#VALUE!"}},null,null,null,null,null,null,null,{"$error":"#VALUE!"},2017,null,{"$f":"IF(AQ99,VLOOKUP(AQ99,FEM!$AS$468:$AT$523,2))","v":4.4930000000000003}]
["F",null,null,null,null,null,null,null,null,null,null,null,null,null,"",null,null,null,"","","","","",false,{"$f":"IF(AND(H100<1936),VLOOKUP(I100,Feuil1!$F$10:$O$24,9),IF(AND(H100>=1942,H100<1947),VLOOKUP(I100,Feuil1!$F$10:$O$24,9),IF(AND(H100>=1947,H100<1952),VLOOKUP(I100,Feuil1!$F$10:$O$24,8),IF(AND(H100>=1952,H100<1957),VLOOKUP(I100,Feuil1!$F$10:$O$24,7),IF(AND(H100>=1957,H100<1962),VLOOKUP(I100,Feuil1!$F$10:$O$24,6),IF(AND(H100>=1962,H100<1967),VLOOKUP(I100,Feuil1!$F$10:$O$24,5),IF(AND(H100>=1967,H100<1972),VLOOKUP(I100,Feuil1!$F$10:$O$24,4),IF(AND(H100>=1972,H100<1977),VLOOKUP(I100,Feuil1!$F$10:$O$24,3),IF(AND(H100>=1977,H100<1982),VLOOKUP(I100,Feuil1!$F$10:$O$24,2),VLOOKUP(I100,Feuil1!$F$10:$O$24,2))))))))))","v":{"$error":"#N/A"}},null,{"$f":"T100-HLOOKUP(Y100,Feuil1!$C$1:$BF$9,2,FALSE)","v":{"$error":"#VALUE!"}},{"$f":"T100-HLOOKUP(Y100,Feuil1!$C$1:$BF$9,3,FALSE)","v":{"$error":"#VALUE!"}},{"$f":"T100-HLOOKUP(Y100,Feuil1!$C$1:$BF$9,4,FALSE)","v":{"$error":"#VALUE!"}},{"$f":"T100-HLOOKUP(Y100,Feuil1!$C$1:$BF$9,5,FALSE)","v":{"$error":"#VALUE!"}},{"$f":"T100-HLOOKUP(Y100,Feuil1!$C$1:$BF$9,6,FALSE)","v":{"$error":"#VALUE!"}},{"$f":"T100-HLOOKUP(Y100,Feuil1!$C$1:$BF$9,7,FALSE)","v":{"$error":"#VALUE!"}},{"$f":"T100-HLOOKUP(Y100,Feuil1!$C$1:$BF$9,8,FALSE)","v":{"$error":"#VALUE!"}},{"$f":"T100-HLOOKUP(Y100,Feuil1!$C$1:$BF$9,9,FALSE)","v":{"$error":"#VALUE!"}},null,null,null,null,null,null,null,{"$error":"#VALUE!"},2017,null,{"$f":"IF(AQ100,VLOOKUP(AQ100,FEM!$AS$468:$AT$523,2))","v":4.4930000000000003}]
["F",null,null,null,null,null,null,null,null,null,null,null,null,null,"",null,null,null,"","","","","",false,{"$f":"IF(AND(H101<1936),VLOOKUP(I101,Feuil1!$F$10:$O$24,9),IF(AND(H101>=1942,H101<1947),VLOOKUP(I101,Feuil1!$F$10:$O$24,9),IF(AND(H101>=1947,H101<1952),VLOOKUP(I101,Feuil1!$F$10:$O$24,8),IF(AND(H101>=1952,H101<1957),VLOOKUP(I101,Feuil1!$F$10:$O$24,7),IF(AND(H101>=1957,H101<1962),VLOOKUP(I101,Feuil1!$F$10:$O$24,6),IF(AND(H101>=1962,H101<1967),VLOOKUP(I101,Feuil1!$F$10:$O$24,5),IF(AND(H101>=1967,H101<1972),VLOOKUP(I101,Feuil1!$F$10:$O$24,4),IF(AND(H101>=1972,H101<1977),VLOOKUP(I101,Feuil1!$F$10:$O$24,3),IF(AND(H101>=1977,H101<1982),VLOOKUP(I101,Feuil1!$F$10:$O$24,2),VLOOKUP(I101,Feuil1!$F$10:$O$24,2))))))))))","v":{"$error":"#N/A"}},null,{"$f":"T101-HLOOKUP(Y101,Feuil1!$C$1:$BF$9,2,FALSE)","v":{"$error":"#VALUE!"}},{"$f":"T101-HLOOKUP(Y101,Feuil1!$C$1:$BF$9,3,FALSE)","v":{"$error":"#VALUE!"}},{"$f":"T101-HLOOKUP(Y101,Feuil1!$C$1:$BF$9,4,FALSE)","v":{"$error":"#VALUE!"}},{"$f":"T101-HLOOKUP(Y101,Feuil1!$C$1:$BF$9,5,FALSE)","v":{"$error":"#VALUE!"}},{"$f":"T101-HLOOKUP(Y101,Feuil1!$C$1:$BF$9,6,FALSE)","v":{"$error":"#VALUE!"}},{"$f":"T101-HLOOKUP(Y101,Feuil1!$C$1:$BF$9,7,FALSE)","v":{"$error":"#VALUE!"}},{"$f":"T101-HLOOKUP(Y101,Feuil1!$C$1:$BF$9,8,FALSE)","v":{"$error":"#VALUE!"}},{"$f":"T101-HLOOKUP(Y101,Feuil1!$C$1:$BF$9,9,FALSE)","v":{"$error":"#VALUE!"}},null,null,null,null,null,null,null,{"$error":"#VALUE!"},2017,null,{"$f":"IF(AQ101,VLOOKUP(AQ101,FEM!$AS$468:$AT$523,2))","v":4.4930000000000003}]
["F",null,null,null,null,null,null,null,null,null,null,null,null,null,"",null,null,null,"","","","","",false,{"$f":"IF(AND(H102<1936),VLOOKUP(I102,Feuil1!$F$10:$O$24,9),IF(AND(H102>=1942,H102<1947),VLOOKUP(I102,Feuil1!$F$10:$O$24,9),IF(AND(H102>=1947,H102<1952),VLOOKUP(I102,Feuil1!$F$10:$O$24,8),IF(AND(H102>=1952,H102<1957),VLOOKUP(I102,Feuil1!$F$10:$O$24,7),IF(AND(H102>=1957,H102<1962),VLOOKUP(I102,Feuil1!$F$10:$O$24,6),IF(AND(H102>=1962,H102<1967),VLOOKUP(I102,Feuil1!$F$10:$O$24,5),IF(AND(H102>=1967,H102<1972),VLOOKUP(I102,Feuil1!$F$10:$O$24,4),IF(AND(H102>=1972,H102<1977),VLOOKUP(I102,Feuil1!$F$10:$O$24,3),IF(AND(H102>=1977,H102<1982),VLOOKUP(I102,Feuil1!$F$10:$O$24,2),VLOOKUP(I102,Feuil1!$F$10:$O$24,2))))))))))","v":{"$error":"#N/A"}},null,{"$f":"T102-HLOOKUP(Y102,Feuil1!$C$1:$BF$9,2,FALSE)","v":{"$error":"#VALUE!"}},{"$f":"T102-HLOOKUP(Y102,Feuil1!$C$1:$BF$9,3,FALSE)","v":{"$error":"#VALUE!"}},{"$f":"T102-HLOOKUP(Y102,Feuil1!$C$1:$BF$9,4,FALSE)","v":{"$error":"#VALUE!"}},{"$f":"T102-HLOOKUP(Y102,Feuil1!$C$1:$BF$9,5,FALSE)","v":{"$error":"#VALUE!"}},{"$f":"T102-HLOOKUP(Y102,Feuil1!$C$1:$BF$9,6,FALSE)","v":{"$error":"#VALUE!"}},{"$f":"T102-HLOOKUP(Y102,Feuil1!$C$1:$BF$9,7,FALSE)","v":{"$error":"#VALUE!"}},{"$f":"T102-HLOOKUP(Y102,Feuil1!$C$1:$BF$9,8,FALSE)","v":{"$error":"#VALUE!"}},{"$f":"T102-HLOOKUP(Y102,Feuil1!$C$1:$BF$9,9,FALSE)","v":{"$error":"#VALUE!"}},null,null,null,null,null,null,null,{"$error":"#VALUE!"},2017,null,{"$f":"IF(AQ102,VLOOKUP(AQ102,FEM!$AS$468:$AT$523,2))","v":4.4930000000000003}]
["F",null,null,null,null,null,null,null,null,null,null,null,null,null,"",null,null,null,"","","","","",false,{"$f":"IF(AND(H103<1936),VLOOKUP(I103,Feuil1!$F$10:$O$24,9),IF(AND(H103>=1942,H103<1947),VLOOKUP(I103,Feuil1!$F$10:$O$24,9),IF(AND(H103>=1947,H103<1952),VLOOKUP(I103,Feuil1!$F$10:$O$24,8),IF(AND(H103>=1952,H103<1957),VLOOKUP(I103,Feuil1!$F$10:$O$24,7),IF(AND(H103>=1957,H103<1962),VLOOKUP(I103,Feuil1!$F$10:$O$24,6),IF(AND(H103>=1962,H103<1967),VLOOKUP(I103,Feuil1!$F$10:$O$24,5),IF(AND(H103>=1967,H103<1972),VLOOKUP(I103,Feuil1!$F$10:$O$24,4),IF(AND(H103>=1972,H103<1977),VLOOKUP(I103,Feuil1!$F$10:$O$24,3),IF(AND(H103>=1977,H103<1982),VLOOKUP(I103,Feuil1!$F$10:$O$24,2),VLOOKUP(I103,Feuil1!$F$10:$O$24,2))))))))))","v":{"$error":"#N/A"}},null,{"$f":"T103-HLOOKUP(Y103,Feuil1!$C$1:$BF$9,2,FALSE)","v":{"$error":"#VALUE!"}},{"$f":"T103-HLOOKUP(Y103,Feuil1!$C$1:$BF$9,3,FALSE)","v":{"$error":"#VALUE!"}},{"$f":"T103-HLOOKUP(Y103,Feuil1!$C$1:$BF$9,4,FALSE)","v":{"$error":"#VALUE!"}},{"$f":"T103-HLOOKUP(Y103,Feuil1!$C$1:$BF$9,5,FALSE)","v":{"$error":"#VALUE!"}},{"$f":"T103-HLOOKUP(Y103,Feuil1!$C$1:$BF$9,6,FALSE)","v":{"$error":"#VALUE!"}},{"$f":"T103-HLOOKUP(Y103,Feuil1!$C$1:$BF$9,7,FALSE)","v":{"$error":"#VALUE!"}},{"$f":"T103-HLOOKUP(Y103,Feuil1!$C$1:$BF$9,8,FALSE)","v":{"$error":"#VALUE!"}},{"$f":"T103-HLOOKUP(Y103,Feuil1!$C$1:$BF$9,9,FALSE)","v":{"$error":"#VALUE!"}},null,null,null,null,null,null,null,{"$error":"#VALUE!"},2017,null,{"$f":"IF(AQ103,VLOOKUP(AQ103,FEM!$AS$468:$AT$523,2))","v":4.4930000000000003}]
["F",null,null,null,null,null,null,null,null,null,null,null,null,null,"",null,null,null,"","","","","",false,{"$f":"IF(AND(H104<1936),VLOOKUP(I104,Feuil1!$F$10:$O$24,9),IF(AND(H104>=1942,H104<1947),VLOOKUP(I104,Feuil1!$F$10:$O$24,9),IF(AND(H104>=1947,H104<1952),VLOOKUP(I104,Feuil1!$F$10:$O$24,8),IF(AND(H104>=1952,H104<1957),VLOOKUP(I104,Feuil1!$F$10:$O$24,7),IF(AND(H104>=1957,H104<1962),VLOOKUP(I104,Feuil1!$F$10:$O$24,6),IF(AND(H104>=1962,H104<1967),VLOOKUP(I104,Feuil1!$F$10:$O$24,5),IF(AND(H104>=1967,H104<1972),VLOOKUP(I104,Feuil1!$F$10:$O$24,4),IF(AND(H104>=1972,H104<1977),VLOOKUP(I104,Feuil1!$F$10:$O$24,3),IF(AND(H104>=1977,H104<1982),VLOOKUP(I104,Feuil1!$F$10:$O$24,2),VLOOKUP(I104,Feuil1!$F$10:$O$24,2))))))))))","v":{"$error":"#N/A"}},null,{"$f":"T104-HLOOKUP(Y104,Feuil1!$C$1:$BF$9,2,FALSE)","v":{"$error":"#VALUE!"}},{"$f":"T104-HLOOKUP(Y104,Feuil1!$C$1:$BF$9,3,FALSE)","v":{"$error":"#VALUE!"}},{"$f":"T104-HLOOKUP(Y104,Feuil1!$C$1:$BF$9,4,FALSE)","v":{"$error":"#VALUE!"}},{"$f":"T104-HLOOKUP(Y104,Feuil1!$C$1:$BF$9,5,FALSE)","v":{"$error":"#VALUE!"}},{"$f":"T104-HLOOKUP(Y104,Feuil1!$C$1:$BF$9,6,FALSE)","v":{"$error":"#VALUE!"}},{"$f":"T104-HLOOKUP(Y104,Feuil1!$C$1:$BF$9,7,FALSE)","v":{"$error":"#VALUE!"}},{"$f":"T104-HLOOKUP(Y104,Feuil1!$C$1:$BF$9,8,FALSE)","v":{"$error":"#VALUE!"}},{"$f":"T104-HLOOKUP(Y104,Feuil1!$C$1:$BF$9,9,FALSE)","v":{"$error":"#VALUE!"}},null,null,null,null,null,null,null,{"$error":"#VALUE!"},2017,null,{"$f":"IF(AQ104,VLOOKUP(AQ104,FEM!$AS$468:$AT$523,2))","v":4.4930000000000003}]
["F",null,null,null,null,null,null,null,null,null,null,null,null,null,"",null,null,null,"","","","","",false,{"$f":"IF(AND(H105<1936),VLOOKUP(I105,Feuil1!$F$10:$O$24,9),IF(AND(H105>=1942,H105<1947),VLOOKUP(I105,Feuil1!$F$10:$O$24,9),IF(AND(H105>=1947,H105<1952),VLOOKUP(I105,Feuil1!$F$10:$O$24,8),IF(AND(H105>=1952,H105<1957),VLOOKUP(I105,Feuil1!$F$10:$O$24,7),IF(AND(H105>=1957,H105<1962),VLOOKUP(I105,Feuil1!$F$10:$O$24,6),IF(AND(H105>=1962,H105<1967),VLOOKUP(I105,Feuil1!$F$10:$O$24,5),IF(AND(H105>=1967,H105<1972),VLOOKUP(I105,Feuil1!$F$10:$O$24,4),IF(AND(H105>=1972,H105<1977),VLOOKUP(I105,Feuil1!$F$10:$O$24,3),IF(AND(H105>=1977,H105<1982),VLOOKUP(I105,Feuil1!$F$10:$O$24,2),VLOOKUP(I105,Feuil1!$F$10:$O$24,2))))))))))","v":{"$error":"#N/A"}},null,{"$f":"T105-HLOOKUP(Y105,Feuil1!$C$1:$BF$9,2,FALSE)","v":{"$error":"#VALUE!"}},{"$f":"T105-HLOOKUP(Y105,Feuil1!$C$1:$BF$9,3,FALSE)","v":{"$error":"#VALUE!"}},{"$f":"T105-HLOOKUP(Y105,Feuil1!$C$1:$BF$9,4,FALSE)","v":{"$error":"#VALUE!"}},{"$f":"T105-HLOOKUP(Y105,Feuil1!$C$1:$BF$9,5,FALSE)","v":{"$error":"#VALUE!"}},{"$f":"T105-HLOOKUP(Y105,Feuil1!$C$1:$BF$9,6,FALSE)","v":{"$error":"#VALUE!"}},{"$f":"T105-HLOOKUP(Y105,Feuil1!$C$1:$BF$9,7,FALSE)","v":{"$error":"#VALUE!"}},{"$f":"T105-HLOOKUP(Y105,Feuil1!$C$1:$BF$9,8,FALSE)","v":{"$error":"#VALUE!"}},{"$f":"T105-HLOOKUP(Y105,Feuil1!$C$1:$BF$9,9,FALSE)","v":{"$error":"#VALUE!"}},null,null,null,null,null,null,null,{"$error":"#VALUE!"},2017,null,{"$f":"IF(AQ105,VLOOKUP(AQ105,FEM!$AS$468:$AT$523,2))","v":4.4930000000000003}]
["F",null,null,null,null,null,null,null,null,null,null,null,null,null,{"$f":"IF(I106=\"\",\"\",IF(MAXA(L106:N106)<=0,0,MAXA(L106:N106)))","v":""},null,null,null,{"$f":"IF(I106=\"\",\"\",IF(MAXA(P106:R106)<=0,0,MAXA(P106:R106)))","v":""},{"$f":"IF(I106=\"\",\"\",IF(OR(O106=0,S106=0),0,O106+S106))","v":""},{"$f":"IF(I106=\"\",\"\",IF(A106=\"H\",10^(0.794358141*LOG(I106/174.393)^2)*T106*AS106,IF(A106=\"F\",10^(0.89726074 * LOG(I106/148.026)^2)*T106*AS106,\"\")))","v":""},{"$f":"IF(I106=\"\",\"\",AP106)","v":""},{"$f":"IF(I106=\"\",\"\",IF(AH106>=0,AH106,IF(AG106>=0,AG106,IF(AF106>=0,AF106,IF(AE106>=0,AE106,IF(AD106>=0,AD106,IF(AC106>=0,AC106,IF(AB106>=0,AB106,AA106))))))))","v":""},{"$f":"IF(AQ106<95,IF(AQ106<=90,VLOOKUP(AQ106,$AQ$467:$AR$522,2)))","v":false},{"$f":"IF(AND(H106<1936),VLOOKUP(I106,Feuil1!$F$10:$O$24,9),IF(AND(H106>=1942,H106<1947),VLOOKUP(I106,Feuil1!$F$10:$O$24,9),IF(AND(H106>=1947,H106<1952),VLOOKUP(I106,Feuil1!$F$10:$O$24,8),IF(AND(H106>=1952,H106<1957),VLOOKUP(I106,Feuil1!$F$10:$O$24,7),IF(AND(H106>=1957,H106<1962),VLOOKUP(I106,Feuil1!$F$10:$O$24,6),IF(AND(H106>=1962,H106<1967),VLOOKUP(I106,Feuil1!$F$10:$O$24,5),IF(AND(H106>=1967,H106<1972),VLOOKUP(I106,Feuil1!$F$10:$O$24,4),IF(AND(H106>=1972,H106<1977),VLOOKUP(I106,Feuil1!$F$10:$O$24,3),IF(AND(H106>=1977,H106<1982),VLOOKUP(I106,Feuil1!$F$10:$O$24,2),VLOOKUP(I106,Feuil1!$F$10:$O$24,2))))))))))","v":{"$error":"#N/A"}},null,{"$f":"T106-HLOOKUP(Y106,Feuil1!$C$1:$BF$9,2,FALSE)","v":{"$error":"#VALUE!"}},{"$f":"T106-HLOOKUP(Y106,Feuil1!$C$1:$BF$9,3,FALSE)","v":{"$error":"#VALUE!"}},{"$f":"T106-HLOOKUP(Y106,Feuil1!$C$1:$BF$9,4,FALSE)","v":{"$error":"#VALUE!"}},{"$f":"T106-HLOOKUP(Y106,Feuil1!$C$1:$BF$9,5,FALSE)","v":{"$error":"#VALUE!"}},{"$f":"T106-HLOOKUP(Y106,Feuil1!$C$1:$BF$9,6,FALSE)","v":{"$error":"#VALUE!"}},{"$f":"T106-HLOOKUP(Y106,Feuil1!$C$1:$BF$9,7,FALSE)","v":{"$error":"#VALUE!"}},{"$f":"T106-HLOOKUP(Y106,Feuil1!$C$1:$BF$9,8,FALSE)","v":{"$error":"#VALUE!"}},{"$f":"T106-HLOOKUP(Y106,Feuil1!$C$1:$BF$9,9,FALSE)","v":{"$error":"#VALUE!"}},null,null,null,null,null,null,null,{"$f":"IF(AH106>=0,$AH$5,IF(AG106>=0,$AG$5,IF(AF106>=0,$AF$5,IF(AE106>=0,$AE$5,IF(AD106>=0,$AD$5,IF(AC106>=0,$AC$5,IF(AB106>=0,$AB$5,IF(AA106>=0,$AA$5,$AI$5))))))))","v":{"$error":"#VALUE!"}},2017,null,{"$f":"IF(AQ106,VLOOKUP(AQ106,FEM!$AS$468:$AT$523,2))","v":4.4930000000000003}]
["F",null,null,null,null,null,null,null,null,null,null,null,null,null,"",null,null,null,"","","","","",false,{"$f":"IF(AND(H107<1936),VLOOKUP(I107,Feuil1!$F$10:$O$24,9),IF(AND(H107>=1942,H107<1947),VLOOKUP(I107,Feuil1!$F$10:$O$24,9),IF(AND(H107>=1947,H107<1952),VLOOKUP(I107,Feuil1!$F$10:$O$24,8),IF(AND(H107>=1952,H107<1957),VLOOKUP(I107,Feuil1!$F$10:$O$24,7),IF(AND(H107>=1957,H107<1962),VLOOKUP(I107,Feuil1!$F$10:$O$24,6),IF(AND(H107>=1962,H107<1967),VLOOKUP(I107,Feuil1!$F$10:$O$24,5),IF(AND(H107>=1967,H107<1972),VLOOKUP(I107,Feuil1!$F$10:$O$24,4),IF(AND(H107>=1972,H107<1977),VLOOKUP(I107,Feuil1!$F$10:$O$24,3),IF(AND(H107>=1977,H107<1982),VLOOKUP(I107,Feuil1!$F$10:$O$24,2),VLOOKUP(I107,Feuil1!$F$10:$O$24,2))))))))))","v":{"$error":"#N/A"}},null,{"$f":"T107-HLOOKUP(Y107,Feuil1!$C$1:$BF$9,2,FALSE)","v":{"$error":"#VALUE!"}},{"$f":"T107-HLOOKUP(Y107,Feuil1!$C$1:$BF$9,3,FALSE)","v":{"$error":"#VALUE!"}},{"$f":"T107-HLOOKUP(Y107,Feuil1!$C$1:$BF$9,4,FALSE)","v":{"$error":"#VALUE!"}},{"$f":"T107-HLOOKUP(Y107,Feuil1!$C$1:$BF$9,5,FALSE)","v":{"$error":"#VALUE!"}},{"$f":"T107-HLOOKUP(Y107,Feuil1!$C$1:$BF$9,6,FALSE)","v":{"$error":"#VALUE!"}},{"$f":"T107-HLOOKUP(Y107,Feuil1!$C$1:$BF$9,7,FALSE)","v":{"$error":"#VALUE!"}},{"$f":"T107-HLOOKUP(Y107,Feuil1!$C$1:$BF$9,8,FALSE)","v":{"$error":"#VALUE!"}},{"$f":"T107-HLOOKUP(Y107,Feuil1!$C$1:$BF$9,9,FALSE)","v":{"$error":"#VALUE!"}},null,null,null,null,null,null,null,{"$error":"#VALUE!"},2017,null,{"$f":"IF(AQ107,VLOOKUP(AQ107,FEM!$AS$468:$AT$523,2))","v":4.4930000000000003}]
["F",null,null,null,null,null,null,null,null,null,null,null,null,null,"",null,null,null,"","","","","",false,{"$f":"IF(AND(H108<1936),VLOOKUP(I108,Feuil1!$F$10:$O$24,9),IF(AND(H108>=1942,H108<1947),VLOOKUP(I108,Feuil1!$F$10:$O$24,9),IF(AND(H108>=1947,H108<1952),VLOOKUP(I108,Feuil1!$F$10:$O$24,8),IF(AND(H108>=1952,H108<1957),VLOOKUP(I108,Feuil1!$F$10:$O$24,7),IF(AND(H108>=1957,H108<1962),VLOOKUP(I108,Feuil1!$F$10:$O$24,6),IF(AND(H108>=1962,H108<1967),VLOOKUP(I108,Feuil1!$F$10:$O$24,5),IF(AND(H108>=1967,H108<1972),VLOOKUP(I108,Feuil1!$F$10:$O$24,4),IF(AND(H108>=1972,H108<1977),VLOOKUP(I108,Feuil1!$F$10:$O$24,3),IF(AND(H108>=1977,H108<1982),VLOOKUP(I108,Feuil1!$F$10:$O$24,2),VLOOKUP(I108,Feuil1!$F$10:$O$24,2))))))))))","v":{"$error":"#N/A"}},null,{"$f":"T108-HLOOKUP(Y108,Feuil1!$C$1:$BF$9,2,FALSE)","v":{"$error":"#VALUE!"}},{"$f":"T108-HLOOKUP(Y108,Feuil1!$C$1:$BF$9,3,FALSE)","v":{"$error":"#VALUE!"}},{"$f":"T108-HLOOKUP(Y108,Feuil1!$C$1:$BF$9,4,FALSE)","v":{"$error":"#VALUE!"}},{"$f":"T108-HLOOKUP(Y108,Feuil1!$C$1:$BF$9,5,FALSE)","v":{"$error":"#VALUE!"}},{"$f":"T108-HLOOKUP(Y108,Feuil1!$C$1:$BF$9,6,FALSE)","v":{"$error":"#VALUE!"}},{"$f":"T108-HLOOKUP(Y108,Feuil1!$C$1:$BF$9,7,FALSE)","v":{"$error":"#VALUE!"}},{"$f":"T108-HLOOKUP(Y108,Feuil1!$C$1:$BF$9,8,FALSE)","v":{"$error":"#VALUE!"}},{"$f":"T108-HLOOKUP(Y108,Feuil1!$C$1:$BF$9,9,FALSE)","v":{"$error":"#VALUE!"}},null,null,null,null,null,null,null,{"$error":"#VALUE!"},2017,null,{"$f":"IF(AQ108,VLOOKUP(AQ108,FEM!$AS$468:$AT$523,2))","v":4.4930000000000003}]
["F",null,null,null,null,null,null,null,null,null,null,null,null,null,"",null,null,null,"","","","","",false,{"$f":"IF(AND(H109<1936),VLOOKUP(I109,Feuil1!$F$10:$O$24,9),IF(AND(H109>=1942,H109<1947),VLOOKUP(I109,Feuil1!$F$10:$O$24,9),IF(AND(H109>=1947,H109<1952),VLOOKUP(I109,Feuil1!$F$10:$O$24,8),IF(AND(H109>=1952,H109<1957),VLOOKUP(I109,Feuil1!$F$10:$O$24,7),IF(AND(H109>=1957,H109<1962),VLOOKUP(I109,Feuil1!$F$10:$O$24,6),IF(AND(H109>=1962,H109<1967),VLOOKUP(I109,Feuil1!$F$10:$O$24,5),IF(AND(H109>=1967,H109<1972),VLOOKUP(I109,Feuil1!$F$10:$O$24,4),IF(AND(H109>=1972,H109<1977),VLOOKUP(I109,Feuil1!$F$10:$O$24,3),IF(AND(H109>=1977,H109<1982),VLOOKUP(I109,Feuil1!$F$10:$O$24,2),VLOOKUP(I109,Feuil1!$F$10:$O$24,2))))))))))","v":{"$error":"#N/A"}},null,{"$f":"T109-HLOOKUP(Y109,Feuil1!$C$1:$BF$9,2,FALSE)","v":{"$error":"#VALUE!"}},{"$f":"T109-HLOOKUP(Y109,Feuil1!$C$1:$BF$9,3,FALSE)","v":{"$error":"#VALUE!"}},{"$f":"T109-HLOOKUP(Y109,Feuil1!$C$1:$BF$9,4,FALSE)","v":{"$error":"#VALUE!"}},{"$f":"T109-HLOOKUP(Y109,Feuil1!$C$1:$BF$9,5,FALSE)","v":{"$error":"#VALUE!"}},{"$f":"T109-HLOOKUP(Y109,Feuil1!$C$1:$BF$9,6,FALSE)","v":{"$error":"#VALUE!"}},{"$f":"T109-HLOOKUP(Y109,Feuil1!$C$1:$BF$9,7,FALSE)","v":{"$error":"#VALUE!"}},{"$f":"T109-HLOOKUP(Y109,Feuil1!$C$1:$BF$9,8,FALSE)","v":{"$error":"#VALUE!"}},{"$f":"T109-HLOOKUP(Y109,Feuil1!$C$1:$BF$9,9,FALSE)","v":{"$error":"#VALUE!"}},null,null,null,null,null,null,null,{"$error":"#VALUE!"},2017,null,{"$f":"IF(AQ109,VLOOKUP(AQ109,FEM!$AS$468:$AT$523,2))","v":4.4930000000000003}]
["F",null,null,null,null,null,null,null,null,null,null,null,null,null,"",null,null,null,"","","","","",false,{"$f":"IF(AND(H110<1936),VLOOKUP(I110,Feuil1!$F$10:$O$24,9),IF(AND(H110>=1942,H110<1947),VLOOKUP(I110,Feuil1!$F$10:$O$24,9),IF(AND(H110>=1947,H110<1952),VLOOKUP(I110,Feuil1!$F$10:$O$24,8),IF(AND(H110>=1952,H110<1957),VLOOKUP(I110,Feuil1!$F$10:$O$24,7),IF(AND(H110>=1957,H110<1962),VLOOKUP(I110,Feuil1!$F$10:$O$24,6),IF(AND(H110>=1962,H110<1967),VLOOKUP(I110,Feuil1!$F$10:$O$24,5),IF(AND(H110>=1967,H110<1972),VLOOKUP(I110,Feuil1!$F$10:$O$24,4),IF(AND(H110>=1972,H110<1977),VLOOKUP(I110,Feuil1!$F$10:$O$24,3),IF(AND(H110>=1977,H110<1982),VLOOKUP(I110,Feuil1!$F$10:$O$24,2),VLOOKUP(I110,Feuil1!$F$10:$O$24,2))))))))))","v":{"$error":"#N/A"}},null,{"$f":"T110-HLOOKUP(Y110,Feuil1!$C$1:$BF$9,2,FALSE)","v":{"$error":"#VALUE!"}},{"$f":"T110-HLOOKUP(Y110,Feuil1!$C$1:$BF$9,3,FALSE)","v":{"$error":"#VALUE!"}},{"$f":"T110-HLOOKUP(Y110,Feuil1!$C$1:$BF$9,4,FALSE)","v":{"$error":"#VALUE!"}},{"$f":"T110-HLOOKUP(Y110,Feuil1!$C$1:$BF$9,5,FALSE)","v":{"$error":"#VALUE!"}},{"$f":"T110-HLOOKUP(Y110,Feuil1!$C$1:$BF$9,6,FALSE)","v":{"$error":"#VALUE!"}},{"$f":"T110-HLOOKUP(Y110,Feuil1!$C$1:$BF$9,7,FALSE)","v":{"$error":"#VALUE!"}},{"$f":"T110-HLOOKUP(Y110,Feuil1!$C$1:$BF$9,8,FALSE)","v":{"$error":"#VALUE!"}},{"$f":"T110-HLOOKUP(Y110,Feuil1!$C$1:$BF$9,9,FALSE)","v":{"$error":"#VALUE!"}},null,null,null,null,null,null,null,{"$error":"#VALUE!"},2017,null,{"$f":"IF(AQ110,VLOOKUP(AQ110,FEM!$AS$468:$AT$523,2))","v":4.4930000000000003}]
["F",null,null,null,null,null,null,null,null,null,null,null,null,null,"",null,null,null,"","","","","",false,{"$f":"IF(AND(H111<1936),VLOOKUP(I111,Feuil1!$F$10:$O$24,9),IF(AND(H111>=1942,H111<1947),VLOOKUP(I111,Feuil1!$F$10:$O$24,9),IF(AND(H111>=1947,H111<1952),VLOOKUP(I111,Feuil1!$F$10:$O$24,8),IF(AND(H111>=1952,H111<1957),VLOOKUP(I111,Feuil1!$F$10:$O$24,7),IF(AND(H111>=1957,H111<1962),VLOOKUP(I111,Feuil1!$F$10:$O$24,6),IF(AND(H111>=1962,H111<1967),VLOOKUP(I111,Feuil1!$F$10:$O$24,5),IF(AND(H111>=1967,H111<1972),VLOOKUP(I111,Feuil1!$F$10:$O$24,4),IF(AND(H111>=1972,H111<1977),VLOOKUP(I111,Feuil1!$F$10:$O$24,3),IF(AND(H111>=1977,H111<1982),VLOOKUP(I111,Feuil1!$F$10:$O$24,2),VLOOKUP(I111,Feuil1!$F$10:$O$24,2))))))))))","v":{"$error":"#N/A"}},null,{"$f":"T111-HLOOKUP(Y111,Feuil1!$C$1:$BF$9,2,FALSE)","v":{"$error":"#VALUE!"}},{"$f":"T111-HLOOKUP(Y111,Feuil1!$C$1:$BF$9,3,FALSE)","v":{"$error":"#VALUE!"}},{"$f":"T111-HLOOKUP(Y111,Feuil1!$C$1:$BF$9,4,FALSE)","v":{"$error":"#VALUE!"}},{"$f":"T111-HLOOKUP(Y111,Feuil1!$C$1:$BF$9,5,FALSE)","v":{"$error":"#VALUE!"}},{"$f":"T111-HLOOKUP(Y111,Feuil1!$C$1:$BF$9,6,FALSE)","v":{"$error":"#VALUE!"}},{"$f":"T111-HLOOKUP(Y111,Feuil1!$C$1:$BF$9,7,FALSE)","v":{"$error":"#VALUE!"}},{"$f":"T111-HLOOKUP(Y111,Feuil1!$C$1:$BF$9,8,FALSE)","v":{"$error":"#VALUE!"}},{"$f":"T111-HLOOKUP(Y111,Feuil1!$C$1:$BF$9,9,FALSE)","v":{"$error":"#VALUE!"}},null,null,null,null,null,null,null,{"$error":"#VALUE!"},2017,null,{"$f":"IF(AQ111,VLOOKUP(AQ111,FEM!$AS$468:$AT$523,2))","v":4.4930000000000003}]
["F",null,null,null,null,null,null,null,null,null,null,null,null,null,"",null,null,null,"","","","","",false,{"$f":"IF(AND(H112<1936),VLOOKUP(I112,Feuil1!$F$10:$O$24,9),IF(AND(H112>=1942,H112<1947),VLOOKUP(I112,Feuil1!$F$10:$O$24,9),IF(AND(H112>=1947,H112<1952),VLOOKUP(I112,Feuil1!$F$10:$O$24,8),IF(AND(H112>=1952,H112<1957),VLOOKUP(I112,Feuil1!$F$10:$O$24,7),IF(AND(H112>=1957,H112<1962),VLOOKUP(I112,Feuil1!$F$10:$O$24,6),IF(AND(H112>=1962,H112<1967),VLOOKUP(I112,Feuil1!$F$10:$O$24,5),IF(AND(H112>=1967,H112<1972),VLOOKUP(I112,Feuil1!$F$10:$O$24,4),IF(AND(H112>=1972,H112<1977),VLOOKUP(I112,Feuil1!$F$10:$O$24,3),IF(AND(H112>=1977,H112<1982),VLOOKUP(I112,Feuil1!$F$10:$O$24,2),VLOOKUP(I112,Feuil1!$F$10:$O$24,2))))))))))","v":{"$error":"#N/A"}},null,{"$f":"T112-HLOOKUP(Y112,Feuil1!$C$1:$BF$9,2,FALSE)","v":{"$error":"#VALUE!"}},{"$f":"T112-HLOOKUP(Y112,Feuil1!$C$1:$BF$9,3,FALSE)","v":{"$error":"#VALUE!"}},{"$f":"T112-HLOOKUP(Y112,Feuil1!$C$1:$BF$9,4,FALSE)","v":{"$error":"#VALUE!"}},{"$f":"T112-HLOOKUP(Y112,Feuil1!$C$1:$BF$9,5,FALSE)","v":{"$error":"#VALUE!"}},{"$f":"T112-HLOOKUP(Y112,Feuil1!$C$1:$BF$9,6,FALSE)","v":{"$error":"#VALUE!"}},{"$f":"T112-HLOOKUP(Y112,Feuil1!$C$1:$BF$9,7,FALSE)","v":{"$error":"#VALUE!"}},{"$f":"T112-HLOOKUP(Y112,Feuil1!$C$1:$BF$9,8,FALSE)","v":{"$error":"#VALUE!"}},{"$f":"T112-HLOOKUP(Y112,Feuil1!$C$1:$BF$9,9,FALSE)","v":{"$error":"#VALUE!"}},null,null,null,null,null,null,null,{"$error":"#VALUE!"},2017,null,{"$f":"IF(AQ112,VLOOKUP(AQ112,FEM!$AS$468:$AT$523,2))","v":4.4930000000000003}]
["F",null,null,null,null,null,null,null,null,null,null,null,null,null,"",null,null,null,"","","","","",false,{"$f":"IF(AND(H113<1936),VLOOKUP(I113,Feuil1!$F$10:$O$24,9),IF(AND(H113>=1942,H113<1947),VLOOKUP(I113,Feuil1!$F$10:$O$24,9),IF(AND(H113>=1947,H113<1952),VLOOKUP(I113,Feuil1!$F$10:$O$24,8),IF(AND(H113>=1952,H113<1957),VLOOKUP(I113,Feuil1!$F$10:$O$24,7),IF(AND(H113>=1957,H113<1962),VLOOKUP(I113,Feuil1!$F$10:$O$24,6),IF(AND(H113>=1962,H113<1967),VLOOKUP(I113,Feuil1!$F$10:$O$24,5),IF(AND(H113>=1967,H113<1972),VLOOKUP(I113,Feuil1!$F$10:$O$24,4),IF(AND(H113>=1972,H113<1977),VLOOKUP(I113,Feuil1!$F$10:$O$24,3),IF(AND(H113>=1977,H113<1982),VLOOKUP(I113,Feuil1!$F$10:$O$24,2),VLOOKUP(I113,Feuil1!$F$10:$O$24,2))))))))))","v":{"$error":"#N/A"}},null,{"$f":"T113-HLOOKUP(Y113,Feuil1!$C$1:$BF$9,2,FALSE)","v":{"$error":"#VALUE!"}},{"$f":"T113-HLOOKUP(Y113,Feuil1!$C$1:$BF$9,3,FALSE)","v":{"$error":"#VALUE!"}},{"$f":"T113-HLOOKUP(Y113,Feuil1!$C$1:$BF$9,4,FALSE)","v":{"$error":"#VALUE!"}},{"$f":"T113-HLOOKUP(Y113,Feuil1!$C$1:$BF$9,5,FALSE)","v":{"$error":"#VALUE!"}},{"$f":"T113-HLOOKUP(Y113,Feuil1!$C$1:$BF$9,6,FALSE)","v":{"$error":"#VALUE!"}},{"$f":"T113-HLOOKUP(Y113,Feuil1!$C$1:$BF$9,7,FALSE)","v":{"$error":"#VALUE!"}},{"$f":"T113-HLOOKUP(Y113,Feuil1!$C$1:$BF$9,8,FALSE)","v":{"$error":"#VALUE!"}},{"$f":"T113-HLOOKUP(Y113,Feuil1!$C$1:$BF$9,9,FALSE)","v":{"$error":"#VALUE!"}},null,null,null,null,null,null,null,{"$error":"#VALUE!"},2017,null,{"$f":"IF(AQ113,VLOOKUP(AQ113,FEM!$AS$468:$AT$523,2))","v":4.4930000000000003}]
["F",null,null,null,null,null,null,null,null,null,null,null,null,null,"",null,null,null,"","","","","",false,{"$f":"IF(AND(H114<1936),VLOOKUP(I114,Feuil1!$F$10:$O$24,9),IF(AND(H114>=1942,H114<1947),VLOOKUP(I114,Feuil1!$F$10:$O$24,9),IF(AND(H114>=1947,H114<1952),VLOOKUP(I114,Feuil1!$F$10:$O$24,8),IF(AND(H114>=1952,H114<1957),VLOOKUP(I114,Feuil1!$F$10:$O$24,7),IF(AND(H114>=1957,H114<1962),VLOOKUP(I114,Feuil1!$F$10:$O$24,6),IF(AND(H114>=1962,H114<1967),VLOOKUP(I114,Feuil1!$F$10:$O$24,5),IF(AND(H114>=1967,H114<1972),VLOOKUP(I114,Feuil1!$F$10:$O$24,4),IF(AND(H114>=1972,H114<1977),VLOOKUP(I114,Feuil1!$F$10:$O$24,3),IF(AND(H114>=1977,H114<1982),VLOOKUP(I114,Feuil1!$F$10:$O$24,2),VLOOKUP(I114,Feuil1!$F$10:$O$24,2))))))))))","v":{"$error":"#N/A"}},null,{"$f":"T114-HLOOKUP(Y114,Feuil1!$C$1:$BF$9,2,FALSE)","v":{"$error":"#VALUE!"}},{"$f":"T114-HLOOKUP(Y114,Feuil1!$C$1:$BF$9,3,FALSE)","v":{"$error":"#VALUE!"}},{"$f":"T114-HLOOKUP(Y114,Feuil1!$C$1:$BF$9,4,FALSE)","v":{"$error":"#VALUE!"}},{"$f":"T114-HLOOKUP(Y114,Feuil1!$C$1:$BF$9,5,FALSE)","v":{"$error":"#VALUE!"}},{"$f":"T114-HLOOKUP(Y114,Feuil1!$C$1:$BF$9,6,FALSE)","v":{"$error":"#VALUE!"}},{"$f":"T114-HLOOKUP(Y114,Feuil1!$C$1:$BF$9,7,FALSE)","v":{"$error":"#VALUE!"}},{"$f":"T114-HLOOKUP(Y114,Feuil1!$C$1:$BF$9,8,FALSE)","v":{"$error":"#VALUE!"}},{"$f":"T114-HLOOKUP(Y114,Feuil1!$C$1:$BF$9,9,FALSE)","v":{"$error":"#VALUE!"}},null,null,null,null,null,null,null,{"$error":"#VALUE!"},2017,null,{"$f":"IF(AQ114,VLOOKUP(AQ114,FEM!$AS$468:$AT$523,2))","v":4.4930000000000003}]
["F",null,null,null,null,null,null,null,null,null,null,null,null,null,"",null,null,null,"","","","","",false,{"$f":"IF(AND(H115<1936),VLOOKUP(I115,Feuil1!$F$10:$O$24,9),IF(AND(H115>=1942,H115<1947),VLOOKUP(I115,Feuil1!$F$10:$O$24,9),IF(AND(H115>=1947,H115<1952),VLOOKUP(I115,Feuil1!$F$10:$O$24,8),IF(AND(H115>=1952,H115<1957),VLOOKUP(I115,Feuil1!$F$10:$O$24,7),IF(AND(H115>=1957,H115<1962),VLOOKUP(I115,Feuil1!$F$10:$O$24,6),IF(AND(H115>=1962,H115<1967),VLOOKUP(I115,Feuil1!$F$10:$O$24,5),IF(AND(H115>=1967,H115<1972),VLOOKUP(I115,Feuil1!$F$10:$O$24,4),IF(AND(H115>=1972,H115<1977),VLOOKUP(I115,Feuil1!$F$10:$O$24,3),IF(AND(H115>=1977,H115<1982),VLOOKUP(I115,Feuil1!$F$10:$O$24,2),VLOOKUP(I115,Feuil1!$F$10:$O$24,2))))))))))","v":{"$error":"#N/A"}},null,{"$f":"T115-HLOOKUP(Y115,Feuil1!$C$1:$BF$9,2,FALSE)","v":{"$error":"#VALUE!"}},{"$f":"T115-HLOOKUP(Y115,Feuil1!$C$1:$BF$9,3,FALSE)","v":{"$error":"#VALUE!"}},{"$f":"T115-HLOOKUP(Y115,Feuil1!$C$1:$BF$9,4,FALSE)","v":{"$error":"#VALUE!"}},{"$f":"T115-HLOOKUP(Y115,Feuil1!$C$1:$BF$9,5,FALSE)","v":{"$error":"#VALUE!"}},{"$f":"T115-HLOOKUP(Y115,Feuil1!$C$1:$BF$9,6,FALSE)","v":{"$error":"#VALUE!"}},{"$f":"T115-HLOOKUP(Y115,Feuil1!$C$1:$BF$9,7,FALSE)","v":{"$error":"#VALUE!"}},{"$f":"T115-HLOOKUP(Y115,Feuil1!$C$1:$BF$9,8,FALSE)","v":{"$error":"#VALUE!"}},{"$f":"T115-HLOOKUP(Y115,Feuil1!$C$1:$BF$9,9,FALSE)","v":{"$error":"#VALUE!"}},null,null,null,null,null,null,null,{"$error":"#VALUE!"},2017,null,{"$f":"IF(AQ115,VLOOKUP(AQ115,FEM!$AS$468:$AT$523,2))","v":4.4930000000000003}]
["F",null,null,null,null,null,null,null,null,null,null,null,null,null,"",null,null,null,"","","","","",false,{"$f":"IF(AND(H116<1936),VLOOKUP(I116,Feuil1!$F$10:$O$24,9),IF(AND(H116>=1942,H116<1947),VLOOKUP(I116,Feuil1!$F$10:$O$24,9),IF(AND(H116>=1947,H116<1952),VLOOKUP(I116,Feuil1!$F$10:$O$24,8),IF(AND(H116>=1952,H116<1957),VLOOKUP(I116,Feuil1!$F$10:$O$24,7),IF(AND(H116>=1957,H116<1962),VLOOKUP(I116,Feuil1!$F$10:$O$24,6),IF(AND(H116>=1962,H116<1967),VLOOKUP(I116,Feuil1!$F$10:$O$24,5),IF(AND(H116>=1967,H116<1972),VLOOKUP(I116,Feuil1!$F$10:$O$24,4),IF(AND(H116>=1972,H116<1977),VLOOKUP(I116,Feuil1!$F$10:$O$24,3),IF(AND(H116>=1977,H116<1982),VLOOKUP(I116,Feuil1!$F$10:$O$24,2),VLOOKUP(I116,Feuil1!$F$10:$O$24,2))))))))))","v":{"$error":"#N/A"}},null,{"$f":"T116-HLOOKUP(Y116,Feuil1!$C$1:$BF$9,2,FALSE)","v":{"$error":"#VALUE!"}},{"$f":"T116-HLOOKUP(Y116,Feuil1!$C$1:$BF$9,3,FALSE)","v":{"$error":"#VALUE!"}},{"$f":"T116-HLOOKUP(Y116,Feuil1!$C$1:$BF$9,4,FALSE)","v":{"$error":"#VALUE!"}},{"$f":"T116-HLOOKUP(Y116,Feuil1!$C$1:$BF$9,5,FALSE)","v":{"$error":"#VALUE!"}},{"$f":"T116-HLOOKUP(Y116,Feuil1!$C$1:$BF$9,6,FALSE)","v":{"$error":"#VALUE!"}},{"$f":"T116-HLOOKUP(Y116,Feuil1!$C$1:$BF$9,7,FALSE)","v":{"$error":"#VALUE!"}},{"$f":"T116-HLOOKUP(Y116,Feuil1!$C$1:$BF$9,8,FALSE)","v":{"$error":"#VALUE!"}},{"$f":"T116-HLOOKUP(Y116,Feuil1!$C$1:$BF$9,9,FALSE)","v":{"$error":"#VALUE!"}},null,null,null,null,null,null,null,{"$error":"#VALUE!"},2017,null,{"$f":"IF(AQ116,VLOOKUP(AQ116,FEM!$AS$468:$AT$523,2))","v":4.4930000000000003}]
["F",null,null,null,null,null,null,null,null,null,null,null,null,null,"",null,null,null,"","","","","",false,{"$f":"IF(AND(H117<1936),VLOOKUP(I117,Feuil1!$F$10:$O$24,9),IF(AND(H117>=1942,H117<1947),VLOOKUP(I117,Feuil1!$F$10:$O$24,9),IF(AND(H117>=1947,H117<1952),VLOOKUP(I117,Feuil1!$F$10:$O$24,8),IF(AND(H117>=1952,H117<1957),VLOOKUP(I117,Feuil1!$F$10:$O$24,7),IF(AND(H117>=1957,H117<1962),VLOOKUP(I117,Feuil1!$F$10:$O$24,6),IF(AND(H117>=1962,H117<1967),VLOOKUP(I117,Feuil1!$F$10:$O$24,5),IF(AND(H117>=1967,H117<1972),VLOOKUP(I117,Feuil1!$F$10:$O$24,4),IF(AND(H117>=1972,H117<1977),VLOOKUP(I117,Feuil1!$F$10:$O$24,3),IF(AND(H117>=1977,H117<1982),VLOOKUP(I117,Feuil1!$F$10:$O$24,2),VLOOKUP(I117,Feuil1!$F$10:$O$24,2))))))))))","v":{"$error":"#N/A"}},null,{"$f":"T117-HLOOKUP(Y117,Feuil1!$C$1:$BF$9,2,FALSE)","v":{"$error":"#VALUE!"}},{"$f":"T117-HLOOKUP(Y117,Feuil1!$C$1:$BF$9,3,FALSE)","v":{"$error":"#VALUE!"}},{"$f":"T117-HLOOKUP(Y117,Feuil1!$C$1:$BF$9,4,FALSE)","v":{"$error":"#VALUE!"}},{"$f":"T117-HLOOKUP(Y117,Feuil1!$C$1:$BF$9,5,FALSE)","v":{"$error":"#VALUE!"}},{"$f":"T117-HLOOKUP(Y117,Feuil1!$C$1:$BF$9,6,FALSE)","v":{"$error":"#VALUE!"}},{"$f":"T117-HLOOKUP(Y117,Feuil1!$C$1:$BF$9,7,FALSE)","v":{"$error":"#VALUE!"}},{"$f":"T117-HLOOKUP(Y117,Feuil1!$C$1:$BF$9,8,FALSE)","v":{"$error":"#VALUE!"}},{"$f":"T117-HLOOKUP(Y117,Feuil1!$C$1:$BF$9,9,FALSE)","v":{"$error":"#VALUE!"}},null,null,null,null,null,null,null,{"$error":"#VALUE!"},2017,null,{"$f":"IF(AQ117,VLOOKUP(AQ117,FEM!$AS$468:$AT$523,2))","v":4.4930000000000003}]
["F",null,null,null,null,null,null,null,null,null,null,null,null,null,"",null,null,null,"","","","","",false,{"$f":"IF(AND(H118<1936),VLOOKUP(I118,Feuil1!$F$10:$O$24,9),IF(AND(H118>=1942,H118<1947),VLOOKUP(I118,Feuil1!$F$10:$O$24,9),IF(AND(H118>=1947,H118<1952),VLOOKUP(I118,Feuil1!$F$10:$O$24,8),IF(AND(H118>=1952,H118<1957),VLOOKUP(I118,Feuil1!$F$10:$O$24,7),IF(AND(H118>=1957,H118<1962),VLOOKUP(I118,Feuil1!$F$10:$O$24,6),IF(AND(H118>=1962,H118<1967),VLOOKUP(I118,Feuil1!$F$10:$O$24,5),IF(AND(H118>=1967,H118<1972),VLOOKUP(I118,Feuil1!$F$10:$O$24,4),IF(AND(H118>=1972,H118<1977),VLOOKUP(I118,Feuil1!$F$10:$O$24,3),IF(AND(H118>=1977,H118<1982),VLOOKUP(I118,Feuil1!$F$10:$O$24,2),VLOOKUP(I118,Feuil1!$F$10:$O$24,2))))))))))","v":{"$error":"#N/A"}},null,{"$f":"T118-HLOOKUP(Y118,Feuil1!$C$1:$BF$9,2,FALSE)","v":{"$error":"#VALUE!"}},{"$f":"T118-HLOOKUP(Y118,Feuil1!$C$1:$BF$9,3,FALSE)","v":{"$error":"#VALUE!"}},{"$f":"T118-HLOOKUP(Y118,Feuil1!$C$1:$BF$9,4,FALSE)","v":{"$error":"#VALUE!"}},{"$f":"T118-HLOOKUP(Y118,Feuil1!$C$1:$BF$9,5,FALSE)","v":{"$error":"#VALUE!"}},{"$f":"T118-HLOOKUP(Y118,Feuil1!$C$1:$BF$9,6,FALSE)","v":{"$error":"#VALUE!"}},{"$f":"T118-HLOOKUP(Y118,Feuil1!$C$1:$BF$9,7,FALSE)","v":{"$error":"#VALUE!"}},{"$f":"T118-HLOOKUP(Y118,Feuil1!$C$1:$BF$9,8,FALSE)","v":{"$error":"#VALUE!"}},{"$f":"T118-HLOOKUP(Y118,Feuil1!$C$1:$BF$9,9,FALSE)","v":{"$error":"#VALUE!"}},null,null,null,null,null,null,null,{"$error":"#VALUE!"},2017,null,{"$f":"IF(AQ118,VLOOKUP(AQ118,FEM!$AS$468:$AT$523,2))","v":4.4930000000000003}]
["F",null,null,null,null,null,null,null,null,null,null,null,null,null,"",null,null,null,"","","","","",false,{"$f":"IF(AND(H119<1936),VLOOKUP(I119,Feuil1!$F$10:$O$24,9),IF(AND(H119>=1942,H119<1947),VLOOKUP(I119,Feuil1!$F$10:$O$24,9),IF(AND(H119>=1947,H119<1952),VLOOKUP(I119,Feuil1!$F$10:$O$24,8),IF(AND(H119>=1952,H119<1957),VLOOKUP(I119,Feuil1!$F$10:$O$24,7),IF(AND(H119>=1957,H119<1962),VLOOKUP(I119,Feuil1!$F$10:$O$24,6),IF(AND(H119>=1962,H119<1967),VLOOKUP(I119,Feuil1!$F$10:$O$24,5),IF(AND(H119>=1967,H119<1972),VLOOKUP(I119,Feuil1!$F$10:$O$24,4),IF(AND(H119>=1972,H119<1977),VLOOKUP(I119,Feuil1!$F$10:$O$24,3),IF(AND(H119>=1977,H119<1982),VLOOKUP(I119,Feuil1!$F$10:$O$24,2),VLOOKUP(I119,Feuil1!$F$10:$O$24,2))))))))))","v":{"$error":"#N/A"}},null,{"$f":"T119-HLOOKUP(Y119,Feuil1!$C$1:$BF$9,2,FALSE)","v":{"$error":"#VALUE!"}},{"$f":"T119-HLOOKUP(Y119,Feuil1!$C$1:$BF$9,3,FALSE)","v":{"$error":"#VALUE!"}},{"$f":"T119-HLOOKUP(Y119,Feuil1!$C$1:$BF$9,4,FALSE)","v":{"$error":"#VALUE!"}},{"$f":"T119-HLOOKUP(Y119,Feuil1!$C$1:$BF$9,5,FALSE)","v":{"$error":"#VALUE!"}},{"$f":"T119-HLOOKUP(Y119,Feuil1!$C$1:$BF$9,6,FALSE)","v":{"$error":"#VALUE!"}},{"$f":"T119-HLOOKUP(Y119,Feuil1!$C$1:$BF$9,7,FALSE)","v":{"$error":"#VALUE!"}},{"$f":"T119-HLOOKUP(Y119,Feuil1!$C$1:$BF$9,8,FALSE)","v":{"$error":"#VALUE!"}},{"$f":"T119-HLOOKUP(Y119,Feuil1!$C$1:$BF$9,9,FALSE)","v":{"$error":"#VALUE!"}},null,null,null,null,null,null,null,{"$error":"#VALUE!"},2017,null,{"$f":"IF(AQ119,VLOOKUP(AQ119,FEM!$AS$468:$AT$523,2))","v":4.4930000000000003}]
["F",null,null,null,null,null,null,null,null,null,null,null,null,null,"",null,null,null,"","","","","",false,{"$f":"IF(AND(H120<1936),VLOOKUP(I120,Feuil1!$F$10:$O$24,9),IF(AND(H120>=1942,H120<1947),VLOOKUP(I120,Feuil1!$F$10:$O$24,9),IF(AND(H120>=1947,H120<1952),VLOOKUP(I120,Feuil1!$F$10:$O$24,8),IF(AND(H120>=1952,H120<1957),VLOOKUP(I120,Feuil1!$F$10:$O$24,7),IF(AND(H120>=1957,H120<1962),VLOOKUP(I120,Feuil1!$F$10:$O$24,6),IF(AND(H120>=1962,H120<1967),VLOOKUP(I120,Feuil1!$F$10:$O$24,5),IF(AND(H120>=1967,H120<1972),VLOOKUP(I120,Feuil1!$F$10:$O$24,4),IF(AND(H120>=1972,H120<1977),VLOOKUP(I120,Feuil1!$F$10:$O$24,3),IF(AND(H120>=1977,H120<1982),VLOOKUP(I120,Feuil1!$F$10:$O$24,2),VLOOKUP(I120,Feuil1!$F$10:$O$24,2))))))))))","v":{"$error":"#N/A"}},null,{"$f":"T120-HLOOKUP(Y120,Feuil1!$C$1:$BF$9,2,FALSE)","v":{"$error":"#VALUE!"}},{"$f":"T120-HLOOKUP(Y120,Feuil1!$C$1:$BF$9,3,FALSE)","v":{"$error":"#VALUE!"}},{"$f":"T120-HLOOKUP(Y120,Feuil1!$C$1:$BF$9,4,FALSE)","v":{"$error":"#VALUE!"}},{"$f":"T120-HLOOKUP(Y120,Feuil1!$C$1:$BF$9,5,FALSE)","v":{"$error":"#VALUE!"}},{"$f":"T120-HLOOKUP(Y120,Feuil1!$C$1:$BF$9,6,FALSE)","v":{"$error":"#VALUE!"}},{"$f":"T120-HLOOKUP(Y120,Feuil1!$C$1:$BF$9,7,FALSE)","v":{"$error":"#VALUE!"}},{"$f":"T120-HLOOKUP(Y120,Feuil1!$C$1:$BF$9,8,FALSE)","v":{"$error":"#VALUE!"}},{"$f":"T120-HLOOKUP(Y120,Feuil1!$C$1:$BF$9,9,FALSE)","v":{"$error":"#VALUE!"}},null,null,null,null,null,null,null,{"$error":"#VALUE!"},2017,null,{"$f":"IF(AQ120,VLOOKUP(AQ120,FEM!$AS$468:$AT$523,2))","v":4.4930000000000003}]
["F",null,null,null,null,null,null,null,null,null,null,null,null,null,"",null,null,null,"","","","","",false,{"$f":"IF(AND(H121<1936),VLOOKUP(I121,Feuil1!$F$10:$O$24,9),IF(AND(H121>=1942,H121<1947),VLOOKUP(I121,Feuil1!$F$10:$O$24,9),IF(AND(H121>=1947,H121<1952),VLOOKUP(I121,Feuil1!$F$10:$O$24,8),IF(AND(H121>=1952,H121<1957),VLOOKUP(I121,Feuil1!$F$10:$O$24,7),IF(AND(H121>=1957,H121<1962),VLOOKUP(I121,Feuil1!$F$10:$O$24,6),IF(AND(H121>=1962,H121<1967),VLOOKUP(I121,Feuil1!$F$10:$O$24,5),IF(AND(H121>=1967,H121<1972),VLOOKUP(I121,Feuil1!$F$10:$O$24,4),IF(AND(H121>=1972,H121<1977),VLOOKUP(I121,Feuil1!$F$10:$O$24,3),IF(AND(H121>=1977,H121<1982),VLOOKUP(I121,Feuil1!$F$10:$O$24,2),VLOOKUP(I121,Feuil1!$F$10:$O$24,2))))))))))","v":{"$error":"#N/A"}},null,{"$f":"T121-HLOOKUP(Y121,Feuil1!$C$1:$BF$9,2,FALSE)","v":{"$error":"#VALUE!"}},{"$f":"T121-HLOOKUP(Y121,Feuil1!$C$1:$BF$9,3,FALSE)","v":{"$error":"#VALUE!"}},{"$f":"T121-HLOOKUP(Y121,Feuil1!$C$1:$BF$9,4,FALSE)","v":{"$error":"#VALUE!"}},{"$f":"T121-HLOOKUP(Y121,Feuil1!$C$1:$BF$9,5,FALSE)","v":{"$error":"#VALUE!"}},{"$f":"T121-HLOOKUP(Y121,Feuil1!$C$1:$BF$9,6,FALSE)","v":{"$error":"#VALUE!"}},{"$f":"T121-HLOOKUP(Y121,Feuil1!$C$1:$BF$9,7,FALSE)","v":{"$error":"#VALUE!"}},{"$f":"T121-HLOOKUP(Y121,Feuil1!$C$1:$BF$9,8,FALSE)","v":{"$error":"#VALUE!"}},{"$f":"T121-HLOOKUP(Y121,Feuil1!$C$1:$BF$9,9,FALSE)","v":{"$error":"#VALUE!"}},null,null,null,null,null,null,null,{"$error":"#VALUE!"},2017,null,{"$f":"IF(AQ121,VLOOKUP(AQ121,FEM!$AS$468:$AT$523,2))","v":4.4930000000000003}]
["F",null,null,null,null,null,null,null,null,null,null,null,null,null,"",null,null,null,"","","","","",false,{"$f":"IF(AND(H122<1936),VLOOKUP(I122,Feuil1!$F$10:$O$24,9),IF(AND(H122>=1942,H122<1947),VLOOKUP(I122,Feuil1!$F$10:$O$24,9),IF(AND(H122>=1947,H122<1952),VLOOKUP(I122,Feuil1!$F$10:$O$24,8),IF(AND(H122>=1952,H122<1957),VLOOKUP(I122,Feuil1!$F$10:$O$24,7),IF(AND(H122>=1957,H122<1962),VLOOKUP(I122,Feuil1!$F$10:$O$24,6),IF(AND(H122>=1962,H122<1967),VLOOKUP(I122,Feuil1!$F$10:$O$24,5),IF(AND(H122>=1967,H122<1972),VLOOKUP(I122,Feuil1!$F$10:$O$24,4),IF(AND(H122>=1972,H122<1977),VLOOKUP(I122,Feuil1!$F$10:$O$24,3),IF(AND(H122>=1977,H122<1982),VLOOKUP(I122,Feuil1!$F$10:$O$24,2),VLOOKUP(I122,Feuil1!$F$10:$O$24,2))))))))))","v":{"$error":"#N/A"}},null,{"$f":"T122-HLOOKUP(Y122,Feuil1!$C$1:$BF$9,2,FALSE)","v":{"$error":"#VALUE!"}},{"$f":"T122-HLOOKUP(Y122,Feuil1!$C$1:$BF$9,3,FALSE)","v":{"$error":"#VALUE!"}},{"$f":"T122-HLOOKUP(Y122,Feuil1!$C$1:$BF$9,4,FALSE)","v":{"$error":"#VALUE!"}},{"$f":"T122-HLOOKUP(Y122,Feuil1!$C$1:$BF$9,5,FALSE)","v":{"$error":"#VALUE!"}},{"$f":"T122-HLOOKUP(Y122,Feuil1!$C$1:$BF$9,6,FALSE)","v":{"$error":"#VALUE!"}},{"$f":"T122-HLOOKUP(Y122,Feuil1!$C$1:$BF$9,7,FALSE)","v":{"$error":"#VALUE!"}},{"$f":"T122-HLOOKUP(Y122,Feuil1!$C$1:$BF$9,8,FALSE)","v":{"$error":"#VALUE!"}},{"$f":"T122-HLOOKUP(Y122,Feuil1!$C$1:$BF$9,9,FALSE)","v":{"$error":"#VALUE!"}},null,null,null,null,null,null,null,{"$error":"#VALUE!"},2017,null,{"$f":"IF(AQ122,VLOOKUP(AQ122,FEM!$AS$468:$AT$523,2))","v":4.4930000000000003}]
["F",null,null,null,null,null,null,null,null,null,null,null,null,null,"",null,null,null,"","","","","",false,{"$f":"IF(AND(H123<1936),VLOOKUP(I123,Feuil1!$F$10:$O$24,9),IF(AND(H123>=1942,H123<1947),VLOOKUP(I123,Feuil1!$F$10:$O$24,9),IF(AND(H123>=1947,H123<1952),VLOOKUP(I123,Feuil1!$F$10:$O$24,8),IF(AND(H123>=1952,H123<1957),VLOOKUP(I123,Feuil1!$F$10:$O$24,7),IF(AND(H123>=1957,H123<1962),VLOOKUP(I123,Feuil1!$F$10:$O$24,6),IF(AND(H123>=1962,H123<1967),VLOOKUP(I123,Feuil1!$F$10:$O$24,5),IF(AND(H123>=1967,H123<1972),VLOOKUP(I123,Feuil1!$F$10:$O$24,4),IF(AND(H123>=1972,H123<1977),VLOOKUP(I123,Feuil1!$F$10:$O$24,3),IF(AND(H123>=1977,H123<1982),VLOOKUP(I123,Feuil1!$F$10:$O$24,2),VLOOKUP(I123,Feuil1!$F$10:$O$24,2))))))))))","v":{"$error":"#N/A"}},null,{"$f":"T123-HLOOKUP(Y123,Feuil1!$C$1:$BF$9,2,FALSE)","v":{"$error":"#VALUE!"}},{"$f":"T123-HLOOKUP(Y123,Feuil1!$C$1:$BF$9,3,FALSE)","v":{"$error":"#VALUE!"}},{"$f":"T123-HLOOKUP(Y123,Feuil1!$C$1:$BF$9,4,FALSE)","v":{"$error":"#VALUE!"}},{"$f":"T123-HLOOKUP(Y123,Feuil1!$C$1:$BF$9,5,FALSE)","v":{"$error":"#VALUE!"}},{"$f":"T123-HLOOKUP(Y123,Feuil1!$C$1:$BF$9,6,FALSE)","v":{"$error":"#VALUE!"}},{"$f":"T123-HLOOKUP(Y123,Feuil1!$C$1:$BF$9,7,FALSE)","v":{"$error":"#VALUE!"}},{"$f":"T123-HLOOKUP(Y123,Feuil1!$C$1:$BF$9,8,FALSE)","v":{"$error":"#VALUE!"}},{"$f":"T123-HLOOKUP(Y123,Feuil1!$C$1:$BF$9,9,FALSE)","v":{"$error":"#VALUE!"}},null,null,null,null,null,null,null,{"$error":"#VALUE!"},2017,null,{"$f":"IF(AQ123,VLOOKUP(AQ123,FEM!$AS$468:$AT$523,2))","v":4.4930000000000003}]
["F",null,null,null,null,null,null,null,null,null,null,null,null,null,"",null,null,null,"","","","","",false,{"$f":"IF(AND(H124<1936),VLOOKUP(I124,Feuil1!$F$10:$O$24,9),IF(AND(H124>=1942,H124<1947),VLOOKUP(I124,Feuil1!$F$10:$O$24,9),IF(AND(H124>=1947,H124<1952),VLOOKUP(I124,Feuil1!$F$10:$O$24,8),IF(AND(H124>=1952,H124<1957),VLOOKUP(I124,Feuil1!$F$10:$O$24,7),IF(AND(H124>=1957,H124<1962),VLOOKUP(I124,Feuil1!$F$10:$O$24,6),IF(AND(H124>=1962,H124<1967),VLOOKUP(I124,Feuil1!$F$10:$O$24,5),IF(AND(H124>=1967,H124<1972),VLOOKUP(I124,Feuil1!$F$10:$O$24,4),IF(AND(H124>=1972,H124<1977),VLOOKUP(I124,Feuil1!$F$10:$O$24,3),IF(AND(H124>=1977,H124<1982),VLOOKUP(I124,Feuil1!$F$10:$O$24,2),VLOOKUP(I124,Feuil1!$F$10:$O$24,2))))))))))","v":{"$error":"#N/A"}},null,{"$f":"T124-HLOOKUP(Y124,Feuil1!$C$1:$BF$9,2,FALSE)","v":{"$error":"#VALUE!"}},{"$f":"T124-HLOOKUP(Y124,Feuil1!$C$1:$BF$9,3,FALSE)","v":{"$error":"#VALUE!"}},{"$f":"T124-HLOOKUP(Y124,Feuil1!$C$1:$BF$9,4,FALSE)","v":{"$error":"#VALUE!"}},{"$f":"T124-HLOOKUP(Y124,Feuil1!$C$1:$BF$9,5,FALSE)","v":{"$error":"#VALUE!"}},{"$f":"T124-HLOOKUP(Y124,Feuil1!$C$1:$BF$9,6,FALSE)","v":{"$error":"#VALUE!"}},{"$f":"T124-HLOOKUP(Y124,Feuil1!$C$1:$BF$9,7,FALSE)","v":{"$error":"#VALUE!"}},{"$f":"T124-HLOOKUP(Y124,Feuil1!$C$1:$BF$9,8,FALSE)","v":{"$error":"#VALUE!"}},{"$f":"T124-HLOOKUP(Y124,Feuil1!$C$1:$BF$9,9,FALSE)","v":{"$error":"#VALUE!"}},null,null,null,null,null,null,null,{"$error":"#VALUE!"},2017,null,{"$f":"IF(AQ124,VLOOKUP(AQ124,FEM!$AS$468:$AT$523,2))","v":4.4930000000000003}]
["F",null,null,null,null,null,null,null,null,null,null,null,null,null,"",null,null,null,"","","","","",false,{"$f":"IF(AND(H125<1936),VLOOKUP(I125,Feuil1!$F$10:$O$24,9),IF(AND(H125>=1942,H125<1947),VLOOKUP(I125,Feuil1!$F$10:$O$24,9),IF(AND(H125>=1947,H125<1952),VLOOKUP(I125,Feuil1!$F$10:$O$24,8),IF(AND(H125>=1952,H125<1957),VLOOKUP(I125,Feuil1!$F$10:$O$24,7),IF(AND(H125>=1957,H125<1962),VLOOKUP(I125,Feuil1!$F$10:$O$24,6),IF(AND(H125>=1962,H125<1967),VLOOKUP(I125,Feuil1!$F$10:$O$24,5),IF(AND(H125>=1967,H125<1972),VLOOKUP(I125,Feuil1!$F$10:$O$24,4),IF(AND(H125>=1972,H125<1977),VLOOKUP(I125,Feuil1!$F$10:$O$24,3),IF(AND(H125>=1977,H125<1982),VLOOKUP(I125,Feuil1!$F$10:$O$24,2),VLOOKUP(I125,Feuil1!$F$10:$O$24,2))))))))))","v":{"$error":"#N/A"}},null,{"$f":"T125-HLOOKUP(Y125,Feuil1!$C$1:$BF$9,2,FALSE)","v":{"$error":"#VALUE!"}},{"$f":"T125-HLOOKUP(Y125,Feuil1!$C$1:$BF$9,3,FALSE)","v":{"$error":"#VALUE!"}},{"$f":"T125-HLOOKUP(Y125,Feuil1!$C$1:$BF$9,4,FALSE)","v":{"$error":"#VALUE!"}},{"$f":"T125-HLOOKUP(Y125,Feuil1!$C$1:$BF$9,5,FALSE)","v":{"$error":"#VALUE!"}},{"$f":"T125-HLOOKUP(Y125,Feuil1!$C$1:$BF$9,6,FALSE)","v":{"$error":"#VALUE!"}},{"$f":"T125-HLOOKUP(Y125,Feuil1!$C$1:$BF$9,7,FALSE)","v":{"$error":"#VALUE!"}},{"$f":"T125-HLOOKUP(Y125,Feuil1!$C$1:$BF$9,8,FALSE)","v":{"$error":"#VALUE!"}},{"$f":"T125-HLOOKUP(Y125,Feuil1!$C$1:$BF$9,9,FALSE)","v":{"$error":"#VALUE!"}},null,null,null,null,null,null,null,{"$error":"#VALUE!"},2017,null,{"$f":"IF(AQ125,VLOOKUP(AQ125,FEM!$AS$468:$AT$523,2))","v":4.4930000000000003}]
["F",null,null,null,null,null,null,null,null,null,null,null,null,null,"",null,null,null,"","","","","",false,{"$f":"IF(AND(H126<1936),VLOOKUP(I126,Feuil1!$F$10:$O$24,9),IF(AND(H126>=1942,H126<1947),VLOOKUP(I126,Feuil1!$F$10:$O$24,9),IF(AND(H126>=1947,H126<1952),VLOOKUP(I126,Feuil1!$F$10:$O$24,8),IF(AND(H126>=1952,H126<1957),VLOOKUP(I126,Feuil1!$F$10:$O$24,7),IF(AND(H126>=1957,H126<1962),VLOOKUP(I126,Feuil1!$F$10:$O$24,6),IF(AND(H126>=1962,H126<1967),VLOOKUP(I126,Feuil1!$F$10:$O$24,5),IF(AND(H126>=1967,H126<1972),VLOOKUP(I126,Feuil1!$F$10:$O$24,4),IF(AND(H126>=1972,H126<1977),VLOOKUP(I126,Feuil1!$F$10:$O$24,3),IF(AND(H126>=1977,H126<1982),VLOOKUP(I126,Feuil1!$F$10:$O$24,2),VLOOKUP(I126,Feuil1!$F$10:$O$24,2))))))))))","v":{"$error":"#N/A"}},null,{"$f":"T126-HLOOKUP(Y126,Feuil1!$C$1:$BF$9,2,FALSE)","v":{"$error":"#VALUE!"}},{"$f":"T126-HLOOKUP(Y126,Feuil1!$C$1:$BF$9,3,FALSE)","v":{"$error":"#VALUE!"}},{"$f":"T126-HLOOKUP(Y126,Feuil1!$C$1:$BF$9,4,FALSE)","v":{"$error":"#VALUE!"}},{"$f":"T126-HLOOKUP(Y126,Feuil1!$C$1:$BF$9,5,FALSE)","v":{"$error":"#VALUE!"}},{"$f":"T126-HLOOKUP(Y126,Feuil1!$C$1:$BF$9,6,FALSE)","v":{"$error":"#VALUE!"}},{"$f":"T126-HLOOKUP(Y126,Feuil1!$C$1:$BF$9,7,FALSE)","v":{"$error":"#VALUE!"}},{"$f":"T126-HLOOKUP(Y126,Feuil1!$C$1:$BF$9,8,FALSE)","v":{"$error":"#VALUE!"}},{"$f":"T126-HLOOKUP(Y126,Feuil1!$C$1:$BF$9,9,FALSE)","v":{"$error":"#VALUE!"}},null,null,null,null,null,null,null,{"$error":"#VALUE!"},2017,null,{"$f":"IF(AQ126,VLOOKUP(AQ126,FEM!$AS$468:$AT$523,2))","v":4.4930000000000003}]
["F",null,null,null,null,null,null,null,null,null,null,null,null,null,"",null,null,null,"","","","","",false,{"$f":"IF(AND(H127<1936),VLOOKUP(I127,Feuil1!$F$10:$O$24,9),IF(AND(H127>=1942,H127<1947),VLOOKUP(I127,Feuil1!$F$10:$O$24,9),IF(AND(H127>=1947,H127<1952),VLOOKUP(I127,Feuil1!$F$10:$O$24,8),IF(AND(H127>=1952,H127<1957),VLOOKUP(I127,Feuil1!$F$10:$O$24,7),IF(AND(H127>=1957,H127<1962),VLOOKUP(I127,Feuil1!$F$10:$O$24,6),IF(AND(H127>=1962,H127<1967),VLOOKUP(I127,Feuil1!$F$10:$O$24,5),IF(AND(H127>=1967,H127<1972),VLOOKUP(I127,Feuil1!$F$10:$O$24,4),IF(AND(H127>=1972,H127<1977),VLOOKUP(I127,Feuil1!$F$10:$O$24,3),IF(AND(H127>=1977,H127<1982),VLOOKUP(I127,Feuil1!$F$10:$O$24,2),VLOOKUP(I127,Feuil1!$F$10:$O$24,2))))))))))","v":{"$error":"#N/A"}},null,{"$f":"T127-HLOOKUP(Y127,Feuil1!$C$1:$BF$9,2,FALSE)","v":{"$error":"#VALUE!"}},{"$f":"T127-HLOOKUP(Y127,Feuil1!$C$1:$BF$9,3,FALSE)","v":{"$error":"#VALUE!"}},{"$f":"T127-HLOOKUP(Y127,Feuil1!$C$1:$BF$9,4,FALSE)","v":{"$error":"#VALUE!"}},{"$f":"T127-HLOOKUP(Y127,Feuil1!$C$1:$BF$9,5,FALSE)","v":{"$error":"#VALUE!"}},{"$f":"T127-HLOOKUP(Y127,Feuil1!$C$1:$BF$9,6,FALSE)","v":{"$error":"#VALUE!"}},{"$f":"T127-HLOOKUP(Y127,Feuil1!$C$1:$BF$9,7,FALSE)","v":{"$error":"#VALUE!"}},{"$f":"T127-HLOOKUP(Y127,Feuil1!$C$1:$BF$9,8,FALSE)","v":{"$error":"#VALUE!"}},{"$f":"T127-HLOOKUP(Y127,Feuil1!$C$1:$BF$9,9,FALSE)","v":{"$error":"#VALUE!"}},null,null,null,null,null,null,null,{"$error":"#VALUE!"},2017,null,{"$f":"IF(AQ127,VLOOKUP(AQ127,FEM!$AS$468:$AT$523,2))","v":4.4930000000000003}]
["F",null,null,null,null,null,null,null,null,null,null,null,null,null,"",null,null,null,"","","","","",false,{"$f":"IF(AND(H128<1936),VLOOKUP(I128,Feuil1!$F$10:$O$24,9),IF(AND(H128>=1942,H128<1947),VLOOKUP(I128,Feuil1!$F$10:$O$24,9),IF(AND(H128>=1947,H128<1952),VLOOKUP(I128,Feuil1!$F$10:$O$24,8),IF(AND(H128>=1952,H128<1957),VLOOKUP(I128,Feuil1!$F$10:$O$24,7),IF(AND(H128>=1957,H128<1962),VLOOKUP(I128,Feuil1!$F$10:$O$24,6),IF(AND(H128>=1962,H128<1967),VLOOKUP(I128,Feuil1!$F$10:$O$24,5),IF(AND(H128>=1967,H128<1972),VLOOKUP(I128,Feuil1!$F$10:$O$24,4),IF(AND(H128>=1972,H128<1977),VLOOKUP(I128,Feuil1!$F$10:$O$24,3),IF(AND(H128>=1977,H128<1982),VLOOKUP(I128,Feuil1!$F$10:$O$24,2),VLOOKUP(I128,Feuil1!$F$10:$O$24,2))))))))))","v":{"$error":"#N/A"}},null,{"$f":"T128-HLOOKUP(Y128,Feuil1!$C$1:$BF$9,2,FALSE)","v":{"$error":"#VALUE!"}},{"$f":"T128-HLOOKUP(Y128,Feuil1!$C$1:$BF$9,3,FALSE)","v":{"$error":"#VALUE!"}},{"$f":"T128-HLOOKUP(Y128,Feuil1!$C$1:$BF$9,4,FALSE)","v":{"$error":"#VALUE!"}},{"$f":"T128-HLOOKUP(Y128,Feuil1!$C$1:$BF$9,5,FALSE)","v":{"$error":"#VALUE!"}},{"$f":"T128-HLOOKUP(Y128,Feuil1!$C$1:$BF$9,6,FALSE)","v":{"$error":"#VALUE!"}},{"$f":"T128-HLOOKUP(Y128,Feuil1!$C$1:$BF$9,7,FALSE)","v":{"$error":"#VALUE!"}},{"$f":"T128-HLOOKUP(Y128,Feuil1!$C$1:$BF$9,8,FALSE)","v":{"$error":"#VALUE!"}},{"$f":"T128-HLOOKUP(Y128,Feuil1!$C$1:$BF$9,9,FALSE)","v":{"$error":"#VALUE!"}},null,null,null,null,null,null,null,{"$error":"#VALUE!"},2017,null,{"$f":"IF(AQ128,VLOOKUP(AQ128,FEM!$AS$468:$AT$523,2))","v":4.4930000000000003}]
["F",null,null,null,null,null,null,null,null,null,null,null,null,null,"",null,null,null,"","","","","",false,{"$f":"IF(AND(H129<1936),VLOOKUP(I129,Feuil1!$F$10:$O$24,9),IF(AND(H129>=1942,H129<1947),VLOOKUP(I129,Feuil1!$F$10:$O$24,9),IF(AND(H129>=1947,H129<1952),VLOOKUP(I129,Feuil1!$F$10:$O$24,8),IF(AND(H129>=1952,H129<1957),VLOOKUP(I129,Feuil1!$F$10:$O$24,7),IF(AND(H129>=1957,H129<1962),VLOOKUP(I129,Feuil1!$F$10:$O$24,6),IF(AND(H129>=1962,H129<1967),VLOOKUP(I129,Feuil1!$F$10:$O$24,5),IF(AND(H129>=1967,H129<1972),VLOOKUP(I129,Feuil1!$F$10:$O$24,4),IF(AND(H129>=1972,H129<1977),VLOOKUP(I129,Feuil1!$F$10:$O$24,3),IF(AND(H129>=1977,H129<1982),VLOOKUP(I129,Feuil1!$F$10:$O$24,2),VLOOKUP(I129,Feuil1!$F$10:$O$24,2))))))))))","v":{"$error":"#N/A"}},null,{"$f":"T129-HLOOKUP(Y129,Feuil1!$C$1:$BF$9,2,FALSE)","v":{"$error":"#VALUE!"}},{"$f":"T129-HLOOKUP(Y129,Feuil1!$C$1:$BF$9,3,FALSE)","v":{"$error":"#VALUE!"}},{"$f":"T129-HLOOKUP(Y129,Feuil1!$C$1:$BF$9,4,FALSE)","v":{"$error":"#VALUE!"}},{"$f":"T129-HLOOKUP(Y129,Feuil1!$C$1:$BF$9,5,FALSE)","v":{"$error":"#VALUE!"}},{"$f":"T129-HLOOKUP(Y129,Feuil1!$C$1:$BF$9,6,FALSE)","v":{"$error":"#VALUE!"}},{"$f":"T129-HLOOKUP(Y129,Feuil1!$C$1:$BF$9,7,FALSE)","v":{"$error":"#VALUE!"}},{"$f":"T129-HLOOKUP(Y129,Feuil1!$C$1:$BF$9,8,FALSE)","v":{"$error":"#VALUE!"}},{"$f":"T129-HLOOKUP(Y129,Feuil1!$C$1:$BF$9,9,FALSE)","v":{"$error":"#VALUE!"}},null,null,null,null,null,null,null,{"$error":"#VALUE!"},2017,null,{"$f":"IF(AQ129,VLOOKUP(AQ129,FEM!$AS$468:$AT$523,2))","v":4.4930000000000003}]
["F",null,null,null,null,null,null,null,null,null,null,null,null,null,"",null,null,null,"","","","","",false,{"$f":"IF(AND(H130<1936),VLOOKUP(I130,Feuil1!$F$10:$O$24,9),IF(AND(H130>=1942,H130<1947),VLOOKUP(I130,Feuil1!$F$10:$O$24,9),IF(AND(H130>=1947,H130<1952),VLOOKUP(I130,Feuil1!$F$10:$O$24,8),IF(AND(H130>=1952,H130<1957),VLOOKUP(I130,Feuil1!$F$10:$O$24,7),IF(AND(H130>=1957,H130<1962),VLOOKUP(I130,Feuil1!$F$10:$O$24,6),IF(AND(H130>=1962,H130<1967),VLOOKUP(I130,Feuil1!$F$10:$O$24,5),IF(AND(H130>=1967,H130<1972),VLOOKUP(I130,Feuil1!$F$10:$O$24,4),IF(AND(H130>=1972,H130<1977),VLOOKUP(I130,Feuil1!$F$10:$O$24,3),IF(AND(H130>=1977,H130<1982),VLOOKUP(I130,Feuil1!$F$10:$O$24,2),VLOOKUP(I130,Feuil1!$F$10:$O$24,2))))))))))","v":{"$error":"#N/A"}},null,{"$f":"T130-HLOOKUP(Y130,Feuil1!$C$1:$BF$9,2,FALSE)","v":{"$error":"#VALUE!"}},{"$f":"T130-HLOOKUP(Y130,Feuil1!$C$1:$BF$9,3,FALSE)","v":{"$error":"#VALUE!"}},{"$f":"T130-HLOOKUP(Y130,Feuil1!$C$1:$BF$9,4,FALSE)","v":{"$error":"#VALUE!"}},{"$f":"T130-HLOOKUP(Y130,Feuil1!$C$1:$BF$9,5,FALSE)","v":{"$error":"#VALUE!"}},{"$f":"T130-HLOOKUP(Y130,Feuil1!$C$1:$BF$9,6,FALSE)","v":{"$error":"#VALUE!"}},{"$f":"T130-HLOOKUP(Y130,Feuil1!$C$1:$BF$9,7,FALSE)","v":{"$error":"#VALUE!"}},{"$f":"T130-HLOOKUP(Y130,Feuil1!$C$1:$BF$9,8,FALSE)","v":{"$error":"#VALUE!"}},{"$f":"T130-HLOOKUP(Y130,Feuil1!$C$1:$BF$9,9,FALSE)","v":{"$error":"#VALUE!"}},null,null,null,null,null,null,null,{"$error":"#VALUE!"},2017,null,{"$f":"IF(AQ130,VLOOKUP(AQ130,FEM!$AS$468:$AT$523,2))","v":4.4930000000000003}]
["F",null,null,null,null,null,null,null,null,null,null,null,null,null,"",null,null,null,"","","","","",false,{"$f":"IF(AND(H131<1936),VLOOKUP(I131,Feuil1!$F$10:$O$24,9),IF(AND(H131>=1942,H131<1947),VLOOKUP(I131,Feuil1!$F$10:$O$24,9),IF(AND(H131>=1947,H131<1952),VLOOKUP(I131,Feuil1!$F$10:$O$24,8),IF(AND(H131>=1952,H131<1957),VLOOKUP(I131,Feuil1!$F$10:$O$24,7),IF(AND(H131>=1957,H131<1962),VLOOKUP(I131,Feuil1!$F$10:$O$24,6),IF(AND(H131>=1962,H131<1967),VLOOKUP(I131,Feuil1!$F$10:$O$24,5),IF(AND(H131>=1967,H131<1972),VLOOKUP(I131,Feuil1!$F$10:$O$24,4),IF(AND(H131>=1972,H131<1977),VLOOKUP(I131,Feuil1!$F$10:$O$24,3),IF(AND(H131>=1977,H131<1982),VLOOKUP(I131,Feuil1!$F$10:$O$24,2),VLOOKUP(I131,Feuil1!$F$10:$O$24,2))))))))))","v":{"$error":"#N/A"}},null,{"$f":"T131-HLOOKUP(Y131,Feuil1!$C$1:$BF$9,2,FALSE)","v":{"$error":"#VALUE!"}},{"$f":"T131-HLOOKUP(Y131,Feuil1!$C$1:$BF$9,3,FALSE)","v":{"$error":"#VALUE!"}},{"$f":"T131-HLOOKUP(Y131,Feuil1!$C$1:$BF$9,4,FALSE)","v":{"$error":"#VALUE!"}},{"$f":"T131-HLOOKUP(Y131,Feuil1!$C$1:$BF$9,5,FALSE)","v":{"$error":"#VALUE!"}},{"$f":"T131-HLOOKUP(Y131,Feuil1!$C$1:$BF$9,6,FALSE)","v":{"$error":"#VALUE!"}},{"$f":"T131-HLOOKUP(Y131,Feuil1!$C$1:$BF$9,7,FALSE)","v":{"$error":"#VALUE!"}},{"$f":"T131-HLOOKUP(Y131,Feuil1!$C$1:$BF$9,8,FALSE)","v":{"$error":"#VALUE!"}},{"$f":"T131-HLOOKUP(Y131,Feuil1!$C$1:$BF$9,9,FALSE)","v":{"$error":"#VALUE!"}},null,null,null,null,null,null,null,{"$error":"#VALUE!"},2017,null,{"$f":"IF(AQ131,VLOOKUP(AQ131,FEM!$AS$468:$AT$523,2))","v":4.4930000000000003}]
["F",null,null,null,null,null,null,null,null,null,null,null,null,null,"",null,null,null,"","","","","",false,{"$f":"IF(AND(H132<1936),VLOOKUP(I132,Feuil1!$F$10:$O$24,9),IF(AND(H132>=1942,H132<1947),VLOOKUP(I132,Feuil1!$F$10:$O$24,9),IF(AND(H132>=1947,H132<1952),VLOOKUP(I132,Feuil1!$F$10:$O$24,8),IF(AND(H132>=1952,H132<1957),VLOOKUP(I132,Feuil1!$F$10:$O$24,7),IF(AND(H132>=1957,H132<1962),VLOOKUP(I132,Feuil1!$F$10:$O$24,6),IF(AND(H132>=1962,H132<1967),VLOOKUP(I132,Feuil1!$F$10:$O$24,5),IF(AND(H132>=1967,H132<1972),VLOOKUP(I132,Feuil1!$F$10:$O$24,4),IF(AND(H132>=1972,H132<1977),VLOOKUP(I132,Feuil1!$F$10:$O$24,3),IF(AND(H132>=1977,H132<1982),VLOOKUP(I132,Feuil1!$F$10:$O$24,2),VLOOKUP(I132,Feuil1!$F$10:$O$24,2))))))))))","v":{"$error":"#N/A"}},null,{"$f":"T132-HLOOKUP(Y132,Feuil1!$C$1:$BF$9,2,FALSE)","v":{"$error":"#VALUE!"}},{"$f":"T132-HLOOKUP(Y132,Feuil1!$C$1:$BF$9,3,FALSE)","v":{"$error":"#VALUE!"}},{"$f":"T132-HLOOKUP(Y132,Feuil1!$C$1:$BF$9,4,FALSE)","v":{"$error":"#VALUE!"}},{"$f":"T132-HLOOKUP(Y132,Feuil1!$C$1:$BF$9,5,FALSE)","v":{"$error":"#VALUE!"}},{"$f":"T132-HLOOKUP(Y132,Feuil1!$C$1:$BF$9,6,FALSE)","v":{"$error":"#VALUE!"}},{"$f":"T132-HLOOKUP(Y132,Feuil1!$C$1:$BF$9,7,FALSE)","v":{"$error":"#VALUE!"}},{"$f":"T132-HLOOKUP(Y132,Feuil1!$C$1:$BF$9,8,FALSE)","v":{"$error":"#VALUE!"}},{"$f":"T132-HLOOKUP(Y132,Feuil1!$C$1:$BF$9,9,FALSE)","v":{"$error":"#VALUE!"}},null,null,null,null,null,null,null,{"$error":"#VALUE!"},2017,null,{"$f":"IF(AQ132,VLOOKUP(AQ132,FEM!$AS$468:$AT$523,2))","v":4.4930000000000003}]
["F",null,null,null,null,null,null,null,null,null,null,null,null,null,"",null,null,null,"","","","","",false,{"$f":"IF(AND(H133<1936),VLOOKUP(I133,Feuil1!$F$10:$O$24,9),IF(AND(H133>=1942,H133<1947),VLOOKUP(I133,Feuil1!$F$10:$O$24,9),IF(AND(H133>=1947,H133<1952),VLOOKUP(I133,Feuil1!$F$10:$O$24,8),IF(AND(H133>=1952,H133<1957),VLOOKUP(I133,Feuil1!$F$10:$O$24,7),IF(AND(H133>=1957,H133<1962),VLOOKUP(I133,Feuil1!$F$10:$O$24,6),IF(AND(H133>=1962,H133<1967),VLOOKUP(I133,Feuil1!$F$10:$O$24,5),IF(AND(H133>=1967,H133<1972),VLOOKUP(I133,Feuil1!$F$10:$O$24,4),IF(AND(H133>=1972,H133<1977),VLOOKUP(I133,Feuil1!$F$10:$O$24,3),IF(AND(H133>=1977,H133<1982),VLOOKUP(I133,Feuil1!$F$10:$O$24,2),VLOOKUP(I133,Feuil1!$F$10:$O$24,2))))))))))","v":{"$error":"#N/A"}},null,{"$f":"T133-HLOOKUP(Y133,Feuil1!$C$1:$BF$9,2,FALSE)","v":{"$error":"#VALUE!"}},{"$f":"T133-HLOOKUP(Y133,Feuil1!$C$1:$BF$9,3,FALSE)","v":{"$error":"#VALUE!"}},{"$f":"T133-HLOOKUP(Y133,Feuil1!$C$1:$BF$9,4,FALSE)","v":{"$error":"#VALUE!"}},{"$f":"T133-HLOOKUP(Y133,Feuil1!$C$1:$BF$9,5,FALSE)","v":{"$error":"#VALUE!"}},{"$f":"T133-HLOOKUP(Y133,Feuil1!$C$1:$BF$9,6,FALSE)","v":{"$error":"#VALUE!"}},{"$f":"T133-HLOOKUP(Y133,Feuil1!$C$1:$BF$9,7,FALSE)","v":{"$error":"#VALUE!"}},{"$f":"T133-HLOOKUP(Y133,Feuil1!$C$1:$BF$9,8,FALSE)","v":{"$error":"#VALUE!"}},{"$f":"T133-HLOOKUP(Y133,Feuil1!$C$1:$BF$9,9,FALSE)","v":{"$error":"#VALUE!"}},null,null,null,null,null,null,null,{"$error":"#VALUE!"},2017,null,{"$f":"IF(AQ133,VLOOKUP(AQ133,FEM!$AS$468:$AT$523,2))","v":4.4930000000000003}]
["F",null,null,null,null,null,null,null,null,null,null,null,null,null,"",null,null,null,"","","","","",false,{"$f":"IF(AND(H134<1936),VLOOKUP(I134,Feuil1!$F$10:$O$24,9),IF(AND(H134>=1942,H134<1947),VLOOKUP(I134,Feuil1!$F$10:$O$24,9),IF(AND(H134>=1947,H134<1952),VLOOKUP(I134,Feuil1!$F$10:$O$24,8),IF(AND(H134>=1952,H134<1957),VLOOKUP(I134,Feuil1!$F$10:$O$24,7),IF(AND(H134>=1957,H134<1962),VLOOKUP(I134,Feuil1!$F$10:$O$24,6),IF(AND(H134>=1962,H134<1967),VLOOKUP(I134,Feuil1!$F$10:$O$24,5),IF(AND(H134>=1967,H134<1972),VLOOKUP(I134,Feuil1!$F$10:$O$24,4),IF(AND(H134>=1972,H134<1977),VLOOKUP(I134,Feuil1!$F$10:$O$24,3),IF(AND(H134>=1977,H134<1982),VLOOKUP(I134,Feuil1!$F$10:$O$24,2),VLOOKUP(I134,Feuil1!$F$10:$O$24,2))))))))))","v":{"$error":"#N/A"}},null,{"$f":"T134-HLOOKUP(Y134,Feuil1!$C$1:$BF$9,2,FALSE)","v":{"$error":"#VALUE!"}},{"$f":"T134-HLOOKUP(Y134,Feuil1!$C$1:$BF$9,3,FALSE)","v":{"$error":"#VALUE!"}},{"$f":"T134-HLOOKUP(Y134,Feuil1!$C$1:$BF$9,4,FALSE)","v":{"$error":"#VALUE!"}},{"$f":"T134-HLOOKUP(Y134,Feuil1!$C$1:$BF$9,5,FALSE)","v":{"$error":"#VALUE!"}},{"$f":"T134-HLOOKUP(Y134,Feuil1!$C$1:$BF$9,6,FALSE)","v":{"$error":"#VALUE!"}},{"$f":"T134-HLOOKUP(Y134,Feuil1!$C$1:$BF$9,7,FALSE)","v":{"$error":"#VALUE!"}},{"$f":"T134-HLOOKUP(Y134,Feuil1!$C$1:$BF$9,8,FALSE)","v":{"$error":"#VALUE!"}},{"$f":"T134-HLOOKUP(Y134,Feuil1!$C$1:$BF$9,9,FALSE)","v":{"$error":"#VALUE!"}},null,null,null,null,null,null,null,{"$error":"#VALUE!"},2017,null,{"$f":"IF(AQ134,VLOOKUP(AQ134,FEM!$AS$468:$AT$523,2))","v":4.4930000000000003}]
["F",null,null,null,null,null,null,null,null,null,null,null,null,null,"",null,null,null,"","","","","",false,{"$f":"IF(AND(H135<1936),VLOOKUP(I135,Feuil1!$F$10:$O$24,9),IF(AND(H135>=1942,H135<1947),VLOOKUP(I135,Feuil1!$F$10:$O$24,9),IF(AND(H135>=1947,H135<1952),VLOOKUP(I135,Feuil1!$F$10:$O$24,8),IF(AND(H135>=1952,H135<1957),VLOOKUP(I135,Feuil1!$F$10:$O$24,7),IF(AND(H135>=1957,H135<1962),VLOOKUP(I135,Feuil1!$F$10:$O$24,6),IF(AND(H135>=1962,H135<1967),VLOOKUP(I135,Feuil1!$F$10:$O$24,5),IF(AND(H135>=1967,H135<1972),VLOOKUP(I135,Feuil1!$F$10:$O$24,4),IF(AND(H135>=1972,H135<1977),VLOOKUP(I135,Feuil1!$F$10:$O$24,3),IF(AND(H135>=1977,H135<1982),VLOOKUP(I135,Feuil1!$F$10:$O$24,2),VLOOKUP(I135,Feuil1!$F$10:$O$24,2))))))))))","v":{"$error":"#N/A"}},null,{"$f":"T135-HLOOKUP(Y135,Feuil1!$C$1:$BF$9,2,FALSE)","v":{"$error":"#VALUE!"}},{"$f":"T135-HLOOKUP(Y135,Feuil1!$C$1:$BF$9,3,FALSE)","v":{"$error":"#VALUE!"}},{"$f":"T135-HLOOKUP(Y135,Feuil1!$C$1:$BF$9,4,FALSE)","v":{"$error":"#VALUE!"}},{"$f":"T135-HLOOKUP(Y135,Feuil1!$C$1:$BF$9,5,FALSE)","v":{"$error":"#VALUE!"}},{"$f":"T135-HLOOKUP(Y135,Feuil1!$C$1:$BF$9,6,FALSE)","v":{"$error":"#VALUE!"}},{"$f":"T135-HLOOKUP(Y135,Feuil1!$C$1:$BF$9,7,FALSE)","v":{"$error":"#VALUE!"}},{"$f":"T135-HLOOKUP(Y135,Feuil1!$C$1:$BF$9,8,FALSE)","v":{"$error":"#VALUE!"}},{"$f":"T135-HLOOKUP(Y135,Feuil1!$C$1:$BF$9,9,FALSE)","v":{"$error":"#VALUE!"}},null,null,null,null,null,null,null,{"$error":"#VALUE!"},2017,null,{"$f":"IF(AQ135,VLOOKUP(AQ135,FEM!$AS$468:$AT$523,2))","v":4.4930000000000003}]
["F",null,null,null,null,null,null,null,null,null,null,null,null,null,"",null,null,null,"","","","","",false,{"$f":"IF(AND(H136<1936),VLOOKUP(I136,Feuil1!$F$10:$O$24,9),IF(AND(H136>=1942,H136<1947),VLOOKUP(I136,Feuil1!$F$10:$O$24,9),IF(AND(H136>=1947,H136<1952),VLOOKUP(I136,Feuil1!$F$10:$O$24,8),IF(AND(H136>=1952,H136<1957),VLOOKUP(I136,Feuil1!$F$10:$O$24,7),IF(AND(H136>=1957,H136<1962),VLOOKUP(I136,Feuil1!$F$10:$O$24,6),IF(AND(H136>=1962,H136<1967),VLOOKUP(I136,Feuil1!$F$10:$O$24,5),IF(AND(H136>=1967,H136<1972),VLOOKUP(I136,Feuil1!$F$10:$O$24,4),IF(AND(H136>=1972,H136<1977),VLOOKUP(I136,Feuil1!$F$10:$O$24,3),IF(AND(H136>=1977,H136<1982),VLOOKUP(I136,Feuil1!$F$10:$O$24,2),VLOOKUP(I136,Feuil1!$F$10:$O$24,2))))))))))","v":{"$error":"#N/A"}},null,{"$f":"T136-HLOOKUP(Y136,Feuil1!$C$1:$BF$9,2,FALSE)","v":{"$error":"#VALUE!"}},{"$f":"T136-HLOOKUP(Y136,Feuil1!$C$1:$BF$9,3,FALSE)","v":{"$error":"#VALUE!"}},{"$f":"T136-HLOOKUP(Y136,Feuil1!$C$1:$BF$9,4,FALSE)","v":{"$error":"#VALUE!"}},{"$f":"T136-HLOOKUP(Y136,Feuil1!$C$1:$BF$9,5,FALSE)","v":{"$error":"#VALUE!"}},{"$f":"T136-HLOOKUP(Y136,Feuil1!$C$1:$BF$9,6,FALSE)","v":{"$error":"#VALUE!"}},{"$f":"T136-HLOOKUP(Y136,Feuil1!$C$1:$BF$9,7,FALSE)","v":{"$error":"#VALUE!"}},{"$f":"T136-HLOOKUP(Y136,Feuil1!$C$1:$BF$9,8,FALSE)","v":{"$error":"#VALUE!"}},{"$f":"T136-HLOOKUP(Y136,Feuil1!$C$1:$BF$9,9,FALSE)","v":{"$error":"#VALUE!"}},null,null,null,null,null,null,null,{"$error":"#VALUE!"},{"$f":"2017-H136","v":2017},null,{"$f":"IF(AQ136,VLOOKUP(AQ136,FEM!$AS$468:$AT$523,2))","v":4.4930000000000003}]
["F",null,null,null,null,null,null,null,null,null,null,null,null,null,"",null,null,null,"","","","","",false,{"$f":"IF(AND(H137<1936),VLOOKUP(I137,Feuil1!$F$10:$O$24,9),IF(AND(H137>=1942,H137<1947),VLOOKUP(I137,Feuil1!$F$10:$O$24,9),IF(AND(H137>=1947,H137<1952),VLOOKUP(I137,Feuil1!$F$10:$O$24,8),IF(AND(H137>=1952,H137<1957),VLOOKUP(I137,Feuil1!$F$10:$O$24,7),IF(AND(H137>=1957,H137<1962),VLOOKUP(I137,Feuil1!$F$10:$O$24,6),IF(AND(H137>=1962,H137<1967),VLOOKUP(I137,Feuil1!$F$10:$O$24,5),IF(AND(H137>=1967,H137<1972),VLOOKUP(I137,Feuil1!$F$10:$O$24,4),IF(AND(H137>=1972,H137<1977),VLOOKUP(I137,Feuil1!$F$10:$O$24,3),IF(AND(H137>=1977,H137<1982),VLOOKUP(I137,Feuil1!$F$10:$O$24,2),VLOOKUP(I137,Feuil1!$F$10:$O$24,2))))))))))","v":{"$error":"#N/A"}},null,{"$f":"T137-HLOOKUP(Y137,Feuil1!$C$1:$BF$9,2,FALSE)","v":{"$error":"#VALUE!"}},{"$f":"T137-HLOOKUP(Y137,Feuil1!$C$1:$BF$9,3,FALSE)","v":{"$error":"#VALUE!"}},{"$f":"T137-HLOOKUP(Y137,Feuil1!$C$1:$BF$9,4,FALSE)","v":{"$error":"#VALUE!"}},{"$f":"T137-HLOOKUP(Y137,Feuil1!$C$1:$BF$9,5,FALSE)","v":{"$error":"#VALUE!"}},{"$f":"T137-HLOOKUP(Y137,Feuil1!$C$1:$BF$9,6,FALSE)","v":{"$error":"#VALUE!"}},{"$f":"T137-HLOOKUP(Y137,Feuil1!$C$1:$BF$9,7,FALSE)","v":{"$error":"#VALUE!"}},{"$f":"T137-HLOOKUP(Y137,Feuil1!$C$1:$BF$9,8,FALSE)","v":{"$error":"#VALUE!"}},{"$f":"T137-HLOOKUP(Y137,Feuil1!$C$1:$BF$9,9,FALSE)","v":{"$error":"#VALUE!"}},null,null,null,null,null,null,null,{"$error":"#VALUE!"},2017,null,{"$f":"IF(AQ137,VLOOKUP(AQ137,FEM!$AS$468:$AT$523,2))","v":4.4930000000000003}]
[null,null,null,null,null,null,null,null,null,null,null,null,null,null,null,null,null,null,null,null,null,null,null,null,{"$f":"IF(AND(H138<1936),VLOOKUP(I138,Feuil1!$F$10:$O$24,9),IF(AND(H138>=1942,H138<1947),VLOOKUP(I138,Feuil1!$F$10:$O$24,9),IF(AND(H138>=1947,H138<1952),VLOOKUP(I138,Feuil1!$F$10:$O$24,8),IF(AND(H138>=1952,H138<1957),VLOOKUP(I138,Feuil1!$F$10:$O$24,7),IF(AND(H138>=1957,H138<1962),VLOOKUP(I138,Feuil1!$F$10:$O$24,6),IF(AND(H138>=1962,H138<1967),VLOOKUP(I138,Feuil1!$F$10:$O$24,5),IF(AND(H138>=1967,H138<1972),VLOOKUP(I138,Feuil1!$F$10:$O$24,4),IF(AND(H138>=1972,H138<1977),VLOOKUP(I138,Feuil1!$F$10:$O$24,3),IF(AND(H138>=1977,H138<1982),VLOOKUP(I138,Feuil1!$F$10:$O$24,2),VLOOKUP(I138,Feuil1!$F$10:$O$24,2))))))))))","v":{"$error":"#N/A"}},null,null,null,null,null,null,null,null,null,null,null,null,null,null,null,null,{"$f":"IF(AH138>=0,$AH$5,IF(AG138>=0,$AG$5,IF(AF138>=0,$AF$5,IF(AE138>=0,$AE$5,IF(AD138>=0,$AD$5,IF(AC138>=0,$AC$5,IF(AB138>=0,$AB$5,IF(AA138>=0,$AA$5,$AI$5))))))))","v":"OLY +"},2017,null,{"$f":"IF(AQ138,VLOOKUP(AQ138,FEM!$AS$468:$AT$523,2))","v":4.4930000000000003}]
[null,null,null,null,null,null,null,null,null,null,null,null,null,null,null,null,null,null,null,null,null,null,null,null,{"$f":"IF(AND(H139<1936),VLOOKUP(I139,Feuil1!$F$10:$O$24,9),IF(AND(H139>=1942,H139<1947),VLOOKUP(I139,Feuil1!$F$10:$O$24,9),IF(AND(H139>=1947,H139<1952),VLOOKUP(I139,Feuil1!$F$10:$O$24,8),IF(AND(H139>=1952,H139<1957),VLOOKUP(I139,Feuil1!$F$10:$O$24,7),IF(AND(H139>=1957,H139<1962),VLOOKUP(I139,Feuil1!$F$10:$O$24,6),IF(AND(H139>=1962,H139<1967),VLOOKUP(I139,Feuil1!$F$10:$O$24,5),IF(AND(H139>=1967,H139<1972),VLOOKUP(I139,Feuil1!$F$10:$O$24,4),IF(AND(H139>=1972,H139<1977),VLOOKUP(I139,Feuil1!$F$10:$O$24,3),IF(AND(H139>=1977,H139<1982),VLOOKUP(I139,Feuil1!$F$10:$O$24,2),VLOOKUP(I139,Feuil1!$F$10:$O$24,2))))))))))","v":{"$error":"#N/A"}},null,null,null,null,null,null,null,null,null,null,null,null,null,null,null,null,"OLY +",2017,null,{"$f":"IF(AQ139,VLOOKUP(AQ139,FEM!$AS$468:$AT$523,2))","v":4.4930000000000003}]
[null,null,null,null,null,null,null,null,null,null,null,null,null,null,null,null,null,null,null,null,null,null,null,null,{"$f":"IF(AND(H140<1936),VLOOKUP(I140,Feuil1!$F$10:$O$24,9),IF(AND(H140>=1942,H140<1947),VLOOKUP(I140,Feuil1!$F$10:$O$24,9),IF(AND(H140>=1947,H140<1952),VLOOKUP(I140,Feuil1!$F$10:$O$24,8),IF(AND(H140>=1952,H140<1957),VLOOKUP(I140,Feuil1!$F$10:$O$24,7),IF(AND(H140>=1957,H140<1962),VLOOKUP(I140,Feuil1!$F$10:$O$24,6),IF(AND(H140>=1962,H140<1967),VLOOKUP(I140,Feuil1!$F$10:$O$24,5),IF(AND(H140>=1967,H140<1972),VLOOKUP(I140,Feuil1!$F$10:$O$24,4),IF(AND(H140>=1972,H140<1977),VLOOKUP(I140,Feuil1!$F$10:$O$24,3),IF(AND(H140>=1977,H140<1982),VLOOKUP(I140,Feuil1!$F$10:$O$24,2),VLOOKUP(I140,Feuil1!$F$10:$O$24,2))))))))))","v":{"$error":"#N/A"}},null,null,null,null,null,null,null,null,null,null,null,null,null,null,null,null,"OLY +",2017,null,{"$f":"IF(AQ140,VLOOKUP(AQ140,FEM!$AS$468:$AT$523,2))","v":4.4930000000000003}]
[null,null,null,null,null,null,null,null,null,null,null,null,null,null,null,null,null,null,null,null,null,null,null,null,{"$f":"IF(AND(H141<1936),VLOOKUP(I141,Feuil1!$F$10:$O$24,9),IF(AND(H141>=1942,H141<1947),VLOOKUP(I141,Feuil1!$F$10:$O$24,9),IF(AND(H141>=1947,H141<1952),VLOOKUP(I141,Feuil1!$F$10:$O$24,8),IF(AND(H141>=1952,H141<1957),VLOOKUP(I141,Feuil1!$F$10:$O$24,7),IF(AND(H141>=1957,H141<1962),VLOOKUP(I141,Feuil1!$F$10:$O$24,6),IF(AND(H141>=1962,H141<1967),VLOOKUP(I141,Feuil1!$F$10:$O$24,5),IF(AND(H141>=1967,H141<1972),VLOOKUP(I141,Feuil1!$F$10:$O$24,4),IF(AND(H141>=1972,H141<1977),VLOOKUP(I141,Feuil1!$F$10:$O$24,3),IF(AND(H141>=1977,H141<1982),VLOOKUP(I141,Feuil1!$F$10:$O$24,2),VLOOKUP(I141,Feuil1!$F$10:$O$24,2))))))))))","v":{"$error":"#N/A"}},null,null,null,null,null,null,null,null,null,null,null,null,null,null,null,null,"OLY +",2017,null,{"$f":"IF(AQ141,VLOOKUP(AQ141,FEM!$AS$468:$AT$523,2))","v":4.4930000000000003}]
[null,null,null,null,null,null,null,null,null,null,null,null,null,null,null,null,null,null,null,null,null,null,null,null,{"$f":"IF(AND(H142<1936),VLOOKUP(I142,Feuil1!$F$10:$O$24,9),IF(AND(H142>=1942,H142<1947),VLOOKUP(I142,Feuil1!$F$10:$O$24,9),IF(AND(H142>=1947,H142<1952),VLOOKUP(I142,Feuil1!$F$10:$O$24,8),IF(AND(H142>=1952,H142<1957),VLOOKUP(I142,Feuil1!$F$10:$O$24,7),IF(AND(H142>=1957,H142<1962),VLOOKUP(I142,Feuil1!$F$10:$O$24,6),IF(AND(H142>=1962,H142<1967),VLOOKUP(I142,Feuil1!$F$10:$O$24,5),IF(AND(H142>=1967,H142<1972),VLOOKUP(I142,Feuil1!$F$10:$O$24,4),IF(AND(H142>=1972,H142<1977),VLOOKUP(I142,Feuil1!$F$10:$O$24,3),IF(AND(H142>=1977,H142<1982),VLOOKUP(I142,Feuil1!$F$10:$O$24,2),VLOOKUP(I142,Feuil1!$F$10:$O$24,2))))))))))","v":{"$error":"#N/A"}},null,null,null,null,null,null,null,null,null,null,null,null,null,null,null,null,"OLY +",2017,null,{"$f":"IF(AQ142,VLOOKUP(AQ142,FEM!$AS$468:$AT$523,2))","v":4.4930000000000003}]
[null,null,null,null,null,null,null,null,null,null,null,null,null,null,null,null,null,null,null,null,null,null,null,null,{"$f":"IF(AND(H143<1936),VLOOKUP(I143,Feuil1!$F$10:$O$24,9),IF(AND(H143>=1942,H143<1947),VLOOKUP(I143,Feuil1!$F$10:$O$24,9),IF(AND(H143>=1947,H143<1952),VLOOKUP(I143,Feuil1!$F$10:$O$24,8),IF(AND(H143>=1952,H143<1957),VLOOKUP(I143,Feuil1!$F$10:$O$24,7),IF(AND(H143>=1957,H143<1962),VLOOKUP(I143,Feuil1!$F$10:$O$24,6),IF(AND(H143>=1962,H143<1967),VLOOKUP(I143,Feuil1!$F$10:$O$24,5),IF(AND(H143>=1967,H143<1972),VLOOKUP(I143,Feuil1!$F$10:$O$24,4),IF(AND(H143>=1972,H143<1977),VLOOKUP(I143,Feuil1!$F$10:$O$24,3),IF(AND(H143>=1977,H143<1982),VLOOKUP(I143,Feuil1!$F$10:$O$24,2),VLOOKUP(I143,Feuil1!$F$10:$O$24,2))))))))))","v":{"$error":"#N/A"}},null,null,null,null,null,null,null,null,null,null,null,null,null,null,null,null,"OLY +",2017,null,{"$f":"IF(AQ143,VLOOKUP(AQ143,FEM!$AS$468:$AT$523,2))","v":4.4930000000000003}]
[null,null,null,null,null,null,null,null,null,null,null,null,null,null,null,null,null,null,null,null,null,null,null,null,{"$f":"IF(AND(H144<1936),VLOOKUP(I144,Feuil1!$F$10:$O$24,9),IF(AND(H144>=1942,H144<1947),VLOOKUP(I144,Feuil1!$F$10:$O$24,9),IF(AND(H144>=1947,H144<1952),VLOOKUP(I144,Feuil1!$F$10:$O$24,8),IF(AND(H144>=1952,H144<1957),VLOOKUP(I144,Feuil1!$F$10:$O$24,7),IF(AND(H144>=1957,H144<1962),VLOOKUP(I144,Feuil1!$F$10:$O$24,6),IF(AND(H144>=1962,H144<1967),VLOOKUP(I144,Feuil1!$F$10:$O$24,5),IF(AND(H144>=1967,H144<1972),VLOOKUP(I144,Feuil1!$F$10:$O$24,4),IF(AND(H144>=1972,H144<1977),VLOOKUP(I144,Feuil1!$F$10:$O$24,3),IF(AND(H144>=1977,H144<1982),VLOOKUP(I144,Feuil1!$F$10:$O$24,2),VLOOKUP(I144,Feuil1!$F$10:$O$24,2))))))))))","v":{"$error":"#N/A"}},null,null,null,null,null,null,null,null,null,null,null,null,null,null,null,null,"OLY +",2017,null,{"$f":"IF(AQ144,VLOOKUP(AQ144,FEM!$AS$468:$AT$523,2))","v":4.4930000000000003}]
[null,null,null,null,null,null,null,null,null,null,null,null,null,null,null,null,null,null,null,null,null,null,null,null,{"$f":"IF(AND(H145<1936),VLOOKUP(I145,Feuil1!$F$10:$O$24,9),IF(AND(H145>=1942,H145<1947),VLOOKUP(I145,Feuil1!$F$10:$O$24,9),IF(AND(H145>=1947,H145<1952),VLOOKUP(I145,Feuil1!$F$10:$O$24,8),IF(AND(H145>=1952,H145<1957),VLOOKUP(I145,Feuil1!$F$10:$O$24,7),IF(AND(H145>=1957,H145<1962),VLOOKUP(I145,Feuil1!$F$10:$O$24,6),IF(AND(H145>=1962,H145<1967),VLOOKUP(I145,Feuil1!$F$10:$O$24,5),IF(AND(H145>=1967,H145<1972),VLOOKUP(I145,Feuil1!$F$10:$O$24,4),IF(AND(H145>=1972,H145<1977),VLOOKUP(I145,Feuil1!$F$10:$O$24,3),IF(AND(H145>=1977,H145<1982),VLOOKUP(I145,Feuil1!$F$10:$O$24,2),VLOOKUP(I145,Feuil1!$F$10:$O$24,2))))))))))","v":{"$error":"#N/A"}},null,null,null,null,null,null,null,null,null,null,null,null,null,null,null,null,"OLY +",2017,null,{"$f":"IF(AQ145,VLOOKUP(AQ145,FEM!$AS$468:$AT$523,2))","v":4.4930000000000003}]
[null,null,null,null,null,null,null,null,null,null,null,null,null,null,null,null,null,null,null,null,null,null,null,null,{"$f":"IF(AND(H146<1936),VLOOKUP(I146,Feuil1!$F$10:$O$24,9),IF(AND(H146>=1942,H146<1947),VLOOKUP(I146,Feuil1!$F$10:$O$24,9),IF(AND(H146>=1947,H146<1952),VLOOKUP(I146,Feuil1!$F$10:$O$24,8),IF(AND(H146>=1952,H146<1957),VLOOKUP(I146,Feuil1!$F$10:$O$24,7),IF(AND(H146>=1957,H146<1962),VLOOKUP(I146,Feuil1!$F$10:$O$24,6),IF(AND(H146>=1962,H146<1967),VLOOKUP(I146,Feuil1!$F$10:$O$24,5),IF(AND(H146>=1967,H146<1972),VLOOKUP(I146,Feuil1!$F$10:$O$24,4),IF(AND(H146>=1972,H146<1977),VLOOKUP(I146,Feuil1!$F$10:$O$24,3),IF(AND(H146>=1977,H146<1982),VLOOKUP(I146,Feuil1!$F$10:$O$24,2),VLOOKUP(I146,Feuil1!$F$10:$O$24,2))))))))))","v":{"$error":"#N/A"}},null,null,null,null,null,null,null,null,null,null,null,null,null,null,null,null,"OLY +",2017,null,{"$f":"IF(AQ146,VLOOKUP(AQ146,FEM!$AS$468:$AT$523,2))","v":4.4930000000000003}]
[null,null,null,null,null,null,null,null,null,null,null,null,null,null,null,null,null,null,null,null,null,null,null,null,{"$f":"IF(AND(H147<1936),VLOOKUP(I147,Feuil1!$F$10:$O$24,9),IF(AND(H147>=1942,H147<1947),VLOOKUP(I147,Feuil1!$F$10:$O$24,9),IF(AND(H147>=1947,H147<1952),VLOOKUP(I147,Feuil1!$F$10:$O$24,8),IF(AND(H147>=1952,H147<1957),VLOOKUP(I147,Feuil1!$F$10:$O$24,7),IF(AND(H147>=1957,H147<1962),VLOOKUP(I147,Feuil1!$F$10:$O$24,6),IF(AND(H147>=1962,H147<1967),VLOOKUP(I147,Feuil1!$F$10:$O$24,5),IF(AND(H147>=1967,H147<1972),VLOOKUP(I147,Feuil1!$F$10:$O$24,4),IF(AND(H147>=1972,H147<1977),VLOOKUP(I147,Feuil1!$F$10:$O$24,3),IF(AND(H147>=1977,H147<1982),VLOOKUP(I147,Feuil1!$F$10:$O$24,2),VLOOKUP(I147,Feuil1!$F$10:$O$24,2))))))))))","v":{"$error":"#N/A"}},null,null,null,null,null,null,null,null,null,null,null,null,null,null,null,null,"OLY +",2017,null,{"$f":"IF(AQ147,VLOOKUP(AQ147,FEM!$AS$468:$AT$523,2))","v":4.4930000000000003}]
[null,null,null,null,null,null,null,null," ",null,null,null,null,null,null,null,null,null,null,null,null,null,null,null,{"$f":"IF(AND(H148<1936),VLOOKUP(I148,Feuil1!$F$10:$O$24,9),IF(AND(H148>=1942,H148<1947),VLOOKUP(I148,Feuil1!$F$10:$O$24,9),IF(AND(H148>=1947,H148<1952),VLOOKUP(I148,Feuil1!$F$10:$O$24,8),IF(AND(H148>=1952,H148<1957),VLOOKUP(I148,Feuil1!$F$10:$O$24,7),IF(AND(H148>=1957,H148<1962),VLOOKUP(I148,Feuil1!$F$10:$O$24,6),IF(AND(H148>=1962,H148<1967),VLOOKUP(I148,Feuil1!$F$10:$O$24,5),IF(AND(H148>=1967,H148<1972),VLOOKUP(I148,Feuil1!$F$10:$O$24,4),IF(AND(H148>=1972,H148<1977),VLOOKUP(I148,Feuil1!$F$10:$O$24,3),IF(AND(H148>=1977,H148<1982),VLOOKUP(I148,Feuil1!$F$10:$O$24,2),VLOOKUP(I148,Feuil1!$F$10:$O$24,2))))))))))","v":{"$error":"#N/A"}},null,null,null,null,null,null,null,null,null,null,null,null,null,null,null,null,"OLY +",2017,null,{"$f":"IF(AQ148,VLOOKUP(AQ148,FEM!$AS$468:$AT$523,2))","v":4.4930000000000003}]
[null,null,null,null,null,null,null,null,null,null,null,null,null,null,null,null,null,null,null,null,null,null,null,null,{"$f":"IF(AND(H149<1936),VLOOKUP(I149,Feuil1!$F$10:$O$24,9),IF(AND(H149>=1942,H149<1947),VLOOKUP(I149,Feuil1!$F$10:$O$24,9),IF(AND(H149>=1947,H149<1952),VLOOKUP(I149,Feuil1!$F$10:$O$24,8),IF(AND(H149>=1952,H149<1957),VLOOKUP(I149,Feuil1!$F$10:$O$24,7),IF(AND(H149>=1957,H149<1962),VLOOKUP(I149,Feuil1!$F$10:$O$24,6),IF(AND(H149>=1962,H149<1967),VLOOKUP(I149,Feuil1!$F$10:$O$24,5),IF(AND(H149>=1967,H149<1972),VLOOKUP(I149,Feuil1!$F$10:$O$24,4),IF(AND(H149>=1972,H149<1977),VLOOKUP(I149,Feuil1!$F$10:$O$24,3),IF(AND(H149>=1977,H149<1982),VLOOKUP(I149,Feuil1!$F$10:$O$24,2),VLOOKUP(I149,Feuil1!$F$10:$O$24,2))))))))))","v":{"$error":"#N/A"}},null,null,null,null,null,null,null,null,null,null,null,null,null,null,null,null,"OLY +",2017,null,{"$f":"IF(AQ149,VLOOKUP(AQ149,FEM!$AS$468:$AT$523,2))","v":4.4930000000000003}]
[null,null,null,null,null,null,null,null,null,null,null,null,null,null,null,null,null,null,null,null,null,null,null,null,{"$f":"IF(AND(H150<1936),VLOOKUP(I150,Feuil1!$F$10:$O$24,9),IF(AND(H150>=1942,H150<1947),VLOOKUP(I150,Feuil1!$F$10:$O$24,9),IF(AND(H150>=1947,H150<1952),VLOOKUP(I150,Feuil1!$F$10:$O$24,8),IF(AND(H150>=1952,H150<1957),VLOOKUP(I150,Feuil1!$F$10:$O$24,7),IF(AND(H150>=1957,H150<1962),VLOOKUP(I150,Feuil1!$F$10:$O$24,6),IF(AND(H150>=1962,H150<1967),VLOOKUP(I150,Feuil1!$F$10:$O$24,5),IF(AND(H150>=1967,H150<1972),VLOOKUP(I150,Feuil1!$F$10:$O$24,4),IF(AND(H150>=1972,H150<1977),VLOOKUP(I150,Feuil1!$F$10:$O$24,3),IF(AND(H150>=1977,H150<1982),VLOOKUP(I150,Feuil1!$F$10:$O$24,2),VLOOKUP(I150,Feuil1!$F$10:$O$24,2))))))))))","v":{"$error":"#N/A"}},null,null,null,null,null,null,null,null,null,null,null,null,null,null,null,null,"OLY +",2017,null,{"$f":"IF(AQ150,VLOOKUP(AQ150,FEM!$AS$468:$AT$523,2))","v":4.4930000000000003}]
[null,null,null,null,null,null,null,null,null,null,null,null,null,null,null,null,null,null,null,null,null,null,null,null,{"$f":"IF(AND(H151<1936),VLOOKUP(I151,Feuil1!$F$10:$O$24,9),IF(AND(H151>=1942,H151<1947),VLOOKUP(I151,Feuil1!$F$10:$O$24,9),IF(AND(H151>=1947,H151<1952),VLOOKUP(I151,Feuil1!$F$10:$O$24,8),IF(AND(H151>=1952,H151<1957),VLOOKUP(I151,Feuil1!$F$10:$O$24,7),IF(AND(H151>=1957,H151<1962),VLOOKUP(I151,Feuil1!$F$10:$O$24,6),IF(AND(H151>=1962,H151<1967),VLOOKUP(I151,Feuil1!$F$10:$O$24,5),IF(AND(H151>=1967,H151<1972),VLOOKUP(I151,Feuil1!$F$10:$O$24,4),IF(AND(H151>=1972,H151<1977),VLOOKUP(I151,Feuil1!$F$10:$O$24,3),IF(AND(H151>=1977,H151<1982),VLOOKUP(I151,Feuil1!$F$10:$O$24,2),VLOOKUP(I151,Feuil1!$F$10:$O$24,2))))))))))","v":{"$error":"#N/A"}},null,null,null,null,null,null,null,null,null,null,null,null,null,null,null,null,"OLY +",2017,null,{"$f":"IF(AQ151,VLOOKUP(AQ151,FEM!$AS$468:$AT$523,2))","v":4.4930000000000003}]
[null,null,null,null,null,null,null,null,null,null,null,null,null,null,null,null,null,null,null,null,null,null,null,null,{"$f":"IF(AND(H152<1936),VLOOKUP(I152,Feuil1!$F$10:$O$24,9),IF(AND(H152>=1942,H152<1947),VLOOKUP(I152,Feuil1!$F$10:$O$24,9),IF(AND(H152>=1947,H152<1952),VLOOKUP(I152,Feuil1!$F$10:$O$24,8),IF(AND(H152>=1952,H152<1957),VLOOKUP(I152,Feuil1!$F$10:$O$24,7),IF(AND(H152>=1957,H152<1962),VLOOKUP(I152,Feuil1!$F$10:$O$24,6),IF(AND(H152>=1962,H152<1967),VLOOKUP(I152,Feuil1!$F$10:$O$24,5),IF(AND(H152>=1967,H152<1972),VLOOKUP(I152,Feuil1!$F$10:$O$24,4),IF(AND(H152>=1972,H152<1977),VLOOKUP(I152,Feuil1!$F$10:$O$24,3),IF(AND(H152>=1977,H152<1982),VLOOKUP(I152,Feuil1!$F$10:$O$24,2),VLOOKUP(I152,Feuil1!$F$10:$O$24,2))))))))))","v":{"$error":"#N/A"}},null,null,null,null,null,null,null,null,null,null,null,null,null,null,null,null,"OLY +",2017,null,{"$f":"IF(AQ152,VLOOKUP(AQ152,FEM!$AS$468:$AT$523,2))","v":4.4930000000000003}]
[null,null,null,null,null,null,null,null,null,null,null,null,null,null,null,null,null,null,null,null,null,null,null,null,{"$f":"IF(AND(H153<1936),VLOOKUP(I153,Feuil1!$F$10:$O$24,9),IF(AND(H153>=1942,H153<1947),VLOOKUP(I153,Feuil1!$F$10:$O$24,9),IF(AND(H153>=1947,H153<1952),VLOOKUP(I153,Feuil1!$F$10:$O$24,8),IF(AND(H153>=1952,H153<1957),VLOOKUP(I153,Feuil1!$F$10:$O$24,7),IF(AND(H153>=1957,H153<1962),VLOOKUP(I153,Feuil1!$F$10:$O$24,6),IF(AND(H153>=1962,H153<1967),VLOOKUP(I153,Feuil1!$F$10:$O$24,5),IF(AND(H153>=1967,H153<1972),VLOOKUP(I153,Feuil1!$F$10:$O$24,4),IF(AND(H153>=1972,H153<1977),VLOOKUP(I153,Feuil1!$F$10:$O$24,3),IF(AND(H153>=1977,H153<1982),VLOOKUP(I153,Feuil1!$F$10:$O$24,2),VLOOKUP(I153,Feuil1!$F$10:$O$24,2))))))))))","v":{"$error":"#N/A"}},null,null,null,null,null,null,null,null,null,null,null,null,null,null,null,null,"OLY +",2017,null,{"$f":"IF(AQ153,VLOOKUP(AQ153,FEM!$AS$468:$AT$523,2))","v":4.4930000000000003}]
[null,null,null,null,null,null,null,null,null,null,null,null,null,null,null,null,null,null,null,null,null,null,null,null,{"$f":"IF(AND(H154<1936),VLOOKUP(I154,Feuil1!$F$10:$O$24,9),IF(AND(H154>=1942,H154<1947),VLOOKUP(I154,Feuil1!$F$10:$O$24,9),IF(AND(H154>=1947,H154<1952),VLOOKUP(I154,Feuil1!$F$10:$O$24,8),IF(AND(H154>=1952,H154<1957),VLOOKUP(I154,Feuil1!$F$10:$O$24,7),IF(AND(H154>=1957,H154<1962),VLOOKUP(I154,Feuil1!$F$10:$O$24,6),IF(AND(H154>=1962,H154<1967),VLOOKUP(I154,Feuil1!$F$10:$O$24,5),IF(AND(H154>=1967,H154<1972),VLOOKUP(I154,Feuil1!$F$10:$O$24,4),IF(AND(H154>=1972,H154<1977),VLOOKUP(I154,Feuil1!$F$10:$O$24,3),IF(AND(H154>=1977,H154<1982),VLOOKUP(I154,Feuil1!$F$10:$O$24,2),VLOOKUP(I154,Feuil1!$F$10:$O$24,2))))))))))","v":{"$error":"#N/A"}},null,null,null,null,null,null,null,null,null,null,null,null,null,null,null,null,"OLY +",2017,null,{"$f":"IF(AQ154,VLOOKUP(AQ154,FEM!$AS$468:$AT$523,2))","v":4.4930000000000003}]
[null,null,null,null,null,null,null,null,null,null,null,null,null,null,null,null,null,null,null,null,null,null,null,null,{"$f":"IF(AND(H155<1936),VLOOKUP(I155,Feuil1!$F$10:$O$24,9),IF(AND(H155>=1942,H155<1947),VLOOKUP(I155,Feuil1!$F$10:$O$24,9),IF(AND(H155>=1947,H155<1952),VLOOKUP(I155,Feuil1!$F$10:$O$24,8),IF(AND(H155>=1952,H155<1957),VLOOKUP(I155,Feuil1!$F$10:$O$24,7),IF(AND(H155>=1957,H155<1962),VLOOKUP(I155,Feuil1!$F$10:$O$24,6),IF(AND(H155>=1962,H155<1967),VLOOKUP(I155,Feuil1!$F$10:$O$24,5),IF(AND(H155>=1967,H155<1972),VLOOKUP(I155,Feuil1!$F$10:$O$24,4),IF(AND(H155>=1972,H155<1977),VLOOKUP(I155,Feuil1!$F$10:$O$24,3),IF(AND(H155>=1977,H155<1982),VLOOKUP(I155,Feuil1!$F$10:$O$24,2),VLOOKUP(I155,Feuil1!$F$10:$O$24,2))))))))))","v":{"$error":"#N/A"}},null,null,null,null,null,null,null,null,null,null,null,null,null,null,null,null,"OLY +",2017,null,{"$f":"IF(AQ155,VLOOKUP(AQ155,FEM!$AS$468:$AT$523,2))","v":4.4930000000000003}]
[null,null,null,null,null,null,null,null,null,null,null,null,null,null,null,null,null,null,null,null,null,null,null,null,{"$f":"IF(AND(H156<1936),VLOOKUP(I156,Feuil1!$F$10:$O$24,9),IF(AND(H156>=1942,H156<1947),VLOOKUP(I156,Feuil1!$F$10:$O$24,9),IF(AND(H156>=1947,H156<1952),VLOOKUP(I156,Feuil1!$F$10:$O$24,8),IF(AND(H156>=1952,H156<1957),VLOOKUP(I156,Feuil1!$F$10:$O$24,7),IF(AND(H156>=1957,H156<1962),VLOOKUP(I156,Feuil1!$F$10:$O$24,6),IF(AND(H156>=1962,H156<1967),VLOOKUP(I156,Feuil1!$F$10:$O$24,5),IF(AND(H156>=1967,H156<1972),VLOOKUP(I156,Feuil1!$F$10:$O$24,4),IF(AND(H156>=1972,H156<1977),VLOOKUP(I156,Feuil1!$F$10:$O$24,3),IF(AND(H156>=1977,H156<1982),VLOOKUP(I156,Feuil1!$F$10:$O$24,2),VLOOKUP(I156,Feuil1!$F$10:$O$24,2))))))))))","v":{"$error":"#N/A"}},null,null,null,null,null,null,null,null,null,null,null,null,null,null,null,null,"OLY +",2017,null,{"$f":"IF(AQ156,VLOOKUP(AQ156,FEM!$AS$468:$AT$523,2))","v":4.4930000000000003}]
[null,null,null,null,null,null,null,null,null,null,null,null,null,null,null,null,null,null,null,null,null,null,null,null,{"$f":"IF(AND(H157<1936),VLOOKUP(I157,Feuil1!$F$10:$O$24,9),IF(AND(H157>=1942,H157<1947),VLOOKUP(I157,Feuil1!$F$10:$O$24,9),IF(AND(H157>=1947,H157<1952),VLOOKUP(I157,Feuil1!$F$10:$O$24,8),IF(AND(H157>=1952,H157<1957),VLOOKUP(I157,Feuil1!$F$10:$O$24,7),IF(AND(H157>=1957,H157<1962),VLOOKUP(I157,Feuil1!$F$10:$O$24,6),IF(AND(H157>=1962,H157<1967),VLOOKUP(I157,Feuil1!$F$10:$O$24,5),IF(AND(H157>=1967,H157<1972),VLOOKUP(I157,Feuil1!$F$10:$O$24,4),IF(AND(H157>=1972,H157<1977),VLOOKUP(I157,Feuil1!$F$10:$O$24,3),IF(AND(H157>=1977,H157<1982),VLOOKUP(I157,Feuil1!$F$10:$O$24,2),VLOOKUP(I157,Feuil1!$F$10:$O$24,2))))))))))","v":{"$error":"#N/A"}},null,null,null,null,null,null,null,null,null,null,null,null,null,null,null,null,"OLY +",2017,null,{"$f":"IF(AQ157,VLOOKUP(AQ157,FEM!$AS$468:$AT$523,2))","v":4.4930000000000003}]
[null,null,null,null,null,null,null,null,null,null,null,null,null,null,null,null,null,null,null,null,null,null,null,null,{"$f":"IF(AND(H158<1936),VLOOKUP(I158,Feuil1!$F$10:$O$24,9),IF(AND(H158>=1942,H158<1947),VLOOKUP(I158,Feuil1!$F$10:$O$24,9),IF(AND(H158>=1947,H158<1952),VLOOKUP(I158,Feuil1!$F$10:$O$24,8),IF(AND(H158>=1952,H158<1957),VLOOKUP(I158,Feuil1!$F$10:$O$24,7),IF(AND(H158>=1957,H158<1962),VLOOKUP(I158,Feuil1!$F$10:$O$24,6),IF(AND(H158>=1962,H158<1967),VLOOKUP(I158,Feuil1!$F$10:$O$24,5),IF(AND(H158>=1967,H158<1972),VLOOKUP(I158,Feuil1!$F$10:$O$24,4),IF(AND(H158>=1972,H158<1977),VLOOKUP(I158,Feuil1!$F$10:$O$24,3),IF(AND(H158>=1977,H158<1982),VLOOKUP(I158,Feuil1!$F$10:$O$24,2),VLOOKUP(I158,Feuil1!$F$10:$O$24,2))))))))))","v":{"$error":"#N/A"}},null,null,null,null,null,null,null,null,null,null,null,null,null,null,null,null,"OLY +",2017,null,{"$f":"IF(AQ158,VLOOKUP(AQ158,FEM!$AS$468:$AT$523,2))","v":4.4930000000000003}]
[null,null,null,null,null,null,null,null,null,null,null,null,null,null,null,null,null,null,null,null,null,null,null,null,{"$f":"IF(AND(H159<1936),VLOOKUP(I159,Feuil1!$F$10:$O$24,9),IF(AND(H159>=1942,H159<1947),VLOOKUP(I159,Feuil1!$F$10:$O$24,9),IF(AND(H159>=1947,H159<1952),VLOOKUP(I159,Feuil1!$F$10:$O$24,8),IF(AND(H159>=1952,H159<1957),VLOOKUP(I159,Feuil1!$F$10:$O$24,7),IF(AND(H159>=1957,H159<1962),VLOOKUP(I159,Feuil1!$F$10:$O$24,6),IF(AND(H159>=1962,H159<1967),VLOOKUP(I159,Feuil1!$F$10:$O$24,5),IF(AND(H159>=1967,H159<1972),VLOOKUP(I159,Feuil1!$F$10:$O$24,4),IF(AND(H159>=1972,H159<1977),VLOOKUP(I159,Feuil1!$F$10:$O$24,3),IF(AND(H159>=1977,H159<1982),VLOOKUP(I159,Feuil1!$F$10:$O$24,2),VLOOKUP(I159,Feuil1!$F$10:$O$24,2))))))))))","v":{"$error":"#N/A"}},null,null,null,null,null,null,null,null,null,null,null,null,null,null,null,null,"OLY +",2017,null,{"$f":"IF(AQ159,VLOOKUP(AQ159,FEM!$AS$468:$AT$523,2))","v":4.4930000000000003}]
[null,null,null,null,null,null,null,null,null,null,null,null,null,null,null,null,null,null,null,null,null,null,null,null,{"$f":"IF(AND(H160<1936),VLOOKUP(I160,Feuil1!$F$10:$O$24,9),IF(AND(H160>=1942,H160<1947),VLOOKUP(I160,Feuil1!$F$10:$O$24,9),IF(AND(H160>=1947,H160<1952),VLOOKUP(I160,Feuil1!$F$10:$O$24,8),IF(AND(H160>=1952,H160<1957),VLOOKUP(I160,Feuil1!$F$10:$O$24,7),IF(AND(H160>=1957,H160<1962),VLOOKUP(I160,Feuil1!$F$10:$O$24,6),IF(AND(H160>=1962,H160<1967),VLOOKUP(I160,Feuil1!$F$10:$O$24,5),IF(AND(H160>=1967,H160<1972),VLOOKUP(I160,Feuil1!$F$10:$O$24,4),IF(AND(H160>=1972,H160<1977),VLOOKUP(I160,Feuil1!$F$10:$O$24,3),IF(AND(H160>=1977,H160<1982),VLOOKUP(I160,Feuil1!$F$10:$O$24,2),VLOOKUP(I160,Feuil1!$F$10:$O$24,2))))))))))","v":{"$error":"#N/A"}},null,null,null,null,null,null,null,null,null,null,null,null,null,null,null,null,"OLY +",2017,null,{"$f":"IF(AQ160,VLOOKUP(AQ160,FEM!$AS$468:$AT$523,2))","v":4.4930000000000003}]
[null,null,null,null,null,null,null,null,null,null,null,null,null,null,null,null,null,null,null,null,null,null,null,null,{"$f":"IF(AND(H161<1936),VLOOKUP(I161,Feuil1!$F$10:$O$24,9),IF(AND(H161>=1942,H161<1947),VLOOKUP(I161,Feuil1!$F$10:$O$24,9),IF(AND(H161>=1947,H161<1952),VLOOKUP(I161,Feuil1!$F$10:$O$24,8),IF(AND(H161>=1952,H161<1957),VLOOKUP(I161,Feuil1!$F$10:$O$24,7),IF(AND(H161>=1957,H161<1962),VLOOKUP(I161,Feuil1!$F$10:$O$24,6),IF(AND(H161>=1962,H161<1967),VLOOKUP(I161,Feuil1!$F$10:$O$24,5),IF(AND(H161>=1967,H161<1972),VLOOKUP(I161,Feuil1!$F$10:$O$24,4),IF(AND(H161>=1972,H161<1977),VLOOKUP(I161,Feuil1!$F$10:$O$24,3),IF(AND(H161>=1977,H161<1982),VLOOKUP(I161,Feuil1!$F$10:$O$24,2),VLOOKUP(I161,Feuil1!$F$10:$O$24,2))))))))))","v":{"$error":"#N/A"}},null,null,null,null,null,null,null,null,null,null,null,null,null,null,null,null,"OLY +",2017,null,{"$f":"IF(AQ161,VLOOKUP(AQ161,FEM!$AS$468:$AT$523,2))","v":4.4930000000000003}]
[null,null,null,null,null,null,null,null,null,null,null,null,null,null,null,null,null,null,null,null,null,null,null,null,{"$f":"IF(AND(H162<1936),VLOOKUP(I162,Feuil1!$F$10:$O$24,9),IF(AND(H162>=1942,H162<1947),VLOOKUP(I162,Feuil1!$F$10:$O$24,9),IF(AND(H162>=1947,H162<1952),VLOOKUP(I162,Feuil1!$F$10:$O$24,8),IF(AND(H162>=1952,H162<1957),VLOOKUP(I162,Feuil1!$F$10:$O$24,7),IF(AND(H162>=1957,H162<1962),VLOOKUP(I162,Feuil1!$F$10:$O$24,6),IF(AND(H162>=1962,H162<1967),VLOOKUP(I162,Feuil1!$F$10:$O$24,5),IF(AND(H162>=1967,H162<1972),VLOOKUP(I162,Feuil1!$F$10:$O$24,4),IF(AND(H162>=1972,H162<1977),VLOOKUP(I162,Feuil1!$F$10:$O$24,3),IF(AND(H162>=1977,H162<1982),VLOOKUP(I162,Feuil1!$F$10:$O$24,2),VLOOKUP(I162,Feuil1!$F$10:$O$24,2))))))))))","v":{"$error":"#N/A"}},null,null,null,null,null,null,null,null,null,null,null,null,null,null,null,null,"OLY +",2017,null,{"$f":"IF(AQ162,VLOOKUP(AQ162,FEM!$AS$468:$AT$523,2))","v":4.4930000000000003}]
[null,null,null,null,null,null,null,null,null,null,null,null,null,null,null,null,null,null,null,null,null,null,null,null,{"$f":"IF(AND(H163<1936),VLOOKUP(I163,Feuil1!$F$10:$O$24,9),IF(AND(H163>=1942,H163<1947),VLOOKUP(I163,Feuil1!$F$10:$O$24,9),IF(AND(H163>=1947,H163<1952),VLOOKUP(I163,Feuil1!$F$10:$O$24,8),IF(AND(H163>=1952,H163<1957),VLOOKUP(I163,Feuil1!$F$10:$O$24,7),IF(AND(H163>=1957,H163<1962),VLOOKUP(I163,Feuil1!$F$10:$O$24,6),IF(AND(H163>=1962,H163<1967),VLOOKUP(I163,Feuil1!$F$10:$O$24,5),IF(AND(H163>=1967,H163<1972),VLOOKUP(I163,Feuil1!$F$10:$O$24,4),IF(AND(H163>=1972,H163<1977),VLOOKUP(I163,Feuil1!$F$10:$O$24,3),IF(AND(H163>=1977,H163<1982),VLOOKUP(I163,Feuil1!$F$10:$O$24,2),VLOOKUP(I163,Feuil1!$F$10:$O$24,2))))))))))","v":{"$error":"#N/A"}},null,null,null,null,null,null,null,null,null,null,null,null,null,null,null,null,"OLY +",2017,null,{"$f":"IF(AQ163,VLOOKUP(AQ163,FEM!$AS$468:$AT$523,2))","v":4.4930000000000003}]
[null,null,null,null,null,null,null,null,null,null,null,null,null,null,null,null,null,null,null,null,null,null,null,null,{"$f":"IF(AND(H164<1936),VLOOKUP(I164,Feuil1!$F$10:$O$24,9),IF(AND(H164>=1942,H164<1947),VLOOKUP(I164,Feuil1!$F$10:$O$24,9),IF(AND(H164>=1947,H164<1952),VLOOKUP(I164,Feuil1!$F$10:$O$24,8),IF(AND(H164>=1952,H164<1957),VLOOKUP(I164,Feuil1!$F$10:$O$24,7),IF(AND(H164>=1957,H164<1962),VLOOKUP(I164,Feuil1!$F$10:$O$24,6),IF(AND(H164>=1962,H164<1967),VLOOKUP(I164,Feuil1!$F$10:$O$24,5),IF(AND(H164>=1967,H164<1972),VLOOKUP(I164,Feuil1!$F$10:$O$24,4),IF(AND(H164>=1972,H164<1977),VLOOKUP(I164,Feuil1!$F$10:$O$24,3),IF(AND(H164>=1977,H164<1982),VLOOKUP(I164,Feuil1!$F$10:$O$24,2),VLOOKUP(I164,Feuil1!$F$10:$O$24,2))))))))))","v":{"$error":"#N/A"}},null,null,null,null,null,null,null,null,null,null,null,null,null,null,null,null,"OLY +",2017,null,{"$f":"IF(AQ164,VLOOKUP(AQ164,FEM!$AS$468:$AT$523,2))","v":4.4930000000000003}]
[null,null,null,null,null,null,null,null,null,null,null,null,null,null,null,null,null,null,null,null,null,null,null,null,{"$f":"IF(AND(H165<1936),VLOOKUP(I165,Feuil1!$F$10:$O$24,9),IF(AND(H165>=1942,H165<1947),VLOOKUP(I165,Feuil1!$F$10:$O$24,9),IF(AND(H165>=1947,H165<1952),VLOOKUP(I165,Feuil1!$F$10:$O$24,8),IF(AND(H165>=1952,H165<1957),VLOOKUP(I165,Feuil1!$F$10:$O$24,7),IF(AND(H165>=1957,H165<1962),VLOOKUP(I165,Feuil1!$F$10:$O$24,6),IF(AND(H165>=1962,H165<1967),VLOOKUP(I165,Feuil1!$F$10:$O$24,5),IF(AND(H165>=1967,H165<1972),VLOOKUP(I165,Feuil1!$F$10:$O$24,4),IF(AND(H165>=1972,H165<1977),VLOOKUP(I165,Feuil1!$F$10:$O$24,3),IF(AND(H165>=1977,H165<1982),VLOOKUP(I165,Feuil1!$F$10:$O$24,2),VLOOKUP(I165,Feuil1!$F$10:$O$24,2))))))))))","v":{"$error":"#N/A"}},null,null,null,null,null,null,null,null,null,null,null,null,null,null,null,null,"OLY +",2017,null,{"$f":"IF(AQ165,VLOOKUP(AQ165,FEM!$AS$468:$AT$523,2))","v":4.4930000000000003}]
[null,null,null,null,null,null,null,null,null,null,null,null,null,null,null,null,null,null,null,null,null,null,null,null,{"$f":"IF(AND(H166<1936),VLOOKUP(I166,Feuil1!$F$10:$O$24,9),IF(AND(H166>=1942,H166<1947),VLOOKUP(I166,Feuil1!$F$10:$O$24,9),IF(AND(H166>=1947,H166<1952),VLOOKUP(I166,Feuil1!$F$10:$O$24,8),IF(AND(H166>=1952,H166<1957),VLOOKUP(I166,Feuil1!$F$10:$O$24,7),IF(AND(H166>=1957,H166<1962),VLOOKUP(I166,Feuil1!$F$10:$O$24,6),IF(AND(H166>=1962,H166<1967),VLOOKUP(I166,Feuil1!$F$10:$O$24,5),IF(AND(H166>=1967,H166<1972),VLOOKUP(I166,Feuil1!$F$10:$O$24,4),IF(AND(H166>=1972,H166<1977),VLOOKUP(I166,Feuil1!$F$10:$O$24,3),IF(AND(H166>=1977,H166<1982),VLOOKUP(I166,Feuil1!$F$10:$O$24,2),VLOOKUP(I166,Feuil1!$F$10:$O$24,2))))))))))","v":{"$error":"#N/A"}},null,null,null,null,null,null,null,null,null,null,null,null,null,null,null,null,"OLY +",2017,null,{"$f":"IF(AQ166,VLOOKUP(AQ166,FEM!$AS$468:$AT$523,2))","v":4.4930000000000003}]
[null,null,null,null,null,null,null,null,null,null,null,null,null,null,null,null,null,null,null,null,null,null,null,null,{"$f":"IF(AND(H167<1936),VLOOKUP(I167,Feuil1!$F$10:$O$24,9),IF(AND(H167>=1942,H167<1947),VLOOKUP(I167,Feuil1!$F$10:$O$24,9),IF(AND(H167>=1947,H167<1952),VLOOKUP(I167,Feuil1!$F$10:$O$24,8),IF(AND(H167>=1952,H167<1957),VLOOKUP(I167,Feuil1!$F$10:$O$24,7),IF(AND(H167>=1957,H167<1962),VLOOKUP(I167,Feuil1!$F$10:$O$24,6),IF(AND(H167>=1962,H167<1967),VLOOKUP(I167,Feuil1!$F$10:$O$24,5),IF(AND(H167>=1967,H167<1972),VLOOKUP(I167,Feuil1!$F$10:$O$24,4),IF(AND(H167>=1972,H167<1977),VLOOKUP(I167,Feuil1!$F$10:$O$24,3),IF(AND(H167>=1977,H167<1982),VLOOKUP(I167,Feuil1!$F$10:$O$24,2),VLOOKUP(I167,Feuil1!$F$10:$O$24,2))))))))))","v":{"$error":"#N/A"}},null,null,null,null,null,null,null,null,null,null,null,null,null,null,null,null,"OLY +",2017,null,{"$f":"IF(AQ167,VLOOKUP(AQ167,FEM!$AS$468:$AT$523,2))","v":4.4930000000000003}]
[null,null,null,null,null,null,null,null,null,null,null,null,null,null,null,null,null,null,null,null,null,null,null,null,{"$f":"IF(AND(H168<1936),VLOOKUP(I168,Feuil1!$F$10:$O$24,9),IF(AND(H168>=1942,H168<1947),VLOOKUP(I168,Feuil1!$F$10:$O$24,9),IF(AND(H168>=1947,H168<1952),VLOOKUP(I168,Feuil1!$F$10:$O$24,8),IF(AND(H168>=1952,H168<1957),VLOOKUP(I168,Feuil1!$F$10:$O$24,7),IF(AND(H168>=1957,H168<1962),VLOOKUP(I168,Feuil1!$F$10:$O$24,6),IF(AND(H168>=1962,H168<1967),VLOOKUP(I168,Feuil1!$F$10:$O$24,5),IF(AND(H168>=1967,H168<1972),VLOOKUP(I168,Feuil1!$F$10:$O$24,4),IF(AND(H168>=1972,H168<1977),VLOOKUP(I168,Feuil1!$F$10:$O$24,3),IF(AND(H168>=1977,H168<1982),VLOOKUP(I168,Feuil1!$F$10:$O$24,2),VLOOKUP(I168,Feuil1!$F$10:$O$24,2))))))))))","v":{"$error":"#N/A"}},null,null,null,null,null,null,null,null,null,null,null,null,null,null,null,null,"OLY +",2017,null,{"$f":"IF(AQ168,VLOOKUP(AQ168,FEM!$AS$468:$AT$523,2))","v":4.4930000000000003}]
[null,null,null,null,null,null,null,null,null,null,null,null,null,null,null,null,null,null,null,null,null,null,null,null,{"$f":"IF(AND(H169<1936),VLOOKUP(I169,Feuil1!$F$10:$O$24,9),IF(AND(H169>=1942,H169<1947),VLOOKUP(I169,Feuil1!$F$10:$O$24,9),IF(AND(H169>=1947,H169<1952),VLOOKUP(I169,Feuil1!$F$10:$O$24,8),IF(AND(H169>=1952,H169<1957),VLOOKUP(I169,Feuil1!$F$10:$O$24,7),IF(AND(H169>=1957,H169<1962),VLOOKUP(I169,Feuil1!$F$10:$O$24,6),IF(AND(H169>=1962,H169<1967),VLOOKUP(I169,Feuil1!$F$10:$O$24,5),IF(AND(H169>=1967,H169<1972),VLOOKUP(I169,Feuil1!$F$10:$O$24,4),IF(AND(H169>=1972,H169<1977),VLOOKUP(I169,Feuil1!$F$10:$O$24,3),IF(AND(H169>=1977,H169<1982),VLOOKUP(I169,Feuil1!$F$10:$O$24,2),VLOOKUP(I169,Feuil1!$F$10:$O$24,2))))))))))","v":{"$error":"#N/A"}},null,null,null,null,null,null,null,null,null,null,null,null,null,null,null,null,"OLY +",2017,null,{"$f":"IF(AQ169,VLOOKUP(AQ169,FEM!$AS$468:$AT$523,2))","v":4.4930000000000003}]
[null,null,null,null,null,null,null,null,null,null,null,null,null,null,null,null,null,null,null,null,null,null,null,null,{"$f":"IF(AND(H170<1936),VLOOKUP(I170,Feuil1!$F$10:$O$24,9),IF(AND(H170>=1942,H170<1947),VLOOKUP(I170,Feuil1!$F$10:$O$24,9),IF(AND(H170>=1947,H170<1952),VLOOKUP(I170,Feuil1!$F$10:$O$24,8),IF(AND(H170>=1952,H170<1957),VLOOKUP(I170,Feuil1!$F$10:$O$24,7),IF(AND(H170>=1957,H170<1962),VLOOKUP(I170,Feuil1!$F$10:$O$24,6),IF(AND(H170>=1962,H170<1967),VLOOKUP(I170,Feuil1!$F$10:$O$24,5),IF(AND(H170>=1967,H170<1972),VLOOKUP(I170,Feuil1!$F$10:$O$24,4),IF(AND(H170>=1972,H170<1977),VLOOKUP(I170,Feuil1!$F$10:$O$24,3),IF(AND(H170>=1977,H170<1982),VLOOKUP(I170,Feuil1!$F$10:$O$24,2),VLOOKUP(I170,Feuil1!$F$10:$O$24,2))))))))))","v":{"$error":"#N/A"}},null,null,null,null,null,null,null,null,null,null,null,null,null,null,null,null,{"$f":"IF(AH170>=0,$AH$5,IF(AG170>=0,$AG$5,IF(AF170>=0,$AF$5,IF(AE170>=0,$AE$5,IF(AD170>=0,$AD$5,IF(AC170>=0,$AC$5,IF(AB170>=0,$AB$5,IF(AA170>=0,$AA$5,$AI$5))))))))","v":"OLY +"},2017,null,{"$f":"IF(AQ170,VLOOKUP(AQ170,FEM!$AS$468:$AT$523,2))","v":4.4930000000000003}]
[null,null,null,null,null,null,null,null,null,null,null,null,null,null,null,null,null,null,null,null,null,null,null,null,{"$f":"IF(AND(H171<1936),VLOOKUP(I171,Feuil1!$F$10:$O$24,9),IF(AND(H171>=1942,H171<1947),VLOOKUP(I171,Feuil1!$F$10:$O$24,9),IF(AND(H171>=1947,H171<1952),VLOOKUP(I171,Feuil1!$F$10:$O$24,8),IF(AND(H171>=1952,H171<1957),VLOOKUP(I171,Feuil1!$F$10:$O$24,7),IF(AND(H171>=1957,H171<1962),VLOOKUP(I171,Feuil1!$F$10:$O$24,6),IF(AND(H171>=1962,H171<1967),VLOOKUP(I171,Feuil1!$F$10:$O$24,5),IF(AND(H171>=1967,H171<1972),VLOOKUP(I171,Feuil1!$F$10:$O$24,4),IF(AND(H171>=1972,H171<1977),VLOOKUP(I171,Feuil1!$F$10:$O$24,3),IF(AND(H171>=1977,H171<1982),VLOOKUP(I171,Feuil1!$F$10:$O$24,2),VLOOKUP(I171,Feuil1!$F$10:$O$24,2))))))))))","v":{"$error":"#N/A"}},null,null,null,null,null,null,null,null,null,null,null,null,null,null,null,null,"OLY +",2017,null,{"$f":"IF(AQ171,VLOOKUP(AQ171,FEM!$AS$468:$AT$523,2))","v":4.4930000000000003}]
[null,null,null,null,null,null,null,null,null,null,null,null,null,null,null,null,null,null,null,null,null,null,null,null,{"$f":"IF(AND(H172<1936),VLOOKUP(I172,Feuil1!$F$10:$O$24,9),IF(AND(H172>=1942,H172<1947),VLOOKUP(I172,Feuil1!$F$10:$O$24,9),IF(AND(H172>=1947,H172<1952),VLOOKUP(I172,Feuil1!$F$10:$O$24,8),IF(AND(H172>=1952,H172<1957),VLOOKUP(I172,Feuil1!$F$10:$O$24,7),IF(AND(H172>=1957,H172<1962),VLOOKUP(I172,Feuil1!$F$10:$O$24,6),IF(AND(H172>=1962,H172<1967),VLOOKUP(I172,Feuil1!$F$10:$O$24,5),IF(AND(H172>=1967,H172<1972),VLOOKUP(I172,Feuil1!$F$10:$O$24,4),IF(AND(H172>=1972,H172<1977),VLOOKUP(I172,Feuil1!$F$10:$O$24,3),IF(AND(H172>=1977,H172<1982),VLOOKUP(I172,Feuil1!$F$10:$O$24,2),VLOOKUP(I172,Feuil1!$F$10:$O$24,2))))))))))","v":{"$error":"#N/A"}},null,null,null,null,null,null,null,null,null,null,null,null,null,null,null,null,"OLY +",2017,null,{"$f":"IF(AQ172,VLOOKUP(AQ172,FEM!$AS$468:$AT$523,2))","v":4.4930000000000003}]
[null,null,null,null,null,null,null,null,null,null,null,null,null,null,null,null,null,null,null,null,null,null,null,null,{"$f":"IF(AND(H173<1936),VLOOKUP(I173,Feuil1!$F$10:$O$24,9),IF(AND(H173>=1942,H173<1947),VLOOKUP(I173,Feuil1!$F$10:$O$24,9),IF(AND(H173>=1947,H173<1952),VLOOKUP(I173,Feuil1!$F$10:$O$24,8),IF(AND(H173>=1952,H173<1957),VLOOKUP(I173,Feuil1!$F$10:$O$24,7),IF(AND(H173>=1957,H173<1962),VLOOKUP(I173,Feuil1!$F$10:$O$24,6),IF(AND(H173>=1962,H173<1967),VLOOKUP(I173,Feuil1!$F$10:$O$24,5),IF(AND(H173>=1967,H173<1972),VLOOKUP(I173,Feuil1!$F$10:$O$24,4),IF(AND(H173>=1972,H173<1977),VLOOKUP(I173,Feuil1!$F$10:$O$24,3),IF(AND(H173>=1977,H173<1982),VLOOKUP(I173,Feuil1!$F$10:$O$24,2),VLOOKUP(I173,Feuil1!$F$10:$O$24,2))))))))))","v":{"$error":"#N/A"}},null,null,null,null,null,null,null,null,null,null,null,null,null,null,null,null,"OLY +",2017,null,{"$f":"IF(AQ173,VLOOKUP(AQ173,FEM!$AS$468:$AT$523,2))","v":4.4930000000000003}]
[null,null,null,null,null,null,null,null,null,null,null,null,null,null,null,null,null,null,null,null,null,null,null,null,{"$f":"IF(AND(H174<1936),VLOOKUP(I174,Feuil1!$F$10:$O$24,9),IF(AND(H174>=1942,H174<1947),VLOOKUP(I174,Feuil1!$F$10:$O$24,9),IF(AND(H174>=1947,H174<1952),VLOOKUP(I174,Feuil1!$F$10:$O$24,8),IF(AND(H174>=1952,H174<1957),VLOOKUP(I174,Feuil1!$F$10:$O$24,7),IF(AND(H174>=1957,H174<1962),VLOOKUP(I174,Feuil1!$F$10:$O$24,6),IF(AND(H174>=1962,H174<1967),VLOOKUP(I174,Feuil1!$F$10:$O$24,5),IF(AND(H174>=1967,H174<1972),VLOOKUP(I174,Feuil1!$F$10:$O$24,4),IF(AND(H174>=1972,H174<1977),VLOOKUP(I174,Feuil1!$F$10:$O$24,3),IF(AND(H174>=1977,H174<1982),VLOOKUP(I174,Feuil1!$F$10:$O$24,2),VLOOKUP(I174,Feuil1!$F$10:$O$24,2))))))))))","v":{"$error":"#N/A"}},null,null,null,null,null,null,null,null,null,null,null,null,null,null,null,null,"OLY +",2017,null,{"$f":"IF(AQ174,VLOOKUP(AQ174,FEM!$AS$468:$AT$523,2))","v":4.4930000000000003}]
[null,null,null,null,null,null,null,null,null,null,null,null,null,null,null,null,null,null,null,null,null,null,null,null,{"$f":"IF(AND(H175<1936),VLOOKUP(I175,Feuil1!$F$10:$O$24,9),IF(AND(H175>=1942,H175<1947),VLOOKUP(I175,Feuil1!$F$10:$O$24,9),IF(AND(H175>=1947,H175<1952),VLOOKUP(I175,Feuil1!$F$10:$O$24,8),IF(AND(H175>=1952,H175<1957),VLOOKUP(I175,Feuil1!$F$10:$O$24,7),IF(AND(H175>=1957,H175<1962),VLOOKUP(I175,Feuil1!$F$10:$O$24,6),IF(AND(H175>=1962,H175<1967),VLOOKUP(I175,Feuil1!$F$10:$O$24,5),IF(AND(H175>=1967,H175<1972),VLOOKUP(I175,Feuil1!$F$10:$O$24,4),IF(AND(H175>=1972,H175<1977),VLOOKUP(I175,Feuil1!$F$10:$O$24,3),IF(AND(H175>=1977,H175<1982),VLOOKUP(I175,Feuil1!$F$10:$O$24,2),VLOOKUP(I175,Feuil1!$F$10:$O$24,2))))))))))","v":{"$error":"#N/A"}},null,null,null,null,null,null,null,null,null,null,null,null,null,null,null,null,"OLY +",2017,null,{"$f":"IF(AQ175,VLOOKUP(AQ175,FEM!$AS$468:$AT$523,2))","v":4.4930000000000003}]
[null,null,null,null,null,null,null,null,null,null,null,null,null,null,null,null,null,null,null,null,null,null,null,null,{"$f":"IF(AND(H176<1936),VLOOKUP(I176,Feuil1!$F$10:$O$24,9),IF(AND(H176>=1942,H176<1947),VLOOKUP(I176,Feuil1!$F$10:$O$24,9),IF(AND(H176>=1947,H176<1952),VLOOKUP(I176,Feuil1!$F$10:$O$24,8),IF(AND(H176>=1952,H176<1957),VLOOKUP(I176,Feuil1!$F$10:$O$24,7),IF(AND(H176>=1957,H176<1962),VLOOKUP(I176,Feuil1!$F$10:$O$24,6),IF(AND(H176>=1962,H176<1967),VLOOKUP(I176,Feuil1!$F$10:$O$24,5),IF(AND(H176>=1967,H176<1972),VLOOKUP(I176,Feuil1!$F$10:$O$24,4),IF(AND(H176>=1972,H176<1977),VLOOKUP(I176,Feuil1!$F$10:$O$24,3),IF(AND(H176>=1977,H176<1982),VLOOKUP(I176,Feuil1!$F$10:$O$24,2),VLOOKUP(I176,Feuil1!$F$10:$O$24,2))))))))))","v":{"$error":"#N/A"}},null,null,null,null,null,null,null,null,null,null,null,null,null,null,null,null,"OLY +",2017,null,{"$f":"IF(AQ176,VLOOKUP(AQ176,FEM!$AS$468:$AT$523,2))","v":4.4930000000000003}]
[null,null,null,null,null,null,null,null,null,null,null,null,null,null,null,null,null,null,null,null,null,null,null,null,{"$f":"IF(AND(H177<1936),VLOOKUP(I177,Feuil1!$F$10:$O$24,9),IF(AND(H177>=1942,H177<1947),VLOOKUP(I177,Feuil1!$F$10:$O$24,9),IF(AND(H177>=1947,H177<1952),VLOOKUP(I177,Feuil1!$F$10:$O$24,8),IF(AND(H177>=1952,H177<1957),VLOOKUP(I177,Feuil1!$F$10:$O$24,7),IF(AND(H177>=1957,H177<1962),VLOOKUP(I177,Feuil1!$F$10:$O$24,6),IF(AND(H177>=1962,H177<1967),VLOOKUP(I177,Feuil1!$F$10:$O$24,5),IF(AND(H177>=1967,H177<1972),VLOOKUP(I177,Feuil1!$F$10:$O$24,4),IF(AND(H177>=1972,H177<1977),VLOOKUP(I177,Feuil1!$F$10:$O$24,3),IF(AND(H177>=1977,H177<1982),VLOOKUP(I177,Feuil1!$F$10:$O$24,2),VLOOKUP(I177,Feuil1!$F$10:$O$24,2))))))))))","v":{"$error":"#N/A"}},null,null,null,null,null,null,null,null,null,null,null,null,null,null,null,null,"OLY +",2017,null,{"$f":"IF(AQ177,VLOOKUP(AQ177,FEM!$AS$468:$AT$523,2))","v":4.4930000000000003}]
[null,null,null,null,null,null,null,null,null,null,null,null,null,null,null,null,null,null,null,null,null,null,null,null,{"$f":"IF(AND(H178<1936),VLOOKUP(I178,Feuil1!$F$10:$O$24,9),IF(AND(H178>=1942,H178<1947),VLOOKUP(I178,Feuil1!$F$10:$O$24,9),IF(AND(H178>=1947,H178<1952),VLOOKUP(I178,Feuil1!$F$10:$O$24,8),IF(AND(H178>=1952,H178<1957),VLOOKUP(I178,Feuil1!$F$10:$O$24,7),IF(AND(H178>=1957,H178<1962),VLOOKUP(I178,Feuil1!$F$10:$O$24,6),IF(AND(H178>=1962,H178<1967),VLOOKUP(I178,Feuil1!$F$10:$O$24,5),IF(AND(H178>=1967,H178<1972),VLOOKUP(I178,Feuil1!$F$10:$O$24,4),IF(AND(H178>=1972,H178<1977),VLOOKUP(I178,Feuil1!$F$10:$O$24,3),IF(AND(H178>=1977,H178<1982),VLOOKUP(I178,Feuil1!$F$10:$O$24,2),VLOOKUP(I178,Feuil1!$F$10:$O$24,2))))))))))","v":{"$error":"#N/A"}},null,null,null,null,null,null,null,null,null,null,null,null,null,null,null,null,"OLY +",2017,null,{"$f":"IF(AQ178,VLOOKUP(AQ178,FEM!$AS$468:$AT$523,2))","v":4.4930000000000003}]
[null,null,null,null,null,null,null,null,null,null,null,null,null,null,null,null,null,null,null,null,null,null,null,null,{"$f":"IF(AND(H179<1936),VLOOKUP(I179,Feuil1!$F$10:$O$24,9),IF(AND(H179>=1942,H179<1947),VLOOKUP(I179,Feuil1!$F$10:$O$24,9),IF(AND(H179>=1947,H179<1952),VLOOKUP(I179,Feuil1!$F$10:$O$24,8),IF(AND(H179>=1952,H179<1957),VLOOKUP(I179,Feuil1!$F$10:$O$24,7),IF(AND(H179>=1957,H179<1962),VLOOKUP(I179,Feuil1!$F$10:$O$24,6),IF(AND(H179>=1962,H179<1967),VLOOKUP(I179,Feuil1!$F$10:$O$24,5),IF(AND(H179>=1967,H179<1972),VLOOKUP(I179,Feuil1!$F$10:$O$24,4),IF(AND(H179>=1972,H179<1977),VLOOKUP(I179,Feuil1!$F$10:$O$24,3),IF(AND(H179>=1977,H179<1982),VLOOKUP(I179,Feuil1!$F$10:$O$24,2),VLOOKUP(I179,Feuil1!$F$10:$O$24,2))))))))))","v":{"$error":"#N/A"}},null,null,null,null,null,null,null,null,null,null,null,null,null,null,null,null,"OLY +",2017,null,{"$f":"IF(AQ179,VLOOKUP(AQ179,FEM!$AS$468:$AT$523,2))","v":4.4930000000000003}]
[null,null,null,null,null,null,null,null,null,null,null,null,null,null,null,null,null,null,null,null,null,null,null,null,{"$f":"IF(AND(H180<1936),VLOOKUP(I180,Feuil1!$F$10:$O$24,9),IF(AND(H180>=1942,H180<1947),VLOOKUP(I180,Feuil1!$F$10:$O$24,9),IF(AND(H180>=1947,H180<1952),VLOOKUP(I180,Feuil1!$F$10:$O$24,8),IF(AND(H180>=1952,H180<1957),VLOOKUP(I180,Feuil1!$F$10:$O$24,7),IF(AND(H180>=1957,H180<1962),VLOOKUP(I180,Feuil1!$F$10:$O$24,6),IF(AND(H180>=1962,H180<1967),VLOOKUP(I180,Feuil1!$F$10:$O$24,5),IF(AND(H180>=1967,H180<1972),VLOOKUP(I180,Feuil1!$F$10:$O$24,4),IF(AND(H180>=1972,H180<1977),VLOOKUP(I180,Feuil1!$F$10:$O$24,3),IF(AND(H180>=1977,H180<1982),VLOOKUP(I180,Feuil1!$F$10:$O$24,2),VLOOKUP(I180,Feuil1!$F$10:$O$24,2))))))))))","v":{"$error":"#N/A"}},null,null,null,null,null,null,null,null,null,null,null,null,null,null,null,null,"OLY +",2017,null,{"$f":"IF(AQ180,VLOOKUP(AQ180,FEM!$AS$468:$AT$523,2))","v":4.4930000000000003}]
[null,null,null,null,null,null,null,null,null,null,null,null,null,null,null,null,null,null,null,null,null,null,null,null,{"$f":"IF(AND(H181<1936),VLOOKUP(I181,Feuil1!$F$10:$O$24,9),IF(AND(H181>=1942,H181<1947),VLOOKUP(I181,Feuil1!$F$10:$O$24,9),IF(AND(H181>=1947,H181<1952),VLOOKUP(I181,Feuil1!$F$10:$O$24,8),IF(AND(H181>=1952,H181<1957),VLOOKUP(I181,Feuil1!$F$10:$O$24,7),IF(AND(H181>=1957,H181<1962),VLOOKUP(I181,Feuil1!$F$10:$O$24,6),IF(AND(H181>=1962,H181<1967),VLOOKUP(I181,Feuil1!$F$10:$O$24,5),IF(AND(H181>=1967,H181<1972),VLOOKUP(I181,Feuil1!$F$10:$O$24,4),IF(AND(H181>=1972,H181<1977),VLOOKUP(I181,Feuil1!$F$10:$O$24,3),IF(AND(H181>=1977,H181<1982),VLOOKUP(I181,Feuil1!$F$10:$O$24,2),VLOOKUP(I181,Feuil1!$F$10:$O$24,2))))))))))","v":{"$error":"#N/A"}},null,null,null,null,null,null,null,null,null,null,null,null,null,null,null,null,"OLY +",2017,null,{"$f":"IF(AQ181,VLOOKUP(AQ181,FEM!$AS$468:$AT$523,2))","v":4.4930000000000003}]
[null,null,null,null,null,null,null,null,null,null,null,null,null,null,null,null,null,null,null,null,null,null,null,null,{"$f":"IF(AND(H182<1936),VLOOKUP(I182,Feuil1!$F$10:$O$24,9),IF(AND(H182>=1942,H182<1947),VLOOKUP(I182,Feuil1!$F$10:$O$24,9),IF(AND(H182>=1947,H182<1952),VLOOKUP(I182,Feuil1!$F$10:$O$24,8),IF(AND(H182>=1952,H182<1957),VLOOKUP(I182,Feuil1!$F$10:$O$24,7),IF(AND(H182>=1957,H182<1962),VLOOKUP(I182,Feuil1!$F$10:$O$24,6),IF(AND(H182>=1962,H182<1967),VLOOKUP(I182,Feuil1!$F$10:$O$24,5),IF(AND(H182>=1967,H182<1972),VLOOKUP(I182,Feuil1!$F$10:$O$24,4),IF(AND(H182>=1972,H182<1977),VLOOKUP(I182,Feuil1!$F$10:$O$24,3),IF(AND(H182>=1977,H182<1982),VLOOKUP(I182,Feuil1!$F$10:$O$24,2),VLOOKUP(I182,Feuil1!$F$10:$O$24,2))))))))))","v":{"$error":"#N/A"}},null,null,null,null,null,null,null,null,null,null,null,null,null,null,null,null,"OLY +",2017,null,{"$f":"IF(AQ182,VLOOKUP(AQ182,FEM!$AS$468:$AT$523,2))","v":4.4930000000000003}]
[null,null,null,null,null,null,null,null,null,null,null,null,null,null,null,null,null,null,null,null,null,null,null,null,{"$f":"IF(AND(H183<1936),VLOOKUP(I183,Feuil1!$F$10:$O$24,9),IF(AND(H183>=1942,H183<1947),VLOOKUP(I183,Feuil1!$F$10:$O$24,9),IF(AND(H183>=1947,H183<1952),VLOOKUP(I183,Feuil1!$F$10:$O$24,8),IF(AND(H183>=1952,H183<1957),VLOOKUP(I183,Feuil1!$F$10:$O$24,7),IF(AND(H183>=1957,H183<1962),VLOOKUP(I183,Feuil1!$F$10:$O$24,6),IF(AND(H183>=1962,H183<1967),VLOOKUP(I183,Feuil1!$F$10:$O$24,5),IF(AND(H183>=1967,H183<1972),VLOOKUP(I183,Feuil1!$F$10:$O$24,4),IF(AND(H183>=1972,H183<1977),VLOOKUP(I183,Feuil1!$F$10:$O$24,3),IF(AND(H183>=1977,H183<1982),VLOOKUP(I183,Feuil1!$F$10:$O$24,2),VLOOKUP(I183,Feuil1!$F$10:$O$24,2))))))))))","v":{"$error":"#N/A"}},null,null,null,null,null,null,null,null,null,null,null,null,null,null,null,null,"OLY +",2017,null,{"$f":"IF(AQ183,VLOOKUP(AQ183,FEM!$AS$468:$AT$523,2))","v":4.4930000000000003}]
[null,null,null,null,null,null,null,null,null,null,null,null,null,null,null,null,null,null,null,null,null,null,null,null,{"$f":"IF(AND(H184<1936),VLOOKUP(I184,Feuil1!$F$10:$O$24,9),IF(AND(H184>=1942,H184<1947),VLOOKUP(I184,Feuil1!$F$10:$O$24,9),IF(AND(H184>=1947,H184<1952),VLOOKUP(I184,Feuil1!$F$10:$O$24,8),IF(AND(H184>=1952,H184<1957),VLOOKUP(I184,Feuil1!$F$10:$O$24,7),IF(AND(H184>=1957,H184<1962),VLOOKUP(I184,Feuil1!$F$10:$O$24,6),IF(AND(H184>=1962,H184<1967),VLOOKUP(I184,Feuil1!$F$10:$O$24,5),IF(AND(H184>=1967,H184<1972),VLOOKUP(I184,Feuil1!$F$10:$O$24,4),IF(AND(H184>=1972,H184<1977),VLOOKUP(I184,Feuil1!$F$10:$O$24,3),IF(AND(H184>=1977,H184<1982),VLOOKUP(I184,Feuil1!$F$10:$O$24,2),VLOOKUP(I184,Feuil1!$F$10:$O$24,2))))))))))","v":{"$error":"#N/A"}},null,null,null,null,null,null,null,null,null,null,null,null,null,null,null,null,"OLY +",2017,null,{"$f":"IF(AQ184,VLOOKUP(AQ184,FEM!$AS$468:$AT$523,2))","v":4.4930000000000003}]
[null,null,null,null,null,null,null,null,null,null,null,null,null,null,null,null,null,null,null,null,null,null,null,null,{"$f":"IF(AND(H185<1936),VLOOKUP(I185,Feuil1!$F$10:$O$24,9),IF(AND(H185>=1942,H185<1947),VLOOKUP(I185,Feuil1!$F$10:$O$24,9),IF(AND(H185>=1947,H185<1952),VLOOKUP(I185,Feuil1!$F$10:$O$24,8),IF(AND(H185>=1952,H185<1957),VLOOKUP(I185,Feuil1!$F$10:$O$24,7),IF(AND(H185>=1957,H185<1962),VLOOKUP(I185,Feuil1!$F$10:$O$24,6),IF(AND(H185>=1962,H185<1967),VLOOKUP(I185,Feuil1!$F$10:$O$24,5),IF(AND(H185>=1967,H185<1972),VLOOKUP(I185,Feuil1!$F$10:$O$24,4),IF(AND(H185>=1972,H185<1977),VLOOKUP(I185,Feuil1!$F$10:$O$24,3),IF(AND(H185>=1977,H185<1982),VLOOKUP(I185,Feuil1!$F$10:$O$24,2),VLOOKUP(I185,Feuil1!$F$10:$O$24,2))))))))))","v":{"$error":"#N/A"}},null,null,null,null,null,null,null,null,null,null,null,null,null,null,null,null,"OLY +",2017,null,{"$f":"IF(AQ185,VLOOKUP(AQ185,FEM!$AS$468:$AT$523,2))","v":4.4930000000000003}]
[null,null,null,null,null,null,null,null,null,null,null,null,null,null,null,null,null,null,null,null,null,null,null,null,{"$f":"IF(AND(H186<1936),VLOOKUP(I186,Feuil1!$F$10:$O$24,9),IF(AND(H186>=1942,H186<1947),VLOOKUP(I186,Feuil1!$F$10:$O$24,9),IF(AND(H186>=1947,H186<1952),VLOOKUP(I186,Feuil1!$F$10:$O$24,8),IF(AND(H186>=1952,H186<1957),VLOOKUP(I186,Feuil1!$F$10:$O$24,7),IF(AND(H186>=1957,H186<1962),VLOOKUP(I186,Feuil1!$F$10:$O$24,6),IF(AND(H186>=1962,H186<1967),VLOOKUP(I186,Feuil1!$F$10:$O$24,5),IF(AND(H186>=1967,H186<1972),VLOOKUP(I186,Feuil1!$F$10:$O$24,4),IF(AND(H186>=1972,H186<1977),VLOOKUP(I186,Feuil1!$F$10:$O$24,3),IF(AND(H186>=1977,H186<1982),VLOOKUP(I186,Feuil1!$F$10:$O$24,2),VLOOKUP(I186,Feuil1!$F$10:$O$24,2))))))))))","v":{"$error":"#N/A"}},null,null,null,null,null,null,null,null,null,null,null,null,null,null,null,null,"OLY +",2017,null,{"$f":"IF(AQ186,VLOOKUP(AQ186,FEM!$AS$468:$AT$523,2))","v":4.4930000000000003}]
[null,null,null,null,null,null,null,null,null,null,null,null,null,null,null,null,null,null,null,null,null,null,null,null,{"$f":"IF(AND(H187<1936),VLOOKUP(I187,Feuil1!$F$10:$O$24,9),IF(AND(H187>=1942,H187<1947),VLOOKUP(I187,Feuil1!$F$10:$O$24,9),IF(AND(H187>=1947,H187<1952),VLOOKUP(I187,Feuil1!$F$10:$O$24,8),IF(AND(H187>=1952,H187<1957),VLOOKUP(I187,Feuil1!$F$10:$O$24,7),IF(AND(H187>=1957,H187<1962),VLOOKUP(I187,Feuil1!$F$10:$O$24,6),IF(AND(H187>=1962,H187<1967),VLOOKUP(I187,Feuil1!$F$10:$O$24,5),IF(AND(H187>=1967,H187<1972),VLOOKUP(I187,Feuil1!$F$10:$O$24,4),IF(AND(H187>=1972,H187<1977),VLOOKUP(I187,Feuil1!$F$10:$O$24,3),IF(AND(H187>=1977,H187<1982),VLOOKUP(I187,Feuil1!$F$10:$O$24,2),VLOOKUP(I187,Feuil1!$F$10:$O$24,2))))))))))","v":{"$error":"#N/A"}},null,null,null,null,null,null,null,null,null,null,null,null,null,null,null,null,"OLY +",2017,null,{"$f":"IF(AQ187,VLOOKUP(AQ187,FEM!$AS$468:$AT$523,2))","v":4.4930000000000003}]
[null,null,null,null,null,null,null,null,null,null,null,null,null,null,null,null,null,null,null,null,null,null,null,null,{"$f":"IF(AND(H188<1936),VLOOKUP(I188,Feuil1!$F$10:$O$24,9),IF(AND(H188>=1942,H188<1947),VLOOKUP(I188,Feuil1!$F$10:$O$24,9),IF(AND(H188>=1947,H188<1952),VLOOKUP(I188,Feuil1!$F$10:$O$24,8),IF(AND(H188>=1952,H188<1957),VLOOKUP(I188,Feuil1!$F$10:$O$24,7),IF(AND(H188>=1957,H188<1962),VLOOKUP(I188,Feuil1!$F$10:$O$24,6),IF(AND(H188>=1962,H188<1967),VLOOKUP(I188,Feuil1!$F$10:$O$24,5),IF(AND(H188>=1967,H188<1972),VLOOKUP(I188,Feuil1!$F$10:$O$24,4),IF(AND(H188>=1972,H188<1977),VLOOKUP(I188,Feuil1!$F$10:$O$24,3),IF(AND(H188>=1977,H188<1982),VLOOKUP(I188,Feuil1!$F$10:$O$24,2),VLOOKUP(I188,Feuil1!$F$10:$O$24,2))))))))))","v":{"$error":"#N/A"}},null,null,null,null,null,null,null,null,null,null,null,null,null,null,null,null,"OLY +",2017,null,{"$f":"IF(AQ188,VLOOKUP(AQ188,FEM!$AS$468:$AT$523,2))","v":4.4930000000000003}]
[null,null,null,null,null,null,null,null,null,null,null,null,null,null,null,null,null,null,null,null,null,null,null,null,null,null,null,null,null,null,null,null,null,null,null,null,null,null,null,null,null,"OLY +",2017,null,{"$f":"IF(AQ189,VLOOKUP(AQ189,FEM!$AS$468:$AT$523,2))","v":4.4930000000000003}]
[null,null,null,null,null,null,null,null,null,null,null,null,null,null,null,null,null,null,null,null,null,null,null,null,null,null,null,null,null,null,null,null,null,null,null,null,null,null,null,null,null,"OLY +",2017,null,{"$f":"IF(AQ190,VLOOKUP(AQ190,FEM!$AS$468:$AT$523,2))","v":4.4930000000000003}]
[null,null,null,null,null,null,null,null,null,null,null,null,null,null,null,null,null,null,null,null,null,null,null,null,null,null,null,null,null,null,null,null,null,null,null,null,null,null,null,null,null,"OLY +",2017,null,{"$f":"IF(AQ191,VLOOKUP(AQ191,FEM!$AS$468:$AT$523,2))","v":4.4930000000000003}]
[null,null,null,null,null,null,null,null,null,null,null,null,null,null,null,null,null,null,null,null,null,null,null,null,null,null,null,null,null,null,null,null,null,null,null,null,null,null,null,null,null,"OLY +",2017,null,{"$f":"IF(AQ192,VLOOKUP(AQ192,FEM!$AS$468:$AT$523,2))","v":4.4930000000000003}]
[null,null,null,null,null,null,null,null,null,null,null,null,null,null,null,null,null,null,null,null,null,null,null,null,null,null,null,null,null,null,null,null,null,null,null,null,null,null,null,null,null,"OLY +",2017,null,{"$f":"IF(AQ193,VLOOKUP(AQ193,FEM!$AS$468:$AT$523,2))","v":4.4930000000000003}]
[null,null,null,null,null,null,null,null,null,null,null,null,null,null,null,null,null,null,null,null,null,null,null,null,null,null,null,null,null,null,null,null,null,null,null,null,null,null,null,null,null,"OLY +",2017,null,{"$f":"IF(AQ194,VLOOKUP(AQ194,FEM!$AS$468:$AT$523,2))","v":4.4930000000000003}]
[null,null,null,null,null,null,null,null,null,null,null,null,null,null,null,null,null,null,null,null,null,null,null,null,null,null,null,null,null,null,null,null,null,null,null,null,null,null,null,null,null,"OLY +",2017,null,{"$f":"IF(AQ195,VLOOKUP(AQ195,FEM!$AS$468:$AT$523,2))","v":4.4930000000000003}]
[null,null,null,null,null,null,null,null,null,null,null,null,null,null,null,null,null,null,null,null,null,null,null,null,null,null,null,null,null,null,null,null,null,null,null,null,null,null,null,null,null,"OLY +",2017,null,{"$f":"IF(AQ196,VLOOKUP(AQ196,FEM!$AS$468:$AT$523,2))","v":4.4930000000000003}]
[null,null,null,null,null,null,null,null,null,null,null,null,null,null,null,null,null,null,null,null,null,null,null,null,null,null,null,null,null,null,null,null,null,null,null,null,null,null,null,null,null,"OLY +",2017,null,{"$f":"IF(AQ197,VLOOKUP(AQ197,FEM!$AS$468:$AT$523,2))","v":4.4930000000000003}]
[null,null,null,null,null,null,null,null,null,null,null,null,null,null,null,null,null,null,null,null,null,null,null,null,null,null,null,null,null,null,null,null,null,null,null,null,null,null,null,null,null,"OLY +",2017,null,{"$f":"IF(AQ198,VLOOKUP(AQ198,FEM!$AS$468:$AT$523,2))","v":4.4930000000000003}]
[null,null,null,null,null,null,null,null,null,null,null,null,null,null,null,null,null,null,null,null,null,null,null,null,null,null,null,null,null,null,null,null,null,null,null,null,null,null,null,null,null,"OLY +",2017,null,{"$f":"IF(AQ199,VLOOKUP(AQ199,FEM!$AS$468:$AT$523,2))","v":4.4930000000000003}]
[null,null,null,null,null,null,null,null,null,null,null,null,null,null,null,null,null,null,null,null,null,null,null,null,null,null,null,null,null,null,null,null,null,null,null,null,null,null,null,null,null,"OLY +",{"$f":"2017-H200","v":2017},null,{"$f":"IF(AQ200,VLOOKUP(AQ200,FEM!$AS$468:$AT$523,2))","v":4.4930000000000003}]
[null,null,null,null,null,null,null,null,null,null,null,null,null,null,null,null,null,null,null,null,null,null,null,null,null,null,null,null,null,null,null,null,null,null,null,null,null,null,null,null,null,"OLY +",2017,null,{"$f":"IF(AQ201,VLOOKUP(AQ201,FEM!$AS$468:$AT$523,2))","v":4.4930000000000003}]
[null,null,null,null,null,null,null,null,null,null,null,null,null,null,null,null,null,null,null,null,null,null,null,null,null,null,null,null,null,null,null,null,null,null,null,null,null,null,null,null,null,"OLY +",2017,null,{"$f":"IF(AQ202,VLOOKUP(AQ202,FEM!$AS$468:$AT$523,2))","v":4.4930000000000003}]
[null,null,null,null,null,null,null,null,null,null,null,null,null,null,null,null,null,null,null,null,null,null,null,null,null,null,null,null,null,null,null,null,null,null,null,null,null,null,null,null,null,"OLY +",2017,null,{"$f":"IF(AQ203,VLOOKUP(AQ203,FEM!$AS$468:$AT$523,2))","v":4.4930000000000003}]
[null,null,null,null,null,null,null,null,null,null,null,null,null,null,null,null,null,null,null,null,null,null,null,null,null,null,null,null,null,null,null,null,null,null,null,null,null,null,null,null,null,"OLY +",2017,null,{"$f":"IF(AQ204,VLOOKUP(AQ204,FEM!$AS$468:$AT$523,2))","v":4.4930000000000003}]
[null,null,null,null,null,null,null,null,null,null,null,null,null,null,null,null,null,null,null,null,null,null,null,null,null,null,null,null,null,null,null,null,null,null,null,null,null,null,null,null,null,"OLY +",2017,null,{"$f":"IF(AQ205,VLOOKUP(AQ205,FEM!$AS$468:$AT$523,2))","v":4.4930000000000003}]
[null,null,null,null,null,null,null,null,null,null,null,null,null,null,null,null,null,null,null,null,null,null,null,null,null,null,null,null,null,null,null,null,null,null,null,null,null,null,null,null,null,"OLY +",2017,null,{"$f":"IF(AQ206,VLOOKUP(AQ206,FEM!$AS$468:$AT$523,2))","v":4.4930000000000003}]
[null,null,null,null,null,null,null,null,null,null,null,null,null,null,null,null,null,null,null,null,null,null,null,null,null,null,null,null,null,null,null,null,null,null,null,null,null,null,null,null,null,"OLY +",2017,null,{"$f":"IF(AQ207,VLOOKUP(AQ207,FEM!$AS$468:$AT$523,2))","v":4.4930000000000003}]
[null,null,null,null,null,null,null,null,null,null,null,null,null,null,null,null,null,null,null,null,null,null,null,null,null,null,null,null,null,null,null,null,null,null,null,null,null,null,null,null,null,"OLY +",2017,null,{"$f":"IF(AQ208,VLOOKUP(AQ208,FEM!$AS$468:$AT$523,2))","v":4.4930000000000003}]
[null,null,null,null,null,null,null,null,null,null,null,null,null,null,null,null,null,null,null,null,null,null,null,null,null,null,null,null,null,null,null,null,null,null,null,null,null,null,null,null,null,"OLY +",2017,null,{"$f":"IF(AQ209,VLOOKUP(AQ209,FEM!$AS$468:$AT$523,2))","v":4.4930000000000003}]
[null,null,null,null,null,null,null,null,null,null,null,null,null,null,null,null,null,null,null,null,null,null,null,null,null,null,null,null,null,null,null,null,null,null,null,null,null,null,null,null,null,"OLY +",2017,null,{"$f":"IF(AQ210,VLOOKUP(AQ210,FEM!$AS$468:$AT$523,2))","v":4.4930000000000003}]
[null,null,null,null,null,null,null,null,null,null,null,null,null,null,null,null,null,null,null,null,null,null,null,null,null,null,null,null,null,null,null,null,null,null,null,null,null,null,null,null,null,"OLY +",2017,null,{"$f":"IF(AQ211,VLOOKUP(AQ211,FEM!$AS$468:$AT$523,2))","v":4.4930000000000003}]
[null,null,null,null,null,null,null,null,null,null,null,null,null,null,null,null,null,null,null,null,null,null,null,null,null,null,null,null,null,null,null,null,null,null,null,null,null,null,null,null,null,"OLY +",2017,null,{"$f":"IF(AQ212,VLOOKUP(AQ212,FEM!$AS$468:$AT$523,2))","v":4.4930000000000003}]
[null,null,null,null,null,null,null,null,null,null,null,null,null,null,null,null,null,null,null,null,null,null,null,null,null,null,null,null,null,null,null,null,null,null,null,null,null,null,null,null,null,"OLY +",2017,null,{"$f":"IF(AQ213,VLOOKUP(AQ213,FEM!$AS$468:$AT$523,2))","v":4.4930000000000003}]
[null,null,null,null,null,null,null,null,null,null,null,null,null,null,null,null,null,null,null,null,null,null,null,null,null,null,null,null,null,null,null,null,null,null,null,null,null,null,null,null,null,"OLY +",2017,null,{"$f":"IF(AQ214,VLOOKUP(AQ214,FEM!$AS$468:$AT$523,2))","v":4.4930000000000003}]
[null,null,null,null,null,null,null,null,null,null,null,null,null,null,null,null,null,null,null,null,null,null,null,null,null,null,null,null,null,null,null,null,null,null,null,null,null,null,null,null,null,"OLY +",2017,null,{"$f":"IF(AQ215,VLOOKUP(AQ215,FEM!$AS$468:$AT$523,2))","v":4.4930000000000003}]
[null,null,null,null,null,null,null,null,null,null,null,null,null,null,null,null,null,null,null,null,null,null,null,null,null,null,null,null,null,null,null,null,null,null,null,null,null,null,null,null,null,"OLY +",2017,null,{"$f":"IF(AQ216,VLOOKUP(AQ216,FEM!$AS$468:$AT$523,2))","v":4.4930000000000003}]
[null,null,null,null,null,null,null,null,null,null,null,null,null,null,null,null,null,null,null,null,null,null,null,null,null,null,null,null,null,null,null,null,null,null,null,null,null,null,null,null,null,"OLY +",2017,null,{"$f":"IF(AQ217,VLOOKUP(AQ217,FEM!$AS$468:$AT$523,2))","v":4.4930000000000003}]
[null,null,null,null,null,null,null,null,null,null,null,null,null,null,null,null,null,null,null,null,null,null,null,null,null,null,null,null,null,null,null,null,null,null,null,null,null,null,null,null,null,"OLY +",2017,null,{"$f":"IF(AQ218,VLOOKUP(AQ218,FEM!$AS$468:$AT$523,2))","v":4.4930000000000003}]
[null,null,null,null,null,null,null,null,null,null,null,null,null,null,null,null,null,null,null,null,null,null,null,null,null,null,null,null,null,null,null,null,null,null,null,null,null,null,null,null,null,"OLY +",2017,null,{"$f":"IF(AQ219,VLOOKUP(AQ219,FEM!$AS$468:$AT$523,2))","v":4.4930000000000003}]
[null,null,null,null,null,null,null,null,null,null,null,null,null,null,null,null,null,null,null,null,null,null,null,null,null,null,null,null,null,null,null,null,null,null,null,null,null,null,null,null,null,"OLY +",2017,null,{"$f":"IF(AQ220,VLOOKUP(AQ220,FEM!$AS$468:$AT$523,2))","v":4.4930000000000003}]
[null,null,null,null,null,null,null,null,null,null,null,null,null,null,null,null,null,null,null,null,null,null,null,null,null,null,null,null,null,null,null,null,null,null,null,null,null,null,null,null,null,"OLY +",2017,null,{"$f":"IF(AQ221,VLOOKUP(AQ221,FEM!$AS$468:$AT$523,2))","v":4.4930000000000003}]
[null,null,null,null,null,null,null,null,null,null,null,null,null,null,null,null,null,null,null,null,null,null,null,null,null,null,null,null,null,null,null,null,null,null,null,null,null,null,null,null,null,"OLY +",2017,null,{"$f":"IF(AQ222,VLOOKUP(AQ222,FEM!$AS$468:$AT$523,2))","v":4.4930000000000003}]
[null,null,null,null,null,null,null,null,null,null,null,null,null,null,null,null,null,null,null,null,null,null,null,null,null,null,null,null,null,null,null,null,null,null,null,null,null,null,null,null,null,"OLY +",2017,null,{"$f":"IF(AQ223,VLOOKUP(AQ223,FEM!$AS$468:$AT$523,2))","v":4.4930000000000003}]
[null,null,null,null,null,null,null,null,null,null,null,null,null,null,null,null,null,null,null,null,null,null,null,null,null,null,null,null,null,null,null,null,null,null,null,null,null,null,null,null,null,"OLY +",2017,null,{"$f":"IF(AQ224,VLOOKUP(AQ224,FEM!$AS$468:$AT$523,2))","v":4.4930000000000003}]
[null,null,null,null,null,null,null,null,null,null,null,null,null,null,null,null,null,null,null,null,null,null,null,null,null,null,null,null,null,null,null,null,null,null,null,null,null,null,null,null,null,"OLY +",2017,null,{"$f":"IF(AQ225,VLOOKUP(AQ225,FEM!$AS$468:$AT$523,2))","v":4.4930000000000003}]
[null,null,null,null,null,null,null,null,null,null,null,null,null,null,null,null,null,null,null,null,null,null,null,null,null,null,null,null,null,null,null,null,null,null,null,null,null,null,null,null,null,"OLY +",2017,null,{"$f":"IF(AQ226,VLOOKUP(AQ226,FEM!$AS$468:$AT$523,2))","v":4.4930000000000003}]
[null,null,null,null,null,null,null,null,null,null,null,null,null,null,null,null,null,null,null,null,null,null,null,null,null,null,null,null,null,null,null,null,null,null,null,null,null,null,null,null,null,"OLY +",2017,null,{"$f":"IF(AQ227,VLOOKUP(AQ227,FEM!$AS$468:$AT$523,2))","v":4.4930000000000003}]
[null,null,null,null,null,null,null,null,null,null,null,null,null,null,null,null,null,null,null,null,null,null,null,null,null,null,null,null,null,null,null,null,null,null,null,null,null,null,null,null,null,"OLY +",2017,null,{"$f":"IF(AQ228,VLOOKUP(AQ228,FEM!$AS$468:$AT$523,2))","v":4.4930000000000003}]
[null,null,null,null,null,null,null,null,null,null,null,null,null,null,null,null,null,null,null,null,null,null,null,null,null,null,null,null,null,null,null,null,null,null,null,null,null,null,null,null,null,"OLY +",2017,null,{"$f":"IF(AQ229,VLOOKUP(AQ229,FEM!$AS$468:$AT$523,2))","v":4.4930000000000003}]
[null,null,null,null,null,null,null,null,null,null,null,null,null,null,null,null,null,null,null,null,null,null,null,null,null,null,null,null,null,null,null,null,null,null,null,null,null,null,null,null,null,"OLY +",2017,null,{"$f":"IF(AQ230,VLOOKUP(AQ230,FEM!$AS$468:$AT$523,2))","v":4.4930000000000003}]
[null,null,null,null,null,null,null,null,null,null,null,null,null,null,null,null,null,null,null,null,null,null,null,null,null,null,null,null,null,null,null,null,null,null,null,null,null,null,null,null,null,"OLY +",2017,null,{"$f":"IF(AQ231,VLOOKUP(AQ231,FEM!$AS$468:$AT$523,2))","v":4.4930000000000003}]
[null,null,null,null,null,null,null,null,null,null,null,null,null,null,null,null,null,null,null,null,null,null,null,null,null,null,null,null,null,null,null,null,null,null,null,null,null,null,null,null,null,"OLY +",2017,null,{"$f":"IF(AQ232,VLOOKUP(AQ232,FEM!$AS$468:$AT$523,2))","v":4.4930000000000003}]
[null,null,null,null,null,null,null,null,null,null,null,null,null,null,null,null,null,null,null,null,null,null,null,null,null,null,null,null,null,null,null,null,null,null,null,null,null,null,null,null,null,"OLY +",2017,null,{"$f":"IF(AQ233,VLOOKUP(AQ233,FEM!$AS$468:$AT$523,2))","v":4.4930000000000003}]
[null,null,null,null,null,null,null,null,null,null,null,null,null,null,null,null,null,null,null,null,null,null,null,null,null,null,null,null,null,null,null,null,null,null,null,null,null,null,null,null,null,{"$f":"IF(AH234>=0,$AH$5,IF(AG234>=0,$AG$5,IF(AF234>=0,$AF$5,IF(AE234>=0,$AE$5,IF(AD234>=0,$AD$5,IF(AC234>=0,$AC$5,IF(AB234>=0,$AB$5,IF(AA234>=0,$AA$5,$AI$5))))))))","v":"OLY +"},2017,null,{"$f":"IF(AQ234,VLOOKUP(AQ234,FEM!$AS$468:$AT$523,2))","v":4.4930000000000003}]
[null,null,null,null,null,null,null,null,null,null,null,null,null,null,null,null,null,null,null,null,null,null,null,null,null,null,null,null,null,null,null,null,null,null,null,null,null,null,null,null,null,"OLY +",2017,null,{"$f":"IF(AQ235,VLOOKUP(AQ235,FEM!$AS$468:$AT$523,2))","v":4.4930000000000003}]
[null,null,null,null,null,null,null,null,null,null,null,null,null,null,null,null,null,null,null,null,null,null,null,null,null,null,null,null,null,null,null,null,null,null,null,null,null,null,null,null,null,"OLY +",2017,null,{"$f":"IF(AQ236,VLOOKUP(AQ236,FEM!$AS$468:$AT$523,2))","v":4.4930000000000003}]
[null,null,null,null,null,null,null,null,null,null,null,null,null,null,null,null,null,null,null,null,null,null,null,null,null,null,null,null,null,null,null,null,null,null,null,null,null,null,null,null,null,"OLY +",2017,null,{"$f":"IF(AQ237,VLOOKUP(AQ237,FEM!$AS$468:$AT$523,2))","v":4.4930000000000003}]
[null,null,null,null,null,null,null,null,null,null,null,null,null,null,null,null,null,null,null,null,null,null,null,null,null,null,null,null,null,null,null,null,null,null,null,null,null,null,null,null,null,"OLY +",2017,null,{"$f":"IF(AQ238,VLOOKUP(AQ238,FEM!$AS$468:$AT$523,2))","v":4.4930000000000003}]
[null,null,null,null,null,null,null,null,null,null,null,null,null,null,null,null,null,null,null,null,null,null,null,null,null,null,null,null,null,null,null,null,null,null,null,null,null,null,null,null,null,"OLY +",2017,null,{"$f":"IF(AQ239,VLOOKUP(AQ239,FEM!$AS$468:$AT$523,2))","v":4.4930000000000003}]
[null,null,null,null,null,null,null,null,null,null,null,null,null,null,null,null,null,null,null,null,null,null,null,null,null,null,null,null,null,null,null,null,null,null,null,null,null,null,null,null,null,"OLY +",2017,null,{"$f":"IF(AQ240,VLOOKUP(AQ240,FEM!$AS$468:$AT$523,2))","v":4.4930000000000003}]
[null,null,null,null,null,null,null,null,null,null,null,null,null,null,null,null,null,null,null,null,null,null,null,null,null,null,null,null,null,null,null,null,null,null,null,null,null,null,null,null,null,"OLY +",2017,null,{"$f":"IF(AQ241,VLOOKUP(AQ241,FEM!$AS$468:$AT$523,2))","v":4.4930000000000003}]
[null,null,null,null,null,null,null,null,null,null,null,null,null,null,null,null,null,null,null,null,null,null,null,null,null,null,null,null,null,null,null,null,null,null,null,null,null,null,null,null,null,"OLY +",2017,null,{"$f":"IF(AQ242,VLOOKUP(AQ242,FEM!$AS$468:$AT$523,2))","v":4.4930000000000003}]
[null,null,null,null,null,null,null,null,null,null,null,null,null,null,null,null,null,null,null,null,null,null,null,null,null,null,null,null,null,null,null,null,null,null,null,null,null,null,null,null,null,"OLY +",2017,null,{"$f":"IF(AQ243,VLOOKUP(AQ243,FEM!$AS$468:$AT$523,2))","v":4.4930000000000003}]
[null,null,null,null,null,null,null,null,null,null,null,null,null,null,null,null,null,null,null,null,null,null,null,null,null,null,null,null,null,null,null,null,null,null,null,null,null,null,null,null,null,"OLY +",2017,null,{"$f":"IF(AQ244,VLOOKUP(AQ244,FEM!$AS$468:$AT$523,2))","v":4.4930000000000003}]
[null,null,null,null,null,null,null,null,null,null,null,null,null,null,null,null,null,null,null,null,null,null,null,null,null,null,null,null,null,null,null,null,null,null,null,null,null,null,null,null,null,"OLY +",2017,null,{"$f":"IF(AQ245,VLOOKUP(AQ245,FEM!$AS$468:$AT$523,2))","v":4.4930000000000003}]
[null,null,null,null,null,null,null,null,null,null,null,null,null,null,null,null,null,null,null,null,null,null,null,null,null,null,null,null,null,null,null,null,null,null,null,null,null,null,null,null,null,"OLY +",2017,null,{"$f":"IF(AQ246,VLOOKUP(AQ246,FEM!$AS$468:$AT$523,2))","v":4.4930000000000003}]
[null,null,null,null,null,null,null,null,null,null,null,null,null,null,null,null,null,null,null,null,null,null,null,null,null,null,null,null,null,null,null,null,null,null,null,null,null,null,null,null,null,"OLY +",2017,null,{"$f":"IF(AQ247,VLOOKUP(AQ247,FEM!$AS$468:$AT$523,2))","v":4.4930000000000003}]
[null,null,null,null,null,null,null,null,null,null,null,null,null,null,null,null,null,null,null,null,null,null,null,null,null,null,null,null,null,null,null,null,null,null,null,null,null,null,null,null,null,"OLY +",2017,null,{"$f":"IF(AQ248,VLOOKUP(AQ248,FEM!$AS$468:$AT$523,2))","v":4.4930000000000003}]
[null,null,null,null,null,null,null,null,null,null,null,null,null,null,null,null,null,null,null,null,null,null,null,null,null,null,null,null,null,null,null,null,null,null,null,null,null,null,null,null,null,"OLY +",2017,null,{"$f":"IF(AQ249,VLOOKUP(AQ249,FEM!$AS$468:$AT$523,2))","v":4.4930000000000003}]
[null,null,null,null,null,null,null,null,null,null,null,null,null,null,null,null,null,null,null,null,null,null,null,null,null,null,null,null,null,null,null,null,null,null,null,null,null,null,null,null,null,"OLY +",2017,null,{"$f":"IF(AQ250,VLOOKUP(AQ250,FEM!$AS$468:$AT$523,2))","v":4.4930000000000003}]
[null,null,null,null,null,null,null,null,null,null,null,null,null,null,null,null,null,null,null,null,null,null,null,null,null,null,null,null,null,null,null,null,null,null,null,null,null,null,null,null,null,"OLY +",2017,null,{"$f":"IF(AQ251,VLOOKUP(AQ251,FEM!$AS$468:$AT$523,2))","v":4.4930000000000003}]
[null,null,null,null,null,null,null,null,null,null,null,null,null,null,null,null,null,null,null,null,null,null,null,null,null,null,null,null,null,null,null,null,null,null,null,null,null,null,null,null,null,"OLY +",2017,null,{"$f":"IF(AQ252,VLOOKUP(AQ252,FEM!$AS$468:$AT$523,2))","v":4.4930000000000003}]
[null,null,null,null,null,null,null,null,null,null,null,null,null,null,null,null,null,null,null,null,null,null,null,null,null,null,null,null,null,null,null,null,null,null,null,null,null,null,null,null,null,"OLY +",2017,null,{"$f":"IF(AQ253,VLOOKUP(AQ253,FEM!$AS$468:$AT$523,2))","v":4.4930000000000003}]
[null,null,null,null,null,null,null,null,null,null,null,null,null,null,null,null,null,null,null,null,null,null,null,null,null,null,null,null,null,null,null,null,null,null,null,null,null,null,null,null,null,"OLY +",2017,null,{"$f":"IF(AQ254,VLOOKUP(AQ254,FEM!$AS$468:$AT$523,2))","v":4.4930000000000003}]
[null,null,null,null,null,null,null,null,null,null,null,null,null,null,null,null,null,null,null,null,null,null,null,null,null,null,null,null,null,null,null,null,null,null,null,null,null,null,null,null,null,"OLY +",2017,null,{"$f":"IF(AQ255,VLOOKUP(AQ255,FEM!$AS$468:$AT$523,2))","v":4.4930000000000003}]
[null,null,null,null,null,null,null,null,null,null,null,null,null,null,null,null,null,null,null,null,null,null,null,null,null,null,null,null,null,null,null,null,null,null,null,null,null,null,null,null,null,"OLY +",2017,null,{"$f":"IF(AQ256,VLOOKUP(AQ256,FEM!$AS$468:$AT$523,2))","v":4.4930000000000003}]
[null,null,null,null,null,null,null,null,null,null,null,null,null,null,null,null,null,null,null,null,null,null,null,null,null,null,null,null,null,null,null,null,null,null,null,null,null,null,null,null,null,"OLY +",2017,null,{"$f":"IF(AQ257,VLOOKUP(AQ257,FEM!$AS$468:$AT$523,2))","v":4.4930000000000003}]
[null,null,null,null,null,null,null,null,null,null,null,null,null,null,null,null,null,null,null,null,null,null,null,null,null,null,null,null,null,null,null,null,null,null,null,null,null,null,null,null,null,"OLY +",2017,null,{"$f":"IF(AQ258,VLOOKUP(AQ258,FEM!$AS$468:$AT$523,2))","v":4.4930000000000003}]
[null,null,null,null,null,null,null,null,null,null,null,null,null,null,null,null,null,null,null,null,null,null,null,null,null,null,null,null,null,null,null,null,null,null,null,null,null,null,null,null,null,"OLY +",2017,null,{"$f":"IF(AQ259,VLOOKUP(AQ259,FEM!$AS$468:$AT$523,2))","v":4.4930000000000003}]
[null,null,null,null,null,null,null,null,null,null,null,null,null,null,null,null,null,null,null,null,null,null,null,null,null,null,null,null,null,null,null,null,null,null,null,null,null,null,null,null,null,"OLY +",2017,null,{"$f":"IF(AQ260,VLOOKUP(AQ260,FEM!$AS$468:$AT$523,2))","v":4.4930000000000003}]
[null,null,null,null,null,null,null,null,null,null,null,null,null,null,null,null,null,null,null,null,null,null,null,null,null,null,null,null,null,null,null,null,null,null,null,null,null,null,null,null,null,"OLY +",2017,null,{"$f":"IF(AQ261,VLOOKUP(AQ261,FEM!$AS$468:$AT$523,2))","v":4.4930000000000003}]
[null,null,null,null,null,null,null,null,null,null,null,null,null,null,null,null,null,null,null,null,null,null,null,null,null,null,null,null,null,null,null,null,null,null,null,null,null,null,null,null,null,"OLY +",2017,null,{"$f":"IF(AQ262,VLOOKUP(AQ262,FEM!$AS$468:$AT$523,2))","v":4.4930000000000003}]
[null,null,null,null,null,null,null,null,null,null,null,null,null,null,null,null,null,null,null,null,null,null,null,null,null,null,null,null,null,null,null,null,null,null,null,null,null,null,null,null,null,"OLY +",2017,null,{"$f":"IF(AQ263,VLOOKUP(AQ263,FEM!$AS$468:$AT$523,2))","v":4.4930000000000003}]
[null,null,null,null,null,null,null,null,null,null,null,null,null,null,null,null,null,null,null,null,null,null,null,null,null,null,null,null,null,null,null,null,null,null,null,null,null,null,null,null,null,"OLY +",{"$f":"2017-H264","v":2017},null,{"$f":"IF(AQ264,VLOOKUP(AQ264,FEM!$AS$468:$AT$523,2))","v":4.4930000000000003}]
[null,null,null,null,null,null,null,null,null,null,null,null,null,null,null,null,null,null,null,null,null,null,null,null,null,null,null,null,null,null,null,null,null,null,null,null,null,null,null,null,null,"OLY +",2017,null,{"$f":"IF(AQ265,VLOOKUP(AQ265,FEM!$AS$468:$AT$523,2))","v":4.4930000000000003}]
[null,null,null,null,null,null,null,null,null,null,null,null,null,null,null,null,null,null,null,null,null,null,null,null,null,null,null,null,null,null,null,null,null,null,null,null,null,null,null,null,null,"OLY +",2017,null,{"$f":"IF(AQ266,VLOOKUP(AQ266,FEM!$AS$468:$AT$523,2))","v":4.4930000000000003}]
[null,null,null,null,null,null,null,null,null,null,null,null,null,null,null,null,null,null,null,null,null,null,null,null,null,null,null,null,null,null,null,null,null,null,null,null,null,null,null,null,null,"OLY +",2017,null,{"$f":"IF(AQ267,VLOOKUP(AQ267,FEM!$AS$468:$AT$523,2))","v":4.4930000000000003}]
[null,null,null,null,null,null,null,null,null,null,null,null,null,null,null,null,null,null,null,null,null,null,null,null,null,null,null,null,null,null,null,null,null,null,null,null,null,null,null,null,null,"OLY +",2017,null,{"$f":"IF(AQ268,VLOOKUP(AQ268,FEM!$AS$468:$AT$523,2))","v":4.4930000000000003}]
[null,null,null,null,null,null,null,null,null,null,null,null,null,null,null,null,null,null,null,null,null,null,null,null,null,null,null,null,null,null,null,null,null,null,null,null,null,null,null,null,null,"OLY +",2017,null,{"$f":"IF(AQ269,VLOOKUP(AQ269,FEM!$AS$468:$AT$523,2))","v":4.4930000000000003}]
[null,null,null,null,null,null,null,null,null,null,null,null,null,null,null,null,null,null,null,null,null,null,null,null,null,null,null,null,null,null,null,null,null,null,null,null,null,null,null,null,null,"OLY +",2017,null,{"$f":"IF(AQ270,VLOOKUP(AQ270,FEM!$AS$468:$AT$523,2))","v":4.4930000000000003}]
[null,null,null,null,null,null,null,null,null,null,null,null,null,null,null,null,null,null,null,null,null,null,null,null,null,null,null,null,null,null,null,null,null,null,null,null,null,null,null,null,null,"OLY +",2017,null,{"$f":"IF(AQ271,VLOOKUP(AQ271,FEM!$AS$468:$AT$523,2))","v":4.4930000000000003}]
[null,null,null,null,null,null,null,null,null,null,null,null,null,null,null,null,null,null,null,null,null,null,null,null,null,null,null,null,null,null,null,null,null,null,null,null,null,null,null,null,null,"OLY +",2017,null,{"$f":"IF(AQ272,VLOOKUP(AQ272,FEM!$AS$468:$AT$523,2))","v":4.4930000000000003}]
[null,null,null,null,null,null,null,null,null,null,null,null,null,null,null,null,null,null,null,null,null,null,null,null,null,null,null,null,null,null,null,null,null,null,null,null,null,null,null,null,null,"OLY +",2017,null,{"$f":"IF(AQ273,VLOOKUP(AQ273,FEM!$AS$468:$AT$523,2))","v":4.4930000000000003}]
[null,null,null,null,null,null,null,null,null,null,null,null,null,null,null,null,null,null,null,null,null,null,null,null,null,null,null,null,null,null,null,null,null,null,null,null,null,null,null,null,null,"OLY +",2017,null,{"$f":"IF(AQ274,VLOOKUP(AQ274,FEM!$AS$468:$AT$523,2))","v":4.4930000000000003}]
[null,null,null,null,null,null,null,null,null,null,null,null,null,null,null,null,null,null,null,null,null,null,null,null,null,null,null,null,null,null,null,null,null,null,null,null,null,null,null,null,null,"OLY +",2017,null,{"$f":"IF(AQ275,VLOOKUP(AQ275,FEM!$AS$468:$AT$523,2))","v":4.4930000000000003}]
[null,null,null,null,null,null,null,null,null,null,null,null,null,null,null,null,null,null,null,null,null,null,null,null,null,null,null,null,null,null,null,null,null,null,null,null,null,null,null,null,null,"OLY +",2017,null,{"$f":"IF(AQ276,VLOOKUP(AQ276,FEM!$AS$468:$AT$523,2))","v":4.4930000000000003}]
[null,null,null,null,null,null,null,null,null,null,null,null,null,null,null,null,null,null,null,null,null,null,null,null,null,null,null,null,null,null,null,null,null,null,null,null,null,null,null,null,null,"OLY +",2017,null,{"$f":"IF(AQ277,VLOOKUP(AQ277,FEM!$AS$468:$AT$523,2))","v":4.4930000000000003}]
[null,null,null,null,null,null,null,null,null,null,null,null,null,null,null,null,null,null,null,null,null,null,null,null,null,null,null,null,null,null,null,null,null,null,null,null,null,null,null,null,null,"OLY +",2017,null,{"$f":"IF(AQ278,VLOOKUP(AQ278,FEM!$AS$468:$AT$523,2))","v":4.4930000000000003}]
[null,null,null,null,null,null,null,null,null,null,null,null,null,null,null,null,null,null,null,null,null,null,null,null,null,null,null,null,null,null,null,null,null,null,null,null,null,null,null,null,null,"OLY +",2017,null,{"$f":"IF(AQ279,VLOOKUP(AQ279,FEM!$AS$468:$AT$523,2))","v":4.4930000000000003}]
[null,null,null,null,null,null,null,null,null,null,null,null,null,null,null,null,null,null,null,null,null,null,null,null,null,null,null,null,null,null,null,null,null,null,null,null,null,null,null,null,null,"OLY +",2017,null,{"$f":"IF(AQ280,VLOOKUP(AQ280,FEM!$AS$468:$AT$523,2))","v":4.4930000000000003}]
[null,null,null,null,null,null,null,null,null,null,null,null,null,null,null,null,null,null,null,null,null,null,null,null,null,null,null,null,null,null,null,null,null,null,null,null,null,null,null,null,null,"OLY +",2017,null,{"$f":"IF(AQ281,VLOOKUP(AQ281,FEM!$AS$468:$AT$523,2))","v":4.4930000000000003}]
[null,null,null,null,null,null,null,null,null,null,null,null,null,null,null,null,null,null,null,null,null,null,null,null,null,null,null,null,null,null,null,null,null,null,null,null,null,null,null,null,null,"OLY +",2017,null,{"$f":"IF(AQ282,VLOOKUP(AQ282,FEM!$AS$468:$AT$523,2))","v":4.4930000000000003}]
[null,null,null,null,null,null,null,null,null,null,null,null,null,null,null,null,null,null,null,null,null,null,null,null,null,null,null,null,null,null,null,null,null,null,null,null,null,null,null,null,null,"OLY +",2017,null,{"$f":"IF(AQ283,VLOOKUP(AQ283,FEM!$AS$468:$AT$523,2))","v":4.4930000000000003}]
[null,null,null,null,null,null,null,null,null,null,null,null,null,null,null,null,null,null,null,null,null,null,null,null,null,null,null,null,null,null,null,null,null,null,null,null,null,null,null,null,null,"OLY +",2017,null,{"$f":"IF(AQ284,VLOOKUP(AQ284,FEM!$AS$468:$AT$523,2))","v":4.4930000000000003}]
[null,null,null,null,null,null,null,null,null,null,null,null,null,null,null,null,null,null,null,null,null,null,null,null,null,null,null,null,null,null,null,null,null,null,null,null,null,null,null,null,null,"OLY +",2017,null,{"$f":"IF(AQ285,VLOOKUP(AQ285,FEM!$AS$468:$AT$523,2))","v":4.4930000000000003}]
[null,null,null,null,null,null,null,null,null,null,null,null,null,null,null,null,null,null,null,null,null,null,null,null,null,null,null,null,null,null,null,null,null,null,null,null,null,null,null,null,null,"OLY +",2017,null,{"$f":"IF(AQ286,VLOOKUP(AQ286,FEM!$AS$468:$AT$523,2))","v":4.4930000000000003}]
[null,null,null,null,null,null,null,null,null,null,null,null,null,null,null,null,null,null,null,null,null,null,null,null,null,null,null,null,null,null,null,null,null,null,null,null,null,null,null,null,null,"OLY +",2017,null,{"$f":"IF(AQ287,VLOOKUP(AQ287,FEM!$AS$468:$AT$523,2))","v":4.4930000000000003}]
[null,null,null,null,null,null,null,null,null,null,null,null,null,null,null,null,null,null,null,null,null,null,null,null,null,null,null,null,null,null,null,null,null,null,null,null,null,null,null,null,null,"OLY +",2017,null,{"$f":"IF(AQ288,VLOOKUP(AQ288,FEM!$AS$468:$AT$523,2))","v":4.4930000000000003}]
[null,null,null,null,null,null,null,null,null,null,null,null,null,null,null,null,null,null,null,null,null,null,null,null,null,null,null,null,null,null,null,null,null,null,null,null,null,null,null,null,null,"OLY +",2017,null,{"$f":"IF(AQ289,VLOOKUP(AQ289,FEM!$AS$468:$AT$523,2))","v":4.4930000000000003}]
[null,null,null,null,null,null,null,null,null,null,null,null,null,null,null,null,null,null,null,null,null,null,null,null,null,null,null,null,null,null,null,null,null,null,null,null,null,null,null,null,null,"OLY +",2017,null,{"$f":"IF(AQ290,VLOOKUP(AQ290,FEM!$AS$468:$AT$523,2))","v":4.4930000000000003}]
[null,null,null,null,null,null,null,null,null,null,null,null,null,null,null,null,null,null,null,null,null,null,null,null,null,null,null,null,null,null,null,null,null,null,null,null,null,null,null,null,null,"OLY +",2017,null,{"$f":"IF(AQ291,VLOOKUP(AQ291,FEM!$AS$468:$AT$523,2))","v":4.4930000000000003}]
[null,null,null,null,null,null,null,null,null,null,null,null,null,null,null,null,null,null,null,null,null,null,null,null,null,null,null,null,null,null,null,null,null,null,null,null,null,null,null,null,null,"OLY +",2017,null,{"$f":"IF(AQ292,VLOOKUP(AQ292,FEM!$AS$468:$AT$523,2))","v":4.4930000000000003}]
[null,null,null,null,null,null,null,null,null,null,null,null,null,null,null,null,null,null,null,null,null,null,null,null,null,null,null,null,null,null,null,null,null,null,null,null,null,null,null,null,null,"OLY +",2017,null,{"$f":"IF(AQ293,VLOOKUP(AQ293,FEM!$AS$468:$AT$523,2))","v":4.4930000000000003}]
[null,null,null,null,null,null,null,null,null,null,null,null,null,null,null,null,null,null,null,null,null,null,null,null,null,null,null,null,null,null,null,null,null,null,null,null,null,null,null,null,null,"OLY +",2017,null,{"$f":"IF(AQ294,VLOOKUP(AQ294,FEM!$AS$468:$AT$523,2))","v":4.4930000000000003}]
[null,null,null,null,null,null,null,null,null,null,null,null,null,null,null,null,null,null,null,null,null,null,null,null,null,null,null,null,null,null,null,null,null,null,null,null,null,null,null,null,null,"OLY +",2017,null,{"$f":"IF(AQ295,VLOOKUP(AQ295,FEM!$AS$468:$AT$523,2))","v":4.4930000000000003}]
[null,null,null,null,null,null,null,null,null,null,null,null,null,null,null,null,null,null,null,null,null,null,null,null,null,null,null,null,null,null,null,null,null,null,null,null,null,null,null,null,null,"OLY +",2017,null,{"$f":"IF(AQ296,VLOOKUP(AQ296,FEM!$AS$468:$AT$523,2))","v":4.4930000000000003}]
[null,null,null,null,null,null,null,null,null,null,null,null,null,null,null,null,null,null,null,null,null,null,null,null,null,null,null,null,null,null,null,null,null,null,null,null,null,null,null,null,null,"OLY +",2017,null,{"$f":"IF(AQ297,VLOOKUP(AQ297,FEM!$AS$468:$AT$523,2))","v":4.4930000000000003}]
[null,null,null,null,null,null,null,null,null,null,null,null,null,null,null,null,null,null,null,null,null,null,null,null,null,null,null,null,null,null,null,null,null,null,null,null,null,null,null,null,null,{"$f":"IF(AH298>=0,$AH$5,IF(AG298>=0,$AG$5,IF(AF298>=0,$AF$5,IF(AE298>=0,$AE$5,IF(AD298>=0,$AD$5,IF(AC298>=0,$AC$5,IF(AB298>=0,$AB$5,IF(AA298>=0,$AA$5,$AI$5))))))))","v":"OLY +"},2017,null,{"$f":"IF(AQ298,VLOOKUP(AQ298,FEM!$AS$468:$AT$523,2))","v":4.4930000000000003}]
[null,null,null,null,null,null,null,null,null,null,null,null,null,null,null,null,null,null,null,null,null,null,null,null,null,null,null,null,null,null,null,null,null,null,null,null,null,null,null,null,null,"OLY +",2017,null,{"$f":"IF(AQ299,VLOOKUP(AQ299,FEM!$AS$468:$AT$523,2))","v":4.4930000000000003}]
[null,null,null,null,null,null,null,null,null,null,null,null,null,null,null,null,null,null,null,null,null,null,null,null,null,null,null,null,null,null,null,null,null,null,null,null,null,null,null,null,null,"OLY +",2017,null,{"$f":"IF(AQ300,VLOOKUP(AQ300,FEM!$AS$468:$AT$523,2))","v":4.4930000000000003}]
[null,null,null,null,null,null,null,null,null,null,null,null,null,null,null,null,null,null,null,null,null,null,null,null,null,null,null,null,null,null,null,null,null,null,null,null,null,null,null,null,null,"OLY +",2017,null,{"$f":"IF(AQ301,VLOOKUP(AQ301,FEM!$AS$468:$AT$523,2))","v":4.4930000000000003}]
[null,null,null,null,null,null,null,null,null,null,null,null,null,null,null,null,null,null,null,null,null,null,null,null,null,null,null,null,null,null,null,null,null,null,null,null,null,null,null,null,null,"OLY +",2017,null,{"$f":"IF(AQ302,VLOOKUP(AQ302,FEM!$AS$468:$AT$523,2))","v":4.4930000000000003}]
[null,null,null,null,null,null,null,null,null,null,null,null,null,null,null,null,null,null,null,null,null,null,null,null,null,null,null,null,null,null,null,null,null,null,null,null,null,null,null,null,null,"OLY +",2017,null,{"$f":"IF(AQ303,VLOOKUP(AQ303,FEM!$AS$468:$AT$523,2))","v":4.4930000000000003}]
[null,null,null,null,null,null,null,null,null,null,null,null,null,null,null,null,null,null,null,null,null,null,null,null,null,null,null,null,null,null,null,null,null,null,null,null,null,null,null,null,null,"OLY +",2017,null,{"$f":"IF(AQ304,VLOOKUP(AQ304,FEM!$AS$468:$AT$523,2))","v":4.4930000000000003}]
[null,null,null,null,null,null,null,null,null,null,null,null,null,null,null,null,null,null,null,null,null,null,null,null,null,null,null,null,null,null,null,null,null,null,null,null,null,null,null,null,null,"OLY +",2017,null,{"$f":"IF(AQ305,VLOOKUP(AQ305,FEM!$AS$468:$AT$523,2))","v":4.4930000000000003}]
[null,null,null,null,null,null,null,null,null,null,null,null,null,null,null,null,null,null,null,null,null,null,null,null,null,null,null,null,null,null,null,null,null,null,null,null,null,null,null,null,null,"OLY +",2017,null,{"$f":"IF(AQ306,VLOOKUP(AQ306,FEM!$AS$468:$AT$523,2))","v":4.4930000000000003}]
[null,null,null,null,null,null,null,null,null,null,null,null,null,null,null,null,null,null,null,null,null,null,null,null,null,null,null,null,null,null,null,null,null,null,null,null,null,null,null,null,null,"OLY +",2017,null,{"$f":"IF(AQ307,VLOOKUP(AQ307,FEM!$AS$468:$AT$523,2))","v":4.4930000000000003}]
[null,null,null,null,null,null,null,null,null,null,null,null,null,null,null,null,null,null,null,null,null,null,null,null,null,null,null,null,null,null,null,null,null,null,null,null,null,null,null,null,null,"OLY +",2017,null,{"$f":"IF(AQ308,VLOOKUP(AQ308,FEM!$AS$468:$AT$523,2))","v":4.4930000000000003}]
[null,null,null,null,null,null,null,null,null,null,null,null,null,null,null,null,null,null,null,null,null,null,null,null,null,null,null,null,null,null,null,null,null,null,null,null,null,null,null,null,null,"OLY +",2017,null,{"$f":"IF(AQ309,VLOOKUP(AQ309,FEM!$AS$468:$AT$523,2))","v":4.4930000000000003}]
[null,null,null,null,null,null,null,null,null,null,null,null,null,null,null,null,null,null,null,null,null,null,null,null,null,null,null,null,null,null,null,null,null,null,null,null,null,null,null,null,null,"OLY +",2017,null,{"$f":"IF(AQ310,VLOOKUP(AQ310,FEM!$AS$468:$AT$523,2))","v":4.4930000000000003}]
[null,null,null,null,null,null,null,null,null,null,null,null,null,null,null,null,null,null,null,null,null,null,null,null,null,null,null,null,null,null,null,null,null,null,null,null,null,null,null,null,null,"OLY +",2017,null,{"$f":"IF(AQ311,VLOOKUP(AQ311,FEM!$AS$468:$AT$523,2))","v":4.4930000000000003}]
[null,null,null,null,null,null,null,null,null,null,null,null,null,null,null,null,null,null,null,null,null,null,null,null,null,null,null,null,null,null,null,null,null,null,null,null,null,null,null,null,null,"OLY +",2017,null,{"$f":"IF(AQ312,VLOOKUP(AQ312,FEM!$AS$468:$AT$523,2))","v":4.4930000000000003}]
[null,null,null,null,null,null,null,null,null,null,null,null,null,null,null,null,null,null,null,null,null,null,null,null,null,null,null,null,null,null,null,null,null,null,null,null,null,null,null,null,null,"OLY +",2017,null,{"$f":"IF(AQ313,VLOOKUP(AQ313,FEM!$AS$468:$AT$523,2))","v":4.4930000000000003}]
[null,null,null,null,null,null,null,null,null,null,null,null,null,null,null,null,null,null,null,null,null,null,null,null,null,null,null,null,null,null,null,null,null,null,null,null,null,null,null,null,null,"OLY +",2017,null,{"$f":"IF(AQ314,VLOOKUP(AQ314,FEM!$AS$468:$AT$523,2))","v":4.4930000000000003}]
[null,null,null,null,null,null,null,null,null,null,null,null,null,null,null,null,null,null,null,null,null,null,null,null,null,null,null,null,null,null,null,null,null,null,null,null,null,null,null,null,null,"OLY +",2017,null,{"$f":"IF(AQ315,VLOOKUP(AQ315,FEM!$AS$468:$AT$523,2))","v":4.4930000000000003}]
[null,null,null,null,null,null,null,null,null,null,null,null,null,null,null,null,null,null,null,null,null,null,null,null,null,null,null,null,null,null,null,null,null,null,null,null,null,null,null,null,null,"OLY +",2017,null,{"$f":"IF(AQ316,VLOOKUP(AQ316,FEM!$AS$468:$AT$523,2))","v":4.4930000000000003}]
[null,null,null,null,null,null,null,null,null,null,null,null,null,null,null,null,null,null,null,null,null,null,null,null,null,null,null,null,null,null,null,null,null,null,null,null,null,null,null,null,null,"OLY +",2017,null,{"$f":"IF(AQ317,VLOOKUP(AQ317,FEM!$AS$468:$AT$523,2))","v":4.4930000000000003}]
[null,null,null,null,null,null,null,null,null,null,null,null,null,null,null,null,null,null,null,null,null,null,null,null,null,null,null,null,null,null,null,null,null,null,null,null,null,null,null,null,null,"OLY +",2017,null,{"$f":"IF(AQ318,VLOOKUP(AQ318,FEM!$AS$468:$AT$523,2))","v":4.4930000000000003}]
[null,null,null,null,null,null,null,null,null,null,null,null,null,null,null,null,null,null,null,null,null,null,null,null,null,null,null,null,null,null,null,null,null,null,null,null,null,null,null,null,null,"OLY +",2017,null,{"$f":"IF(AQ319,VLOOKUP(AQ319,FEM!$AS$468:$AT$523,2))","v":4.4930000000000003}]
[null,null,null,null,null,null,null,null,null,null,null,null,null,null,null,null,null,null,null,null,null,null,null,null,null,null,null,null,null,null,null,null,null,null,null,null,null,null,null,null,null,"OLY +",2017,null,{"$f":"IF(AQ320,VLOOKUP(AQ320,FEM!$AS$468:$AT$523,2))","v":4.4930000000000003}]
[null,null,null,null,null,null,null,null,null,null,null,null,null,null,null,null,null,null,null,null,null,null,null,null,null,null,null,null,null,null,null,null,null,null,null,null,null,null,null,null,null,"OLY +",2017,null,{"$f":"IF(AQ321,VLOOKUP(AQ321,FEM!$AS$468:$AT$523,2))","v":4.4930000000000003}]
[null,null,null,null,null,null,null,null,null,null,null,null,null,null,null,null,null,null,null,null,null,null,null,null,null,null,null,null,null,null,null,null,null,null,null,null,null,null,null,null,null,"OLY +",2017,null,{"$f":"IF(AQ322,VLOOKUP(AQ322,FEM!$AS$468:$AT$523,2))","v":4.4930000000000003}]
[null,null,null,null,null,null,null,null,null,null,null,null,null,null,null,null,null,null,null,null,null,null,null,null,null,null,null,null,null,null,null,null,null,null,null,null,null,null,null,null,null,"OLY +",2017,null,{"$f":"IF(AQ323,VLOOKUP(AQ323,FEM!$AS$468:$AT$523,2))","v":4.4930000000000003}]
[null,null,null,null,null,null,null,null,null,null,null,null,null,null,null,null,null,null,null,null,null,null,null,null,null,null,null,null,null,null,null,null,null,null,null,null,null,null,null,null,null,"OLY +",2017,null,{"$f":"IF(AQ324,VLOOKUP(AQ324,FEM!$AS$468:$AT$523,2))","v":4.4930000000000003}]
[null,null,null,null,null,null,null,null,null,null,null,null,null,null,null,null,null,null,null,null,null,null,null,null,null,null,null,null,null,null,null,null,null,null,null,null,null,null,null,null,null,"OLY +",2017,null,{"$f":"IF(AQ325,VLOOKUP(AQ325,FEM!$AS$468:$AT$523,2))","v":4.4930000000000003}]
[null,null,null,null,null,null,null,null,null,null,null,null,null,null,null,null,null,null,null,null,null,null,null,null,null,null,null,null,null,null,null,null,null,null,null,null,null,null,null,null,null,"OLY +",2017,null,{"$f":"IF(AQ326,VLOOKUP(AQ326,FEM!$AS$468:$AT$523,2))","v":4.4930000000000003}]
[null,null,null,null,null,null,null,null,null,null,null,null,null,null,null,null,null,null,null,null,null,null,null,null,null,null,null,null,null,null,null,null,null,null,null,null,null,null,null,null,null,"OLY +",2017,null,{"$f":"IF(AQ327,VLOOKUP(AQ327,FEM!$AS$468:$AT$523,2))","v":4.4930000000000003}]
[null,null,null,null,null,null,null,null,null,null,null,null,null,null,null,null,null,null,null,null,null,null,null,null,null,null,null,null,null,null,null,null,null,null,null,null,null,null,null,null,null,"OLY +",{"$f":"2017-H328","v":2017},null,{"$f":"IF(AQ328,VLOOKUP(AQ328,FEM!$AS$468:$AT$523,2))","v":4.4930000000000003}]
[null,null,null,null,null,null,null,null,null,null,null,null,null,null,null,null,null,null,null,null,null,null,null,null,null,null,null,null,null,null,null,null,null,null,null,null,null,null,null,null,null,"OLY +",2017,null,{"$f":"IF(AQ329,VLOOKUP(AQ329,FEM!$AS$468:$AT$523,2))","v":4.4930000000000003}]
[null,null,null,null,null,null,null,null,null,null,null,null,null,null,null,null,null,null,null,null,null,null,null,null,null,null,null,null,null,null,null,null,null,null,null,null,null,null,null,null,null,"OLY +",2017,null,{"$f":"IF(AQ330,VLOOKUP(AQ330,FEM!$AS$468:$AT$523,2))","v":4.4930000000000003}]
[null,null,null,null,null,null,null,null,null,null,null,null,null,null,null,null,null,null,null,null,null,null,null,null,null,null,null,null,null,null,null,null,null,null,null,null,null,null,null,null,null,"OLY +",2017,null,{"$f":"IF(AQ331,VLOOKUP(AQ331,FEM!$AS$468:$AT$523,2))","v":4.4930000000000003}]
[null,null,null,null,null,null,null,null,null,null,null,null,null,null,null,null,null,null,null,null,null,null,null,null,null,null,null,null,null,null,null,null,null,null,null,null,null,null,null,null,null,"OLY +",2017,null,{"$f":"IF(AQ332,VLOOKUP(AQ332,FEM!$AS$468:$AT$523,2))","v":4.4930000000000003}]
[null,null,null,null,null,null,null,null,null,null,null,null,null,null,null,null,null,null,null,null,null,null,null,null,null,null,null,null,null,null,null,null,null,null,null,null,null,null,null,null,null,"OLY +",2017,null,{"$f":"IF(AQ333,VLOOKUP(AQ333,FEM!$AS$468:$AT$523,2))","v":4.4930000000000003}]
[null,null,null,null,null,null,null,null,null,null,null,null,null,null,null,null,null,null,null,null,null,null,null,null,null,null,null,null,null,null,null,null,null,null,null,null,null,null,null,null,null,"OLY +",2017,null,{"$f":"IF(AQ334,VLOOKUP(AQ334,FEM!$AS$468:$AT$523,2))","v":4.4930000000000003}]
[null,null,null,null,null,null,null,null,null,null,null,null,null,null,null,null,null,null,null,null,null,null,null,null,null,null,null,null,null,null,null,null,null,null,null,null,null,null,null,null,null,"OLY +",2017,null,{"$f":"IF(AQ335,VLOOKUP(AQ335,FEM!$AS$468:$AT$523,2))","v":4.4930000000000003}]
[null,null,null,null,null,null,null,null,null,null,null,null,null,null,null,null,null,null,null,null,null,null,null,null,null,null,null,null,null,null,null,null,null,null,null,null,null,null,null,null,null,"OLY +",2017,null,{"$f":"IF(AQ336,VLOOKUP(AQ336,FEM!$AS$468:$AT$523,2))","v":4.4930000000000003}]
[null,null,null,null,null,null,null,null,null,null,null,null,null,null,null,null,null,null,null,null,null,null,null,null,null,null,null,null,null,null,null,null,null,null,null,null,null,null,null,null,null,"OLY +",2017,null,{"$f":"IF(AQ337,VLOOKUP(AQ337,FEM!$AS$468:$AT$523,2))","v":4.4930000000000003}]
[null,null,null,null,null,null,null,null,null,null,null,null,null,null,null,null,null,null,null,null,null,null,null,null,null,null,null,null,null,null,null,null,null,null,null,null,null,null,null,null,null,"OLY +",2017,null,{"$f":"IF(AQ338,VLOOKUP(AQ338,FEM!$AS$468:$AT$523,2))","v":4.4930000000000003}]
[null,null,null,null,null,null,null,null,null,null,null,null,null,null,null,null,null,null,null,null,null,null,null,null,null,null,null,null,null,null,null,null,null,null,null,null,null,null,null,null,null,"OLY +",2017,null,{"$f":"IF(AQ339,VLOOKUP(AQ339,FEM!$AS$468:$AT$523,2))","v":4.4930000000000003}]
[null,null,null,null,null,null,null,null,null,null,null,null,null,null,null,null,null,null,null,null,null,null,null,null,null,null,null,null,null,null,null,null,null,null,null,null,null,null,null,null,null,"OLY +",2017,null,{"$f":"IF(AQ340,VLOOKUP(AQ340,FEM!$AS$468:$AT$523,2))","v":4.4930000000000003}]
[null,null,null,null,null,null,null,null,null,null,null,null,null,null,null,null,null,null,null,null,null,null,null,null,null,null,null,null,null,null,null,null,null,null,null,null,null,null,null,null,null,"OLY +",2017,null,{"$f":"IF(AQ341,VLOOKUP(AQ341,FEM!$AS$468:$AT$523,2))","v":4.4930000000000003}]
[null,null,null,null,null,null,null,null,null,null,null,null,null,null,null,null,null,null,null,null,null,null,null,null,null,null,null,null,null,null,null,null,null,null,null,null,null,null,null,null,null,"OLY +",2017,null,{"$f":"IF(AQ342,VLOOKUP(AQ342,FEM!$AS$468:$AT$523,2))","v":4.4930000000000003}]
[null,null,null,null,null,null,null,null,null,null,null,null,null,null,null,null,null,null,null,null,null,null,null,null,null,null,null,null,null,null,null,null,null,null,null,null,null,null,null,null,null,"OLY +",2017,null,{"$f":"IF(AQ343,VLOOKUP(AQ343,FEM!$AS$468:$AT$523,2))","v":4.4930000000000003}]
[null,null,null,null,null,null,null,null,null,null,null,null,null,null,null,null,null,null,null,null,null,null,null,null,null,null,null,null,null,null,null,null,null,null,null,null,null,null,null,null,null,"OLY +",2017,null,{"$f":"IF(AQ344,VLOOKUP(AQ344,FEM!$AS$468:$AT$523,2))","v":4.4930000000000003}]
[null,null,null,null,null,null,null,null,null,null,null,null,null,null,null,null,null,null,null,null,null,null,null,null,null,null,null,null,null,null,null,null,null,null,null,null,null,null,null,null,null,"OLY +",2017,null,{"$f":"IF(AQ345,VLOOKUP(AQ345,FEM!$AS$468:$AT$523,2))","v":4.4930000000000003}]
[null,null,null,null,null,null,null,null,null,null,null,null,null,null,null,null,null,null,null,null,null,null,null,null,null,null,null,null,null,null,null,null,null,null,null,null,null,null,null,null,null,"OLY +",2017,null,{"$f":"IF(AQ346,VLOOKUP(AQ346,FEM!$AS$468:$AT$523,2))","v":4.4930000000000003}]
[null,null,null,null,null,null,null,null,null,null,null,null,null,null,null,null,null,null,null,null,null,null,null,null,null,null,null,null,null,null,null,null,null,null,null,null,null,null,null,null,null,"OLY +",2017,null,{"$f":"IF(AQ347,VLOOKUP(AQ347,FEM!$AS$468:$AT$523,2))","v":4.4930000000000003}]
[null,null,null,null,null,null,null,null,null,null,null,null,null,null,null,null,null,null,null,null,null,null,null,null,null,null,null,null,null,null,null,null,null,null,null,null,null,null,null,null,null,"OLY +",2017,null,{"$f":"IF(AQ348,VLOOKUP(AQ348,FEM!$AS$468:$AT$523,2))","v":4.4930000000000003}]
[null,null,null,null,null,null,null,null,null,null,null,null,null,null,null,null,null,null,null,null,null,null,null,null,null,null,null,null,null,null,null,null,null,null,null,null,null,null,null,null,null,"OLY +",2017,null,{"$f":"IF(AQ349,VLOOKUP(AQ349,FEM!$AS$468:$AT$523,2))","v":4.4930000000000003}]
[null,null,null,null,null,null,null,null,null,null,null,null,null,null,null,null,null,null,null,null,null,null,null,null,null,null,null,null,null,null,null,null,null,null,null,null,null,null,null,null,null,"OLY +",2017,null,{"$f":"IF(AQ350,VLOOKUP(AQ350,FEM!$AS$468:$AT$523,2))","v":4.4930000000000003}]
[null,null,null,null,null,null,null,null,null,null,null,null,null,null,null,null,null,null,null,null,null,null,null,null,null,null,null,null,null,null,null,null,null,null,null,null,null,null,null,null,null,"OLY +",2017,null,{"$f":"IF(AQ351,VLOOKUP(AQ351,FEM!$AS$468:$AT$523,2))","v":4.4930000000000003}]
[null,null,null,null,null,null,null,null,null,null,null,null,null,null,null,null,null,null,null,null,null,null,null,null,null,null,null,null,null,null,null,null,null,null,null,null,null,null,null,null,null,"OLY +",2017,null,{"$f":"IF(AQ352,VLOOKUP(AQ352,FEM!$AS$468:$AT$523,2))","v":4.4930000000000003}]
[null,null,null,null,null,null,null,null,null,null,null,null,null,null,null,null,null,null,null,null,null,null,null,null,null,null,null,null,null,null,null,null,null,null,null,null,null,null,null,null,null,"OLY +",2017,null,{"$f":"IF(AQ353,VLOOKUP(AQ353,FEM!$AS$468:$AT$523,2))","v":4.4930000000000003}]
[null,null,null,null,null,null,null,null,null,null,null,null,null,null,null,null,null,null,null,null,null,null,null,null,null,null,null,null,null,null,null,null,null,null,null,null,null,null,null,null,null,"OLY +",2017,null,{"$f":"IF(AQ354,VLOOKUP(AQ354,FEM!$AS$468:$AT$523,2))","v":4.4930000000000003}]
[null,null,null,null,null,null,null,null,null,null,null,null,null,null,null,null,null,null,null,null,null,null,null,null,null,null,null,null,null,null,null,null,null,null,null,null,null,null,null,null,null,"OLY +",2017,null,{"$f":"IF(AQ355,VLOOKUP(AQ355,FEM!$AS$468:$AT$523,2))","v":4.4930000000000003}]
[null,null,null,null,null,null,null,null,null,null,null,null,null,null,null,null,null,null,null,null,null,null,null,null,null,null,null,null,null,null,null,null,null,null,null,null,null,null,null,null,null,"OLY +",2017,null,{"$f":"IF(AQ356,VLOOKUP(AQ356,FEM!$AS$468:$AT$523,2))","v":4.4930000000000003}]
[null,null,null,null,null,null,null,null,null,null,null,null,null,null,null,null,null,null,null,null,null,null,null,null,null,null,null,null,null,null,null,null,null,null,null,null,null,null,null,null,null,"OLY +",2017,null,{"$f":"IF(AQ357,VLOOKUP(AQ357,FEM!$AS$468:$AT$523,2))","v":4.4930000000000003}]
[null,null,null,null,null,null,null,null,null,null,null,null,null,null,null,null,null,null,null,null,null,null,null,null,null,null,null,null,null,null,null,null,null,null,null,null,null,null,null,null,null,"OLY +",2017,null,{"$f":"IF(AQ358,VLOOKUP(AQ358,FEM!$AS$468:$AT$523,2))","v":4.4930000000000003}]
[null,null,null,null,null,null,null,null,null,null,null,null,null,null,null,null,null,null,null,null,null,null,null,null,null,null,null,null,null,null,null,null,null,null,null,null,null,null,null,null,null,"OLY +",2017,null,{"$f":"IF(AQ359,VLOOKUP(AQ359,FEM!$AS$468:$AT$523,2))","v":4.4930000000000003}]
[null,null,null,null,null,null,null,null,null,null,null,null,null,null,null,null,null,null,null,null,null,null,null,null,null,null,null,null,null,null,null,null,null,null,null,null,null,null,null,null,null,"OLY +",2017,null,{"$f":"IF(AQ360,VLOOKUP(AQ360,FEM!$AS$468:$AT$523,2))","v":4.4930000000000003}]
[null,null,null,null,null,null,null,null,null,null,null,null,null,null,null,null,null,null,null,null,null,null,null,null,null,null,null,null,null,null,null,null,null,null,null,null,null,null,null,null,null,"OLY +",2017,null,{"$f":"IF(AQ361,VLOOKUP(AQ361,FEM!$AS$468:$AT$523,2))","v":4.4930000000000003}]
[null,null,null,null,null,null,null,null,null,null,null,null,null,null,null,null,null,null,null,null,null,null,null,null,null,null,null,null,null,null,null,null,null,null,null,null,null,null,null,null,null,{"$f":"IF(AH362>=0,$AH$5,IF(AG362>=0,$AG$5,IF(AF362>=0,$AF$5,IF(AE362>=0,$AE$5,IF(AD362>=0,$AD$5,IF(AC362>=0,$AC$5,IF(AB362>=0,$AB$5,IF(AA362>=0,$AA$5,$AI$5))))))))","v":"OLY +"},2017,null,{"$f":"IF(AQ362,VLOOKUP(AQ362,FEM!$AS$468:$AT$523,2))","v":4.4930000000000003}]
[null,null,null,null,null,null,null,null,null,null,null,null,null,null,null,null,null,null,null,null,null,null,null,null,null,null,null,null,null,null,null,null,null,null,null,null,null,null,null,null,null,"OLY +",2017,null,{"$f":"IF(AQ363,VLOOKUP(AQ363,FEM!$AS$468:$AT$523,2))","v":4.4930000000000003}]
[null,null,null,null,null,null,null,null,null,null,null,null,null,null,null,null,null,null,null,null,null,null,null,null,null,null,null,null,null,null,null,null,null,null,null,null,null,null,null,null,null,"OLY +",2017,null,{"$f":"IF(AQ364,VLOOKUP(AQ364,FEM!$AS$468:$AT$523,2))","v":4.4930000000000003}]
[null,null,null,null,null,null,null,null,null,null,null,null,null,null,null,null,null,null,null,null,null,null,null,null,null,null,null,null,null,null,null,null,null,null,null,null,null,null,null,null,null,"OLY +",2017,null,{"$f":"IF(AQ365,VLOOKUP(AQ365,FEM!$AS$468:$AT$523,2))","v":4.4930000000000003}]
[null,null,null,null,null,null,null,null,null,null,null,null,null,null,null,null,null,null,null,null,null,null,null,null,null,null,null,null,null,null,null,null,null,null,null,null,null,null,null,null,null,"OLY +",2017,null,{"$f":"IF(AQ366,VLOOKUP(AQ366,FEM!$AS$468:$AT$523,2))","v":4.4930000000000003}]
[null,null,null,null,null,null,null,null,null,null,null,null,null,null,null,null,null,null,null,null,null,null,null,null,null,null,null,null,null,null,null,null,null,null,null,null,null,null,null,null,null,"OLY +",2017,null,{"$f":"IF(AQ367,VLOOKUP(AQ367,FEM!$AS$468:$AT$523,2))","v":4.4930000000000003}]
[null,null,null,null,null,null,null,null,null,null,null,null,null,null,null,null,null,null,null,null,null,null,null,null,null,null,null,null,null,null,null,null,null,null,null,null,null,null,null,null,null,"OLY +",2017,null,{"$f":"IF(AQ368,VLOOKUP(AQ368,FEM!$AS$468:$AT$523,2))","v":4.4930000000000003}]
[null,null,null,null,null,null,null,null,null,null,null,null,null,null,null,null,null,null,null,null,null,null,null,null,null,null,null,null,null,null,null,null,null,null,null,null,null,null,null,null,null,"OLY +",2017,null,{"$f":"IF(AQ369,VLOOKUP(AQ369,FEM!$AS$468:$AT$523,2))","v":4.4930000000000003}]
[null,null,null,null,null,null,null,null,null,null,null,null,null,null,null,null,null,null,null,null,null,null,null,null,null,null,null,null,null,null,null,null,null,null,null,null,null,null,null,null,null,"OLY +",2017,null,{"$f":"IF(AQ370,VLOOKUP(AQ370,FEM!$AS$468:$AT$523,2))","v":4.4930000000000003}]
[null,null,null,null,null,null,null,null,null,null,null,null,null,null,null,null,null,null,null,null,null,null,null,null,null,null,null,null,null,null,null,null,null,null,null,null,null,null,null,null,null,"OLY +",2017,null,{"$f":"IF(AQ371,VLOOKUP(AQ371,FEM!$AS$468:$AT$523,2))","v":4.4930000000000003}]
[null,null,null,null,null,null,null,null,null,null,null,null,null,null,null,null,null,null,null,null,null,null,null,null,null,null,null,null,null,null,null,null,null,null,null,null,null,null,null,null,null,"OLY +",2017,null,{"$f":"IF(AQ372,VLOOKUP(AQ372,FEM!$AS$468:$AT$523,2))","v":4.4930000000000003}]
[null,null,null,null,null,null,null,null,null,null,null,null,null,null,null,null,null,null,null,null,null,null,null,null,null,null,null,null,null,null,null,null,null,null,null,null,null,null,null,null,null,"OLY +",2017,null,{"$f":"IF(AQ373,VLOOKUP(AQ373,FEM!$AS$468:$AT$523,2))","v":4.4930000000000003}]
[null,null,null,null,null,null,null,null,null,null,null,null,null,null,null,null,null,null,null,null,null,null,null,null,null,null,null,null,null,null,null,null,null,null,null,null,null,null,null,null,null,"OLY +",2017,null,{"$f":"IF(AQ374,VLOOKUP(AQ374,FEM!$AS$468:$AT$523,2))","v":4.4930000000000003}]
[null,null,null,null,null,null,null,null,null,null,null,null,null,null,null,null,null,null,null,null,null,null,null,null,null,null,null,null,null,null,null,null,null,null,null,null,null,null,null,null,null,"OLY +",2017,null,{"$f":"IF(AQ375,VLOOKUP(AQ375,FEM!$AS$468:$AT$523,2))","v":4.4930000000000003}]
[null,null,null,null,null,null,null,null,null,null,null,null,null,null,null,null,null,null,null,null,null,null,null,null,null,null,null,null,null,null,null,null,null,null,null,null,null,null,null,null,null,"OLY +",2017,null,{"$f":"IF(AQ376,VLOOKUP(AQ376,FEM!$AS$468:$AT$523,2))","v":4.4930000000000003}]
[null,null,null,null,null,null,null,null,null,null,null,null,null,null,null,null,null,null,null,null,null,null,null,null,null,null,null,null,null,null,null,null,null,null,null,null,null,null,null,null,null,"OLY +",2017,null,{"$f":"IF(AQ377,VLOOKUP(AQ377,FEM!$AS$468:$AT$523,2))","v":4.4930000000000003}]
[null,null,null,null,null,null,null,null,null,null,null,null,null,null,null,null,null,null,null,null,null,null,null,null,null,null,null,null,null,null,null,null,null,null,null,null,null,null,null,null,null,"OLY +",2017,null,{"$f":"IF(AQ378,VLOOKUP(AQ378,FEM!$AS$468:$AT$523,2))","v":4.4930000000000003}]
[null,null,null,null,null,null,null,null,null,null,null,null,null,null,null,null,null,null,null,null,null,null,null,null,null,null,null,null,null,null,null,null,null,null,null,null,null,null,null,null,null,"OLY +",2017,null,{"$f":"IF(AQ379,VLOOKUP(AQ379,FEM!$AS$468:$AT$523,2))","v":4.4930000000000003}]
[null,null,null,null,null,null,null,null,null,null,null,null,null,null,null,null,null,null,null,null,null,null,null,null,null,null,null,null,null,null,null,null,null,null,null,null,null,null,null,null,null,"OLY +",2017,null,{"$f":"IF(AQ380,VLOOKUP(AQ380,FEM!$AS$468:$AT$523,2))","v":4.4930000000000003}]
[null,null,null,null,null,null,null,null,null,null,null,null,null,null,null,null,null,null,null,null,null,null,null,null,null,null,null,null,null,null,null,null,null,null,null,null,null,null,null,null,null,"OLY +",2017,null,{"$f":"IF(AQ381,VLOOKUP(AQ381,FEM!$AS$468:$AT$523,2))","v":4.4930000000000003}]
[null,null,null,null,null,null,null,null,null,null,null,null,null,null,null,null,null,null,null,null,null,null,null,null,null,null,null,null,null,null,null,null,null,null,null,null,null,null,null,null,null,"OLY +",2017,null,{"$f":"IF(AQ382,VLOOKUP(AQ382,FEM!$AS$468:$AT$523,2))","v":4.4930000000000003}]
[null,null,null,null,null,null,null,null,null,null,null,null,null,null,null,null,null,null,null,null,null,null,null,null,null,null,null,null,null,null,null,null,null,null,null,null,null,null,null,null,null,"OLY +",2017,null,{"$f":"IF(AQ383,VLOOKUP(AQ383,FEM!$AS$468:$AT$523,2))","v":4.4930000000000003}]
[null,null,null,null,null,null,null,null,null,null,null,null,null,null,null,null,null,null,null,null,null,null,null,null,null,null,null,null,null,null,null,null,null,null,null,null,null,null,null,null,null,"OLY +",2017,null,{"$f":"IF(AQ384,VLOOKUP(AQ384,FEM!$AS$468:$AT$523,2))","v":4.4930000000000003}]
[null,null,null,null,null,null,null,null,null,null,null,null,null,null,null,null,null,null,null,null,null,null,null,null,null,null,null,null,null,null,null,null,null,null,null,null,null,null,null,null,null,"OLY +",2017,null,{"$f":"IF(AQ385,VLOOKUP(AQ385,FEM!$AS$468:$AT$523,2))","v":4.4930000000000003}]
[null,null,null,null,null,null,null,null,null,null,null,null,null,null,null,null,null,null,null,null,null,null,null,null,null,null,null,null,null,null,null,null,null,null,null,null,null,null,null,null,null,"OLY +",2017,null,{"$f":"IF(AQ386,VLOOKUP(AQ386,FEM!$AS$468:$AT$523,2))","v":4.4930000000000003}]
[null,null,null,null,null,null,null,null,null,null,null,null,null,null,null,null,null,null,null,null,null,null,null,null,null,null,null,null,null,null,null,null,null,null,null,null,null,null,null,null,null,"OLY +",2017,null,{"$f":"IF(AQ387,VLOOKUP(AQ387,FEM!$AS$468:$AT$523,2))","v":4.4930000000000003}]
[null,null,null,null,null,null,null,null,null,null,null,null,null,null,null,null,null,null,null,null,null,null,null,null,null,null,null,null,null,null,null,null,null,null,null,null,null,null,null,null,null,"OLY +",2017,null,{"$f":"IF(AQ388,VLOOKUP(AQ388,FEM!$AS$468:$AT$523,2))","v":4.4930000000000003}]
[null,null,null,null,null,null,null,null,null,null,null,null,null,null,null,null,null,null,null,null,null,null,null,null,null,null,null,null,null,null,null,null,null,null,null,null,null,null,null,null,null,"OLY +",2017,null,{"$f":"IF(AQ389,VLOOKUP(AQ389,FEM!$AS$468:$AT$523,2))","v":4.4930000000000003}]
[null,null,null,null,null,null,null,null,null,null,null,null,null,null,null,null,null,null,null,null,null,null,null,null,null,null,null,null,null,null,null,null,null,null,null,null,null,null,null,null,null,"OLY +",2017,null,{"$f":"IF(AQ390,VLOOKUP(AQ390,FEM!$AS$468:$AT$523,2))","v":4.4930000000000003}]
[null,null,null,null,null,null,null,null,null,null,null,null,null,null,null,null,null,null,null,null,null,null,null,null,null,null,null,null,null,null,null,null,null,null,null,null,null,null,null,null,null,"OLY +",2017,null,{"$f":"IF(AQ391,VLOOKUP(AQ391,FEM!$AS$468:$AT$523,2))","v":4.4930000000000003}]
[null,null,null,null,null,null,null,null,null,null,null,null,null,null,null,null,null,null,null,null,null,null,null,null,null,null,null,null,null,null,null,null,null,null,null,null,null,null,null,null,null,"OLY +",{"$f":"2017-H392","v":2017},null,{"$f":"IF(AQ392,VLOOKUP(AQ392,FEM!$AS$468:$AT$523,2))","v":4.4930000000000003}]
[null,null,null,null,null,null,null,null,null,null,null,null,null,null,null,null,null,null,null,null,null,null,null,null,null,null,null,null,null,null,null,null,null,null,null,null,null,null,null,null,null,"OLY +",2017,null,{"$f":"IF(AQ393,VLOOKUP(AQ393,FEM!$AS$468:$AT$523,2))","v":4.4930000000000003}]
[null,null,null,null,null,null,null,null,null,null,null,null,null,null,null,null,null,null,null,null,null,null,null,null,null,null,null,null,null,null,null,null,null,null,null,null,null,null,null,null,null,"OLY +",2017,null,{"$f":"IF(AQ394,VLOOKUP(AQ394,FEM!$AS$468:$AT$523,2))","v":4.4930000000000003}]
[null,null,null,null,null,null,null,null,null,null,null,null,null,null,null,null,null,null,null,null,null,null,null,null,null,null,null,null,null,null,null,null,null,null,null,null,null,null,null,null,null,"OLY +",2017,null,{"$f":"IF(AQ395,VLOOKUP(AQ395,FEM!$AS$468:$AT$523,2))","v":4.4930000000000003}]
[null,null,null,null,null,null,null,null,null,null,null,null,null,null,null,null,null,null,null,null,null,null,null,null,null,null,null,null,null,null,null,null,null,null,null,null,null,null,null,null,null,"OLY +",2017,null,{"$f":"IF(AQ396,VLOOKUP(AQ396,FEM!$AS$468:$AT$523,2))","v":4.4930000000000003}]
[null,null,null,null,null,null,null,null,null,null,null,null,null,null,null,null,null,null,null,null,null,null,null,null,null,null,null,null,null,null,null,null,null,null,null,null,null,null,null,null,null,"OLY +",2017,null,{"$f":"IF(AQ397,VLOOKUP(AQ397,FEM!$AS$468:$AT$523,2))","v":4.4930000000000003}]
[null,null,null,null,null,null,null,null,null,null,null,null,null,null,null,null,null,null,null,null,null,null,null,null,null,null,null,null,null,null,null,null,null,null,null,null,null,null,null,null,null,"OLY +",2017,null,{"$f":"IF(AQ398,VLOOKUP(AQ398,FEM!$AS$468:$AT$523,2))","v":4.4930000000000003}]
[null,null,null,null,null,null,null,null,null,null,null,null,null,null,null,null,null,null,null,null,null,null,null,null,null,null,null,null,null,null,null,null,null,null,null,null,null,null,null,null,null,"OLY +",2017,null,{"$f":"IF(AQ399,VLOOKUP(AQ399,FEM!$AS$468:$AT$523,2))","v":4.4930000000000003}]
[null,null,null,null,null,null,null,null,null,null,null,null,null,null,null,null,null,null,null,null,null,null,null,null,null,null,null,null,null,null,null,null,null,null,null,null,null,null,null,null,null,"OLY +",2017,null,{"$f":"IF(AQ400,VLOOKUP(AQ400,FEM!$AS$468:$AT$523,2))","v":4.4930000000000003}]
[null,null,null,null,null,null,null,null,null,null,null,null,null,null,null,null,null,null,null,null,null,null,null,null,null,null,null,null,null,null,null,null,null,null,null,null,null,null,null,null,null,"OLY +",2017,null,{"$f":"IF(AQ401,VLOOKUP(AQ401,FEM!$AS$468:$AT$523,2))","v":4.4930000000000003}]
[null,null,null,null,null,null,null,null,null,null,null,null,null,null,null,null,null,null,null,null,null,null,null,null,null,null,null,null,null,null,null,null,null,null,null,null,null,null,null,null,null,"OLY +",2017,null,{"$f":"IF(AQ402,VLOOKUP(AQ402,FEM!$AS$468:$AT$523,2))","v":4.4930000000000003}]
[null,null,null,null,null,null,null,null,null,null,null,null,null,null,null,null,null,null,null,null,null,null,null,null,null,null,null,null,null,null,null,null,null,null,null,null,null,null,null,null,null,"OLY +",2017,null,{"$f":"IF(AQ403,VLOOKUP(AQ403,FEM!$AS$468:$AT$523,2))","v":4.4930000000000003}]
[null,null,null,null,null,null,null,null,null,null,null,null,null,null,null,null,null,null,null,null,null,null,null,null,null,null,null,null,null,null,null,null,null,null,null,null,null,null,null,null,null,"OLY +",2017,null,{"$f":"IF(AQ404,VLOOKUP(AQ404,FEM!$AS$468:$AT$523,2))","v":4.4930000000000003}]
[null,null,null,null,null,null,null,null,null,null,null,null,null,null,null,null,null,null,null,null,null,null,null,null,null,null,null,null,null,null,null,null,null,null,null,null,null,null,null,null,null,"OLY +",2017,null,{"$f":"IF(AQ405,VLOOKUP(AQ405,FEM!$AS$468:$AT$523,2))","v":4.4930000000000003}]
[null,null,null,null,null,null,null,null,null,null,null,null,null,null,null,null,null,null,null,null,null,null,null,null,null,null,null,null,null,null,null,null,null,null,null,null,null,null,null,null,null,"OLY +",2017,null,{"$f":"IF(AQ406,VLOOKUP(AQ406,FEM!$AS$468:$AT$523,2))","v":4.4930000000000003}]
[null,null,null,null,null,null,null,null,null,null,null,null,null,null,null,null,null,null,null,null,null,null,null,null,null,null,null,null,null,null,null,null,null,null,null,null,null,null,null,null,null,"OLY +",2017,null,{"$f":"IF(AQ407,VLOOKUP(AQ407,FEM!$AS$468:$AT$523,2))","v":4.4930000000000003}]
[null,null,null,null,null,null,null,null,null,null,null,null,null,null,null,null,null,null,null,null,null,null,null,null,null,null,null,null,null,null,null,null,null,null,null,null,null,null,null,null,null,"OLY +",2017,null,{"$f":"IF(AQ408,VLOOKUP(AQ408,FEM!$AS$468:$AT$523,2))","v":4.4930000000000003}]
[null,null,null,null,null,null,null,null,null,null,null,null,null,null,null,null,null,null,null,null,null,null,null,null,null,null,null,null,null,null,null,null,null,null,null,null,null,null,null,null,null,"OLY +",2017,null,{"$f":"IF(AQ409,VLOOKUP(AQ409,FEM!$AS$468:$AT$523,2))","v":4.4930000000000003}]
[null,null,null,null,null,null,null,null,null,null,null,null,null,null,null,null,null,null,null,null,null,null,null,null,null,null,null,null,null,null,null,null,null,null,null,null,null,null,null,null,null,"OLY +",2017,null,{"$f":"IF(AQ410,VLOOKUP(AQ410,FEM!$AS$468:$AT$523,2))","v":4.4930000000000003}]
[null,null,null,null,null,null,null,null,null,null,null,null,null,null,null,null,null,null,null,null,null,null,null,null,null,null,null,null,null,null,null,null,null,null,null,null,null,null,null,null,null,"OLY +",2017,null,{"$f":"IF(AQ411,VLOOKUP(AQ411,FEM!$AS$468:$AT$523,2))","v":4.4930000000000003}]
[null,null,null,null,null,null,null,null,null,null,null,null,null,null,null,null,null,null,null,null,null,null,null,null,null,null,null,null,null,null,null,null,null,null,null,null,null,null,null,null,null,"OLY +",2017,null,{"$f":"IF(AQ412,VLOOKUP(AQ412,FEM!$AS$468:$AT$523,2))","v":4.4930000000000003}]
[null,null,null,null,null,null,null,null,null,null,null,null,null,null,null,null,null,null,null,null,null,null,null,null,null,null,null,null,null,null,null,null,null,null,null,null,null,null,null,null,null,"OLY +",2017,null,{"$f":"IF(AQ413,VLOOKUP(AQ413,FEM!$AS$468:$AT$523,2))","v":4.4930000000000003}]
[null,null,null,null,null,null,null,null,null,null,null,null,null,null,null,null,null,null,null,null,null,null,null,null,null,null,null,null,null,null,null,null,null,null,null,null,null,null,null,null,null,"OLY +",2017,null,{"$f":"IF(AQ414,VLOOKUP(AQ414,FEM!$AS$468:$AT$523,2))","v":4.4930000000000003}]
[null,null,null,null,null,null,null,null,null,null,null,null,null,null,null,null,null,null,null,null,null,null,null,null,null,null,null,null,null,null,null,null,null,null,null,null,null,null,null,null,null,"OLY +",2017,null,{"$f":"IF(AQ415,VLOOKUP(AQ415,FEM!$AS$468:$AT$523,2))","v":4.4930000000000003}]
[null,null,null,null,null,null,null,null,null,null,null,null,null,null,null,null,null,null,null,null,null,null,null,null,null,null,null,null,null,null,null,null,null,null,null,null,null,null,null,null,null,"OLY +",2017,null,{"$f":"IF(AQ416,VLOOKUP(AQ416,FEM!$AS$468:$AT$523,2))","v":4.4930000000000003}]
[null,null,null,null,null,null,null,null,null,null,null,null,null,null,null,null,null,null,null,null,null,null,null,null,null,null,null,null,null,null,null,null,null,null,null,null,null,null,null,null,null,"OLY +",2017,null,{"$f":"IF(AQ417,VLOOKUP(AQ417,FEM!$AS$468:$AT$523,2))","v":4.4930000000000003}]
[null,null,null,null,null,null,null,null,null,null,null,null,null,null,null,null,null,null,null,null,null,null,null,null,null,null,null,null,null,null,null,null,null,null,null,null,null,null,null,null,null,"OLY +",2017,null,{"$f":"IF(AQ418,VLOOKUP(AQ418,FEM!$AS$468:$AT$523,2))","v":4.4930000000000003}]
[null,null,null,null,null,null,null,null,null,null,null,null,null,null,null,null,null,null,null,null,null,null,null,null,null,null,null,null,null,null,null,null,null,null,null,null,null,null,null,null,null,"OLY +",2017,null,{"$f":"IF(AQ419,VLOOKUP(AQ419,FEM!$AS$468:$AT$523,2))","v":4.4930000000000003}]
[null,null,null,null,null,null,null,null,null,null,null,null,null,null,null,null,null,null,null,null,null,null,null,null,null,null,null,null,null,null,null,null,null,null,null,null,null,null,null,null,null,"OLY +",2017,null,{"$f":"IF(AQ420,VLOOKUP(AQ420,FEM!$AS$468:$AT$523,2))","v":4.4930000000000003}]
[null,null,null,null,null,null,null,null,null,null,null,null,null,null,null,null,null,null,null,null,null,null,null,null,null,null,null,null,null,null,null,null,null,null,null,null,null,null,null,null,null,"OLY +",2017,null,{"$f":"IF(AQ421,VLOOKUP(AQ421,FEM!$AS$468:$AT$523,2))","v":4.4930000000000003}]
[null,null,null,null,null,null,null,null,null,null,null,null,null,null,null,null,null,null,null,null,null,null,null,null,null,null,null,null,null,null,null,null,null,null,null,null,null,null,null,null,null,"OLY +",2017,null,{"$f":"IF(AQ422,VLOOKUP(AQ422,FEM!$AS$468:$AT$523,2))","v":4.4930000000000003}]
[null,null,null,null,null,null,null,null,null,null,null,null,null,null,null,null,null,null,null,null,null,null,null,null,null,null,null,null,null,null,null,null,null,null,null,null,null,null,null,null,null,"OLY +",2017,null,{"$f":"IF(AQ423,VLOOKUP(AQ423,FEM!$AS$468:$AT$523,2))","v":4.4930000000000003}]
[null,null,null,null,null,null,null,null,null,null,null,null,null,null,null,null,null,null,null,null,null,null,null,null,null,null,null,null,null,null,null,null,null,null,null,null,null,null,null,null,null,"OLY +",2017,null,{"$f":"IF(AQ424,VLOOKUP(AQ424,FEM!$AS$468:$AT$523,2))","v":4.4930000000000003}]
[null,null,null,null,null,null,null,null,null,null,null,null,null,null,null,null,null,null,null,null,null,null,null,null,null,null,null,null,null,null,null,null,null,null,null,null,null,null,null,null,null,"OLY +",2017,null,{"$f":"IF(AQ425,VLOOKUP(AQ425,FEM!$AS$468:$AT$523,2))","v":4.4930000000000003}]
[null,null,null,null,null,null,null,null,null,null,null,null,null,null,null,null,null,null,null,null,null,null,null,null,null,null,null,null,null,null,null,null,null,null,null,null,null,null,null,null,null,{"$f":"IF(AH426>=0,$AH$5,IF(AG426>=0,$AG$5,IF(AF426>=0,$AF$5,IF(AE426>=0,$AE$5,IF(AD426>=0,$AD$5,IF(AC426>=0,$AC$5,IF(AB426>=0,$AB$5,IF(AA426>=0,$AA$5,$AI$5))))))))","v":"OLY +"},2017,null,{"$f":"IF(AQ426,VLOOKUP(AQ426,FEM!$AS$468:$AT$523,2))","v":4.4930000000000003}]
[null,null,null,null,null,null,null,null,null,null,null,null,null,null,null,null,null,null,null,null,null,null,null,null,null,null,null,null,null,null,null,null,null,null,null,null,null,null,null,null,null,"OLY +",2017,null,{"$f":"IF(AQ427,VLOOKUP(AQ427,FEM!$AS$468:$AT$523,2))","v":4.4930000000000003}]
[null,null,null,null,null,null,null,null,null,null,null,null,null,null,null,null,null,null,null,null,null,null,null,null,null,null,null,null,null,null,null,null,null,null,null,null,null,null,null,null,null,"OLY +",2017,null,{"$f":"IF(AQ428,VLOOKUP(AQ428,FEM!$AS$468:$AT$523,2))","v":4.4930000000000003}]
[null,null,null,null,null,null,null,null,null,null,null,null,null,null,null,null,null,null,null,null,null,null,null,null,null,null,null,null,null,null,null,null,null,null,null,null,null,null,null,null,null,"OLY +",2017,null,{"$f":"IF(AQ429,VLOOKUP(AQ429,FEM!$AS$468:$AT$523,2))","v":4.4930000000000003}]
[null,null,null,null,null,null,null,null,null,null,null,null,null,null,null,null,null,null,null,null,null,null,null,null,null,null,null,null,null,null,null,null,null,null,null,null,null,null,null,null,null,"OLY +",2017,null,{"$f":"IF(AQ430,VLOOKUP(AQ430,FEM!$AS$468:$AT$523,2))","v":4.4930000000000003}]
[null,null,null,null,null,null,null,null,null,null,null,null,null,null,null,null,null,null,null,null,null,null,null,null,null,null,null,null,null,null,null,null,null,null,null,null,null,null,null,null,null,"OLY +",2017,null,{"$f":"IF(AQ431,VLOOKUP(AQ431,FEM!$AS$468:$AT$523,2))","v":4.4930000000000003}]
[null,null,null,null,null,null,null,null,null,null,null,null,null,null,null,null,null,null,null,null,null,null,null,null,null,null,null,null,null,null,null,null,null,null,null,null,null,null,null,null,null,"OLY +",2017,null,{"$f":"IF(AQ432,VLOOKUP(AQ432,FEM!$AS$468:$AT$523,2))","v":4.4930000000000003}]
[null,null,null,null,null,null,null,null,null,null,null,null,null,null,null,null,null,null,null,null,null,null,null,null,null,null,null,null,null,null,null,null,null,null,null,null,null,null,null,null,null,"OLY +",2017,null,{"$f":"IF(AQ433,VLOOKUP(AQ433,FEM!$AS$468:$AT$523,2))","v":4.4930000000000003}]
[null,null,null,null,null,null,null,null,null,null,null,null,null,null,null,null,null,null,null,null,null,null,null,null,null,null,null,null,null,null,null,null,null,null,null,null,null,null,null,null,null,"OLY +",2017,null,{"$f":"IF(AQ434,VLOOKUP(AQ434,FEM!$AS$468:$AT$523,2))","v":4.4930000000000003}]
[null,null,null,null,null,null,null,null,null,null,null,null,null,null,null,null,null,null,null,null,null,null,null,null,null,null,null,null,null,null,null,null,null,null,null,null,null,null,null,null,null,"OLY +",2017,null,{"$f":"IF(AQ435,VLOOKUP(AQ435,FEM!$AS$468:$AT$523,2))","v":4.4930000000000003}]
[null,null,null,null,null,null,null,null,null,null,null,null,null,null,null,null,null,null,null,null,null,null,null,null,null,null,null,null,null,null,null,null,null,null,null,null,null,null,null,null,null,"OLY +",2017,null,{"$f":"IF(AQ436,VLOOKUP(AQ436,FEM!$AS$468:$AT$523,2))","v":4.4930000000000003}]
[null,null,null,null,null,null,null,null,null,null,null,null,null,null,null,null,null,null,null,null,null,null,null,null,null,null,null,null,null,null,null,null,null,null,null,null,null,null,null,null,null,"OLY +",2017,null,{"$f":"IF(AQ437,VLOOKUP(AQ437,FEM!$AS$468:$AT$523,2))","v":4.4930000000000003}]
[null,null,null,null,null,null,null,null,null,null,null,null,null,null,null,null,null,null,null,null,null,null,null,null,null,null,null,null,null,null,null,null,null,null,null,null,null,null,null,null,null,"OLY +",2017,null,{"$f":"IF(AQ438,VLOOKUP(AQ438,FEM!$AS$468:$AT$523,2))","v":4.4930000000000003}]
[null,null,null,null,null,null,null,null,null,null,null,null,null,null,null,null,null,null,null,null,null,null,null,null,null,null,null,null,null,null,null,null,null,null,null,null,null,null,null,null,null,"OLY +",2017,null,{"$f":"IF(AQ439,VLOOKUP(AQ439,FEM!$AS$468:$AT$523,2))","v":4.4930000000000003}]
[null,null,null,null,null,null,null,null,null,null,null,null,null,null,null,null,null,null,null,null,null,null,null,null,null,null,null,null,null,null,null,null,null,null,null,null,null,null,null,null,null,"OLY +",2017,null,{"$f":"IF(AQ440,VLOOKUP(AQ440,FEM!$AS$468:$AT$523,2))","v":4.4930000000000003}]
[null,null,null,null,null,null,null,null,null,null,null,null,null,null,null,null,null,null,null,null,null,null,null,null,null,null,null,null,null,null,null,null,null,null,null,null,null,null,null,null,null,"OLY +",2017,null,{"$f":"IF(AQ441,VLOOKUP(AQ441,FEM!$AS$468:$AT$523,2))","v":4.4930000000000003}]
[null,null,null,null,null,null,null,null,null,null,null,null,null,null,null,null,null,null,null,null,null,null,null,null,null,null,null,null,null,null,null,null,null,null,null,null,null,null,null,null,null,"OLY +",2017,null,{"$f":"IF(AQ442,VLOOKUP(AQ442,FEM!$AS$468:$AT$523,2))","v":4.4930000000000003}]
[null,null,null,null,null,null,null,null,null,null,null,null,null,null,null,null,null,null,null,null,null,null,null,null,null,null,null,null,null,null,null,null,null,null,null,null,null,null,null,null,null,"OLY +",2017,null,{"$f":"IF(AQ443,VLOOKUP(AQ443,FEM!$AS$468:$AT$523,2))","v":4.4930000000000003}]
[null,null,null,null,null,null,null,null,null,null,null,null,null,null,null,null,null,null,null,null,null,null,null,null,null,null,null,null,null,null,null,null,null,null,null,null,null,null,null,null,null,"OLY +",2017,null,{"$f":"IF(AQ444,VLOOKUP(AQ444,FEM!$AS$468:$AT$523,2))","v":4.4930000000000003}]
[null,null,null,null,null,null,null,null,null,null,null,null,null,null,null,null,null,null,null,null,null,null,null,null,null,null,null,null,null,null,null,null,null,null,null,null,null,null,null,null,null,"OLY +",2017,null,{"$f":"IF(AQ445,VLOOKUP(AQ445,FEM!$AS$468:$AT$523,2))","v":4.4930000000000003}]
[null,null,null,null,null,null,null,null,null,null,null,null,null,null,null,null,null,null,null,null,null,null,null,null,null,null,null,null,null,null,null,null,null,null,null,null,null,null,null,null,null,"OLY +",2017,null,{"$f":"IF(AQ446,VLOOKUP(AQ446,FEM!$AS$468:$AT$523,2))","v":4.4930000000000003}]
[null,null,null,null,null,null,null,null,null,null,null,null,null,null,null,null,null,null,null,null,null,null,null,null,null,null,null,null,null,null,null,null,null,null,null,null,null,null,null,null,null,"OLY +",2017,null,{"$f":"IF(AQ447,VLOOKUP(AQ447,FEM!$AS$468:$AT$523,2))","v":4.4930000000000003}]
[null,null,null,null,null,null,null,null,null,null,null,null,null,null,null,null,null,null,null,null,null,null,null,null,null,null,null,null,null,null,null,null,null,null,null,null,null,null,null,null,null,"OLY +",2017,null,{"$f":"IF(AQ448,VLOOKUP(AQ448,FEM!$AS$468:$AT$523,2))","v":4.4930000000000003}]
[null,null,null,null,null,null,null,null,null,null,null,null,null,null,null,null,null,null,null,null,null,null,null,null,null,null,null,null,null,null,null,null,null,null,null,null,null,null,null,null,null,"OLY +",2017,null,{"$f":"IF(AQ449,VLOOKUP(AQ449,FEM!$AS$468:$AT$523,2))","v":4.4930000000000003}]
[null,null,null,null,null,null,null,null,null,null,null,null,null,null,null,null,null,null,null,null,null,null,null,null,null,null,null,null,null,null,null,null,null,null,null,null,null,null,null,null,null,"OLY +",2017,null,{"$f":"IF(AQ450,VLOOKUP(AQ450,FEM!$AS$468:$AT$523,2))","v":4.4930000000000003}]
[null,null,null,null,null,null,null,null,null,null,null,null,null,null,null,null,null,null,null,null,null,null,null,null,null,null,null,null,null,null,null,null,null,null,null,null,null,null,null,null,null,"OLY +",2017,null,{"$f":"IF(AQ451,VLOOKUP(AQ451,FEM!$AS$468:$AT$523,2))","v":4.4930000000000003}]
[null,null,null,null,null,null,null,null,null,null,null,null,null,null,null,null,null,null,null,null,null,null,null,null,null,null,null,null,null,null,null,null,null,null,null,null,null,null,null,null,null,"OLY +",2017,null,{"$f":"IF(AQ452,VLOOKUP(AQ452,FEM!$AS$468:$AT$523,2))","v":4.4930000000000003}]
[null,null,null,null,null,null,null,null,null,null,null,null,null,null,null,null,null,null,null,null,null,null,null,null,null,null,null,null,null,null,null,null,null,null,null,null,null,null,null,null,null,"OLY +",2017,null,{"$f":"IF(AQ453,VLOOKUP(AQ453,FEM!$AS$468:$AT$523,2))","v":4.4930000000000003}]
[null,null,null,null,null,null,null,null,null,null,null,null,null,null,null,null,null,null,null,null,null,null,null,null,null,null,null,null,null,null,null,null,null,null,null,null,null,null,null,null,null,"OLY +",2017,null,{"$f":"IF(AQ454,VLOOKUP(AQ454,FEM!$AS$468:$AT$523,2))","v":4.4930000000000003}]
[null,null,null,null,null,null,null,null,null,null,null,null,null,null,null,null,null,null,null,null,null,null,null,null,null,null,null,null,null,null,null,null,null,null,null,null,null,null,null,null,null,"OLY +",2017,null,{"$f":"IF(AQ455,VLOOKUP(AQ455,FEM!$AS$468:$AT$523,2))","v":4.4930000000000003}]
[null,null,null,null,null,null,null,null,null,null,null,null,null,null,null,null,null,null,null,null,null,null,null,null,null,null,null,null,null,null,null,null,null,null,null,null,null,null,null,null,null,"OLY +",{"$f":"2017-H456","v":2017},null,{"$f":"IF(AQ456,VLOOKUP(AQ456,FEM!$AS$468:$AT$523,2))","v":4.4930000000000003}]
[null,null,null,null,null,null,null,null,null,null,null,null,null,null,null,null,null,null,null,null,null,null,null,null,null,null,null,null,null,null,null,null,null,null,null,null,null,null,null,null,null,"OLY +",2017,null,{"$f":"IF(AQ457,VLOOKUP(AQ457,FEM!$AS$468:$AT$523,2))","v":4.4930000000000003}]
[null,null,null,null,null,null,null,null,null,null,null,null,null,null,null,null,null,null,null,null,null,null,null,null,null,null,null,null,null,null,null,null,null,null,null,null,null,null,null,null,null,"OLY +",2017,null,{"$f":"IF(AQ458,VLOOKUP(AQ458,FEM!$AS$468:$AT$523,2))","v":4.4930000000000003}]
[null,null,null,null,null,null,null,null,null,null,null,null,null,null,null,null,null,null,null,null,null,null,null,null,null,null,null,null,null,null,null,null,null,null,null,null,null,null,null,null,null,"OLY +",2017,null,{"$f":"IF(AQ459,VLOOKUP(AQ459,FEM!$AS$468:$AT$523,2))","v":4.4930000000000003}]
[null,null,null,null,null,null,null,null,null,null,null,null,null,null,null,null,null,null,null,null,null,null,null,null,null,null,null,null,null,null,null,null,null,null,null,null,null,null,null,null,null,"OLY +",2017,null,{"$f":"IF(AQ460,VLOOKUP(AQ460,FEM!$AS$468:$AT$523,2))","v":4.4930000000000003}]
[null,null,null,null,null,null,null,null,null,null,null,null,null,null,null,null,null,null,null,null,null,null,null,null,null,null,null,null,null,null,null,null,null,null,null,null,null,null,null,null,null,"OLY +",2017,null,{"$f":"IF(AQ461,VLOOKUP(AQ461,FEM!$AS$468:$AT$523,2))","v":4.4930000000000003}]
[null,null,null,null,null,null,null,null,null,null,null,null,null,null,null,null,null,null,null,null,null,null,null,null,null,null,null,null,null,null,null,null,null,null,null,null,null,null,null,null,null,"OLY +",2017,null,{"$f":"IF(AQ462,VLOOKUP(AQ462,FEM!$AS$468:$AT$523,2))","v":4.4930000000000003}]
[null,null,null,null,null,null,null,null,null,null,null,null,null,null,null,null,null,null,null,null,null,null,null,null,null,null,null,null,null,null,null,null,null,null,null,null,null,null,null,null,null,"OLY +",2017,null,{"$f":"IF(AQ463,VLOOKUP(AQ463,FEM!$AS$468:$AT$523,2))","v":4.4930000000000003}]
[null,null,null,null,null,null,null,null,null,null,null,null,null,null,null,null,null,null,null,null,null,null,null,null,null,null,null,null,null,null,null,null,null,null,null,null,null,null,null,null,null,"OLY +",2017,null,{"$f":"IF(AQ464,VLOOKUP(AQ464,FEM!$AS$468:$AT$523,2))","v":4.4930000000000003}]
[]
[]
[]
[null,null,null,null,null,null,null,null,null,null,null,null,null,null,null,null,null,null,null,null,null,null,null,null,null,null,null,null,null,null,null,null,null,null,null,null,null,null,null,null,null,null,35,"V1 F35",35,1.0720000000000001]
[null,null,null,null,null,null,null,null,null,null,null,null,null,null,null,null,null,null,null,null,null,null,null,null,null,null,null,null,null,null,null,null,null,null,null,null,null,null,null,null,null,null,36,"V1 F35",36,1.083]
[null,null,null,null,null,null,null,null,null,null,null,null,null,null,null,null,null,null,null,null,null,null,null,null,null,null,null,null,null,null,null,null,null,null,null,null,null,null,null,null,null,null,37,"V1 F35",37,1.0960000000000001]
[null,null,null,null,null,null,null,null,null,null,null,null,null,null,null,null,null,null,null,null,null,null,null,null,null,null,null,null,null,null,null,null,null,null,null,null,null,null,null,null,null,null,38,"V1 F35",38,1.109]
[null,null,null,null,null,null,null,null,null,null,null,null,null,null,null,null,null,null,null,null,null,null,null,null,null,null,null,null,null,null,null,null,null,null,null,null,null,null,null,null,null,null,39,"V1 F35",39,1.1220000000000001]
[null,null,null,null,null,null,null,null,null,null,null,null,null,null,null,null,null,null,null,null,null,null,null,null,null,null,null,null,null,null,null,null,null,null,null,null,null,null,null,null,null,null,40,"V2 F40",40,1.135]
[null,null,null,null,null,null,null,null,null,null,null,null,null,null,null,null,null,null,null,null,null,null,null,null,null,null,null,null,null,null,null,null,null,null,null,null,null,null,null,null,null,null,41,"V2 F40",41,1.149]
[null,null,null,null,null,null,null,null,null,null,null,null,null,null,null,null,null,null,null,null,null,null,null,null,null,null,null,null,null,null,null,null,null,null,null,null,null,null,null,null,null,null,42,"V2 F40",42,1.1619999999999999]
[null,null,null,null,null,null,null,null,null,null,null,null,null,null,null,null,null,null,null,null,null,null,null,null,null,null,null,null,null,null,null,null,null,null,null,null,null,null,null,null,null,null,43,"V2 F40",43,1.1759999999999999]
[null,null,null,null,null,null,null,null,null,null,null,null,null,null,null,null,null,null,null,null,null,null,null,null,null,null,null,null,null,null,null,null,null,null,null,null,null,null,null,null,null,null,44,"V2 F40",44,1.1890000000000001]
[null,null,null,null,null,null,null,null,null,null,null,null,null,null,null,null,null,null,null,null,null,null,null,null,null,null,null,null,null,null,null,null,null,null,null,null,null,null,null,null,null,null,45,"V3 F45",45,1.2030000000000001]
[null,null,null,null,null,null,null,null,null,null,null,null,null,null,null,null,null,null,null,null,null,null,null,null,null,null,null,null,null,null,null,null,null,null,null,null,null,null,null,null,null,null,46,"V3 F45",46,1.218]
[null,null,null,null,null,null,null,null,null,null,null,null,null,null,null,null,null,null,null,null,null,null,null,null,null,null,null,null,null,null,null,null,null,null,null,null,null,null,null,null,null,null,47,"V3 F45",47,1.2330000000000001]
[null,null,null,null,null,null,null,null,null,null,null,null,null,null,null,null,null,null,null,null,null,null,null,null,null,null,null,null,null,null,null,null,null,null,null,null,null,null,null,null,null,null,48,"V3 F45",48,1.248]
[null,null,null,null,null,null,null,null,null,null,null,null,null,null,null,null,null,null,null,null,null,null,null,null,null,null,null,null,null,null,null,null,null,null,null,null,null,null,null,null,null,null,49,"V3 F45",49,1.2629999999999999]
[null,null,null,null,null,null,null,null,null,null,null,null,null,null,null,null,null,null,null,null,null,null,null,null,null,null,null,null,null,null,null,null,null,null,null,null,null,null,null,null,null,null,50,"V4 F50",50,1.2789999999999999]
[null,null,null,null,null,null,null,null,null,null,null,null,null,null,null,null,null,null,null,null,null,null,null,null,null,null,null,null,null,null,null,null,null,null,null,null,null,null,null,null,null,null,51,"V4 F50",51,1.2969999999999999]
[null,null,null,null,null,null,null,null,null,null,null,null,null,null,null,null,null,null,null,null,null,null,null,null,null,null,null,null,null,null,null,null,null,null,null,null,null,null,null,null,null,null,52,"V4 F50",52,1.3160000000000001]
[null,null,null,null,null,null,null,null,null,null,null,null,null,null,null,null,null,null,null,null,null,null,null,null,null,null,null,null,null,null,null,null,null,null,null,null,null,null,null,null,null,null,53,"V4 F50",53,1.3380000000000001]
[null,null,null,null,null,null,null,null,null,null,null,null,null,null,null,null,null,null,null,null,null,null,null,null,null,null,null,null,null,null,null,null,null,null,null,null,null,null,null,null,null,null,54,"V4 F50",54,1.361]
[null,null,null,null,null,null,null,null,null,null,null,null,null,null,null,null,null,null,null,null,null,null,null,null,null,null,null,null,null,null,null,null,null,null,null,null,null,null,null,null,null,null,55,"V5 F55",55,1.385]
[null,null,null,null,null,null,null,null,null,null,null,null,null,null,null,null,null,null,null,null,null,null,null,null,null,null,null,null,null,null,null,null,null,null,null,null,null,null,null,null,null,null,56,"V5 F55",56,1.411]
[null,null,null,null,null,null,null,null,null,null,null,null,null,null,null,null,null,null,null,null,null,null,null,null,null,null,null,null,null,null,null,null,null,null,null,null,null,null,null,null,null,null,57,"V5 F55",57,1.4370000000000001]
[null,null,null,null,null,null,null,null,null,null,null,null,null,null,null,null,null,null,null,null,null,null,null,null,null,null,null,null,null,null,null,null,null,null,null,null,null,null,null,null,null,null,58,"V5 F55",58,1.462]
[null,null,null,null,null,null,null,null,null,null,null,null,null,null,null,null,null,null,null,null,null,null,null,null,null,null,null,null,null,null,null,null,null,null,null,null,null,null,null,null,null,null,59,"V5 F55",59,1.488]
[null,null,null,null,null,null,null,null,null,null,null,null,null,null,null,null,null,null,null,null,null,null,null,null,null,null,null,null,null,null,null,null,null,null,null,null,null,null,null,null,null,null,60,"V6 F60",60,1.514]
[null,null,null,null,null,null,null,null,null,null,null,null,null,null,null,null,null,null,null,null,null,null,null,null,null,null,null,null,null,null,null,null,null,null,null,null,null,null,null,null,null,null,61,"V6 F60",61,1.5409999999999999]
[null,null,null,null,null,null,null,null,null,null,null,null,null,null,null,null,null,null,null,null,null,null,null,null,null,null,null,null,null,null,null,null,null,null,null,null,null,null,null,null,null,null,62,"V6 F60",62,1.5680000000000001]
[null,null,null,null,null,null,null,null,null,null,null,null,null,null,null,null,null,null,null,null,null,null,null,null,null,null,null,null,null,null,null,null,null,null,null,null,null,null,null,null,null,null,63,"V6 F60",63,1.5980000000000001]
[null,null,null,null,null,null,null,null,null,null,null,null,null,null,null,null,null,null,null,null,null,null,null,null,null,null,null,null,null,null,null,null,null,null,null,null,null,null,null,null,null,null,64,"V6 F60",64,1.629]
[null,null,null,null,null,null,null,null,null,null,null,null,null,null,null,null,null,null,null,null,null,null,null,null,null,null,null,null,null,null,null,null,null,null,null,null,null,null,null,null,null,null,65,"V7 F65",65,1.663]
[null,null,null,null,null,null,null,null,null,null,null,null,null,null,null,null,null,null,null,null,null,null,null,null,null,null,null,null,null,null,null,null,null,null,null,null,null,null,null,null,null,null,66,"V7 F65",66,1.6990000000000001]
[null,null,null,null,null,null,null,null,null,null,null,null,null,null,null,null,null,null,null,null,null,null,null,null,null,null,null,null,null,null,null,null,null,null,null,null,null,null,null,null,null,null,67,"V7 F65",67,1.738]
[null,null,null,null,null,null,null,null,null,null,null,null,null,null,null,null,null,null,null,null,null,null,null,null,null,null,null,null,null,null,null,null,null,null,null,null,null,null,null,null,null,null,68,"V7 F65",68,1.7789999999999999]
[null,null,null,null,null,null,null,null,null,null,null,null,null,null,null,null,null,null,null,null,null,null,null,null,null,null,null,null,null,null,null,null,null,null,null,null,null,null,null,null,null,null,69,"V7 F65",69,1.823]
[null,null,null,null,null,null,null,null,null,null,null,null,null,null,null,null,null,null,null,null,null,null,null,null,null,null,null,null,null,null,null,null,null,null,null,null,null,null,null,null,null,null,70,"V8 F70+",70,1.867]
[null,null,null,null,null,null,null,null,null,null,null,null,null,null,null,null,null,null,null,null,null,null,null,null,null,null,null,null,null,null,null,null,null,null,null,null,null,null,null,null,null,null,71,"V8 F70+",71,1.91]
[null,null,null,null,null,null,null,null,null,null,null,null,null,null,null,null,null,null,null,null,null,null,null,null,null,null,null,null,null,null,null,null,null,null,null,null,null,null,null,null,null,null,72,"V8 F70+",72,1.9530000000000001]
[null,null,null,null,null,null,null,null,null,null,null,null,null,null,null,null,null,null,null,null,null,null,null,null,null,null,null,null,null,null,null,null,null,null,null,null,null,null,null,null,null,null,73,"V8 F70+",73,2.004]
[null,null,null,null,null,null,null,null,null,null,null,null,null,null,null,null,null,null,null,null,null,null,null,null,null,null,null,null,null,null,null,null,null,null,null,null,null,null,null,null,null,null,74,"V8 F70+",74,2.06]
[null,null,null,null,null,null,null,null,null,null,null,null,null,null,null,null,null,null,null,null,null,null,null,null,null,null,null,null,null,null,null,null,null,null,null,null,null,null,null,null,null,null,75,"V8 F70+",75,2.117]
[null,null,null,null,null,null,null,null,null,null,null,null,null,null,null,null,null,null,null,null,null,null,null,null,null,null,null,null,null,null,null,null,null,null,null,null,null,null,null,null,null,null,76,"V8 F70+",76,2.181]
[null,null,null,null,null,null,null,null,null,null,null,null,null,null,null,null,null,null,null,null,null,null,null,null,null,null,null,null,null,null,null,null,null,null,null,null,null,null,null,null,null,null,77,"V8 F70+",77,2.2549999999999999]
[null,null,null,null,null,null,null,null,null,null,null,null,null,null,null,null,null,null,null,null,null,null,null,null,null,null,null,null,null,null,null,null,null,null,null,null,null,null,null,null,null,null,78,"V8 F70+",78,2.3359999999999999]
[null,null,null,null,null,null,null,null,null,null,null,null,null,null,null,null,null,null,null,null,null,null,null,null,null,null,null,null,null,null,null,null,null,null,null,null,null,null,null,null,null,null,79,"V8 F70+",79,2.419]
[null,null,null,null,null,null,null,null,null,null,null,null,null,null,null,null,null,null,null,null,null,null,null,null,null,null,null,null,null,null,null,null,null,null,null,null,null,null,null,null,null,null,80,"V8 F70+",80,2.504]
[null,null,null,null,null,null,null,null,null,null,null,null,null,null,null,null,null,null,null,null,null,null,null,null,null,null,null,null,null,null,null,null,null,null,null,null,null,null,null,null,null,null,81,"V8 F70+",81,2.597]
[null,null,null,null,null,null,null,null,null,null,null,null,null,null,null,null,null,null,null,null,null,null,null,null,null,null,null,null,null,null,null,null,null,null,null,null,null,null,null,null,null,null,82,"V8 F70+",82,2.702]
[null,null,null,null,null,null,null,null,null,null,null,null,null,null,null,null,null,null,null,null,null,null,null,null,null,null,null,null,null,null,null,null,null,null,null,null,null,null,null,null,null,null,83,"V8 F70+",83,2.831]
[null,null,null,null,null,null,null,null,null,null,null,null,null,null,null,null,null,null,null,null,null,null,null,null,null,null,null,null,null,null,null,null,null,null,null,null,null,null,null,null,null,null,84,"V8 F70+",84,2.9809999999999999]
[null,null,null,null,null,null,null,null,null,null,null,null,null,null,null,null,null,null,null,null,null,null,null,null,null,null,null,null,null,null,null,null,null,null,null,null,null,null,null,null,null,null,85,"V8 F70+",85,3.153]
[null,null,null,null,null,null,null,null,null,null,null,null,null,null,null,null,null,null,null,null,null,null,null,null,null,null,null,null,null,null,null,null,null,null,null,null,null,null,null,null,null,null,86,"V8 F70+",86,3.3519999999999999]
[null,null,null,null,null,null,null,null,null,null,null,null,null,null,null,null,null,null,null,null,null,null,null,null,null,null,null,null,null,null,null,null,null,null,null,null,null,null,null,null,null,null,87,"V8 F70+",87,3.58]
[null,null,null,null,null,null,null,null,null,null,null,null,null,null,null,null,null,null,null,null,null,null,null,null,null,null,null,null,null,null,null,null,null,null,null,null,null,null,null,null,null,null,88,"V8 F70+",88,3.843]
[null,null,null,null,null,null,null,null,null,null,null,null,null,null,null,null,null,null,null,null,null,null,null,null,null,null,null,null,null,null,null,null,null,null,null,null,null,null,null,null,null,null,89,"V8 F70+",89,4.1449999999999996]
[null,null,null,null,null,null,null,null,null,null,null,null,null,null,null,null,null,null,null,null,null,null,null,null,null,null,null,null,null,null,null,null,null,null,null,null,null,null,null,null,null,null,90,"V8 F70+",90,4.4930000000000003]

{"sheet":"Feuil1","index":1,"n_rows":24,"n_cols":58,"rows_kept":24,"cut":false,"hidden":true,"merged":[]}
[null,null,"VF35-48","VF35-53","VF35-58","VF35-63","VF35-69","VF35-75","VF35+75","VF40-48","VF40-53","VF40-58","VF40-63","VF40-69","VF40-75","VF40+75","VF45-48","VF45-53","VF45-58","VF45-63","VF45-69","VF45-75","VF45+75","VF50-48","VF50-53","VF50-58","VF50-63","VF50-69","VF50-75","VF50+75","VF55-48","VF55-53","VF55-58","VF55-63","VF55-69","VF55-75","VF55+75","VF60-48","VF60-53","VF60-58","VF60-63","VF60-69","VF60-75","VF60+75","VF65-48","VF65-53","VF65-58","VF65-63","VF65-69","VF65-75","VF65+75","VF70+-48","VF70+-53","VF70+-58","VF70+-63","VF70+-69","VF70+-75","VF70++75"]
[null,null,null,null,null,null,null,null,null,null,null,null,null,null,null,null,null,null,null,null,null,null,null,null,null,null,null,null,null,null,null,null,null,null,null,null,null,null,null,null,null,null,null,null,null,null,null,null,null,null,null," "]
[null,"REGION",55,60,62,65,70,72,80,52,55,60,62,65,67,75,50,52,55,60,62,65,72,45,47,52,55,57,60,67,42,45,47,50,52,55,57,40,42,45,47,50,52,55,38,40,42,45,48,50,52,36,38,40,43,45,48,50]
[null,"France",60,62,67,70,75,77,85,55,60,62,65,70,72,80,52,55,60,62,65,67,75,50,52,55,60,62,65,72,45,47,52,55,57,60,67,42,45,47,50,52,55,57,40,42,45,47,50,52,55,38,40,42,45,48,50,52]
[null,"EUROPE",70,72,77,80,85,87,95,65,70,72,75,80,82,90,62,65,70,72,75,77,85,60,62,65,70,72,75,82,55,57,62,65,67,70,77,52,55,57,60,62,65,67,50,52,55,57,60,62,65,45,47,49,52,55,57,60]
[null,"MONDE",82,90,95,100,102,107,112,80,85,90,95,97,100,105,72,77,82,85,90,92,97,67,72,75,77,82,85,90,60,65,67,70,75,77,82,55,57,62,65,67,70,72,50,52,55,57,60,62,65,46,48,50,53,56,58,61]
[null,"INTERNATIONAL B",1000,1000,1000,1000,1000,1000,1000,1000,1000,1000,1000,1000,1000,1000,1000,1000,1000,1000,1000,1000,1000,1000,1000,1000,1000,1000,1000,1000,1000,1000,1000,1000,1000,1000,1000,1000,1000,1000,1000,1000,1000,1000,1000,1000,1000,1000,1000,1000,1000,1000,1000,1000,1000,1000,1000,1000]
[null,"INTERNATIONAL A",1000,1000,1000,1000,1000,1000,1000,1000,1000,1000,1000,1000,1000,1000,1000,1000,1000,1000,1000,1000,1000,1000,1000,1000,1000,1000,1000,1000,1000,1000,1000,1000,1000,1000,1000,1000,1000,1000,1000,1000,1000,1000,1000,1000,1000,1000,1000,1000,1000,1000,1000,1000,1000,1000,1000,1000]
[null,"OLYMPIQUE",1000,1000,1000,1000,1000,1000,1000,1000,1000,1000,1000,1000,1000,1000,1000,1000,1000,1000,1000,1000,1000,1000,1000,1000,1000,1000,1000,1000,1000,1000,1000,1000,1000,1000,1000,1000,1000,1000,1000,1000,1000,1000,1000,1000,1000,1000,1000,1000,1000,1000,1000,1000,1000,1000,1000,1000]
[null,null,null,null,null,null,"VF35","VF40","VF45","VF50","VF55","VF60","VF65","VF70+"]
[null,null,null,null,null,20.010000000000002,"VF35-48","VF40-48","VF45-48","VF50-48","VF55-48","VF60-48","VF65-48","VF70+-48"]
[null,null,null,null,null,30.01,"VF35-48","VF40-48","VF45-48","VF50-48","VF55-48","VF60-48","VF65-48","VF70+-48"]
[null,null,null,null,null,35.01,"VF35-48","VF40-48","VF45-48","VF50-48","VF55-48","VF60-48","VF65-48","VF70+-48"]
[null,null,null,null,null,36.01,"VF35-48","VF40-48","VF45-48","VF50-48","VF55-48","VF60-48","VF65-48","VF70+-48"]
[null,null,null,null,null,40.01,"VF35-48","VF40-48","VF45-48","VF50-48","VF55-48","VF60-48","VF65-48","VF70+-48"]
[null,null,null,null,null,44.01,"VF35-48","VF40-48","VF45-48","VF50-48","VF55-48","VF60-48","VF65-48","VF70+-48"]
[null,null,null,null,null,48.01,"VF35-53","VF40-53","VF45-53","VF50-53","VF55-53","VF60-53","VF65-53","VF70+-53"]
[null,null,null,null,null,53.01,"VF35-58","VF40-58","VF45-58","VF50-58","VF55-58","VF60-58","VF65-58","VF70+-58"]
[null,null,null,null,null,58.01,"VF35-63","VF40-63","VF45-63","VF50-63","VF55-63","VF60-63","VF65-63","VF70+-63"]
[null,null,null,null,null,63.01,"VF35-69","VF40-69","VF45-69","VF50-69","VF55-69","VF60-69","VF65-69","VF70+-69"]
[null,null,null,null,null,69.010000000000005,"VF35-75","VF40-75","VF45-75","VF50-75","VF55-75","VF60-75","VF65-75","VF70+-75"]
[null,null,null,null,null,75.010000000000005,"VF35+75","VF40+75","VF45+75","VF50+75","VF55+75","VF60+75","VF65+75","VF70++75"]
[null,null,null,null,null,110,"VF35+75","VF40+75","VF45+75","VF50+75","VF55+75","VF60+75","VF65+75","VF70++75"]
[null,null,null,null,null,140,"VF35+75","VF40+75","VF45+75","VF50+75","VF55+75","VF60+75","VF65+75","VF70++75"]

{"sheet":"Feuil2","index":2,"n_rows":85,"n_cols":83,"rows_kept":85,"cut":false,"hidden":true,"merged":[]}
[null,null,"VH35-56","VH35-62","VH35-69","VH35-77","VH35-85","VH35-94","VH35-105","VH35+105","VH40-56","VH40-62","VH40-69","VH40-77","VH40-85","VH40-94","VH40-105","VH40+105","VH45-56","VH45-62","VH45-69","VH45-77","VH45-85","VH45-94","VH45-105","VH45+105","VH50-56","VH50-62","VH50-69","VH50-77","VH50-85","VH50-94","VH50-105","VH50+105","VH55-56","VH55-62","VH55-69","VH55-77","VH55-85","VH55-94","VH55-105","VH55+105","VH60-56","VH60-62","VH60-69","VH60-77","VH60-85","VH60-94","VH60-105","VH60+105","VH65-56","VH65-62","VH65-69","VH65-77","VH65-85","VH65-94","VH65-105","VH65+105","VH70-56","VH70-62","VH70-69","VH70-77","VH70-85","VH70-94","VH70-105","VH70+105","VH75-56","VH75-62","VH75-69","VH75-77","VH75-85","VH75-94","VH75-105","VH75+105","VH80+-56","VH80+-62","VH80+-69","VH80+-77","VH80+-85","VH80+-94","VH80+-105","VH80++105"]
[null,null,null,null,null,null,null,null,null,null,null,null,null,null,null,null,null,null,null,null,null,null,null,null,null,null,null,null,null,null,null,null,null,null,null,null,null,null,null,null,null,null,null,null,null,null,null,null,null,null,null," "]
[null,"REGION",117,132,147,162,172,182,190,197,110,125,140,152,162,172,180,187,105,117,130,145,155,162,170,177,95,107,120,130,140,147,155,162,82,92,105,115,122,130,137,145,72,82,92,102,110,117,122,130,60,70,77,87,92,100,102,107,47,55,62,70,75,80,82,87,42,47,55,62,67,70,75,80,40,45,50,60,63,64,69,70,"REGIONAL"]
[null,"France",127,142,157,172,182,192,200,202,120,135,150,162,172,18,190,197,115,127,140,155,165,172,180,187,105,117,130,140,150,157,165,172,92,102,115,125,132,140,147,155,82,92,102,112,120,127,132,140,70,80,87,97,102,110,112,117,57,65,72,80,85,90,92,97,52,57,65,72,77,80,85,90,50,55,58,62,64,65,70,75,"France"]
[null,"EUROPE",137,152,167,182,192,202,210,217,130,145,160,172,182,192,200,207,125,137,150,165,175,182,190,197,115,127,140,150,160,167,175,182,102,112,125,135,142,150,157,165,92,102,112,122,130,137,142,150,80,90,97,107,112,120,122,127,67,75,82,90,95,100,102,107,62,67,75,82,87,90,95,100,54,56,59,64,69,71,76,79,"EUROPE"]
[null,"MONDE",155,172,187,202,215,227,237,245,147,162,177,192,205,215,225,232,140,155,170,185,195,205,212,222,130,142,157,170,180,190,197,205,115,127,140,152,162,170,177,182,105,117,127,137,147,155,160,167,92,102,112,120,127,135,140,145,75,82,90,97,102,107,112,117,67,75,82,87,95,97,102,107,55,57,60,65,70,72,77,80,"MONDE"]
[null,"INTERNATIONAL B",1000,1000,1000,1000,1000,1000,1000,1000,1000,1000,1000,1000,1000,1000,1000,1000,1000,1000,1000,1000,1000,1000,1000,1000,1000,1000,1000,1000,1000,1000,1000,1000,1000,1000,1000,1000,1000,1000,1000,1000,1000,1000,1000,1000,1000,1000,1000,1000,1000,1000,1000,1000,1000,1000,1000,1000,1000,1000,1000,1000,1000,1000,1000,1000,1000,1000,1000,1000,1000,1000,1000,1000,1000,1000,1000,1000,1000,1000,1000,1000]
[null,"INTERNATIONAL A",1000,1000,1000,1000,1000,1000,1000,1000,1000,1000,1000,1000,1000,1000,1000,1000,1000,1000,1000,1000,1000,1000,1000,1000,1000,1000,1000,1000,1000,1000,1000,1000,1000,1000,1000,1000,1000,1000,1000,1000,1000,1000,1000,1000,1000,1000,1000,1000,1000,1000,1000,1000,1000,1000,1000,1000,1000,1000,1000,1000,1000,1000,1000,1000,1000,1000,1000,1000,1000,1000,1000,1000,1000,1000,1000,1000,1000,1000,1000,1000]
[null,"OLYMPIQUE",1000,1000,1000,1000,1000,1000,1000,1000,1000,1000,1000,1000,1000,1000,1000,1000,1000,1000,1000,1000,1000,1000,1000,1000,1000,1000,1000,1000,1000,1000,1000,1000,1000,1000,1000,1000,1000,1000,1000,1000,1000,1000,1000,1000,1000,1000,1000,1000,1000,1000,1000,1000,1000,1000,1000,1000,1000,1000,1000,1000,1000,1000,1000,1000,1000,1000,1000,1000,1000,1000,1000,1000,1000,1000,1000,1000,1000,1000,1000,1000]
[null,null,null,null,null,null,"VH35","VH40","VH45","VH50","VH55","VH60","VH65","VH70","VH75","VH80+"]
[null,null,null,null,null,20.010000000000002,"VH35-56","VH40-56","VH45-56","VH50-56","VH55-56","VH60-56","VH65-56","VH70-56","VH75-56","VH80+-56"]
[null,null,null,null,null,34.01,"VH35-56","VH40-56","VH45-56","VH50-56","VH55-56","VH60-56","VH65-56","VH70-56","VH75-56","VH80+-56"]
[null,null,null,null,null,38.01,"VH35-56","VH40-56","VH45-56","VH50-56","VH55-56","VH60-56","VH65-56","VH70-56","VH75-56","VH80+-56"]
[null,null,null,null,null,40.01,"VH35-56","VH40-56","VH45-56","VH50-56","VH55-56","VH60-56","VH65-56","VH70-56","VH75-56","VH80+-56"]
[null,null,null,null,null,45.01,"VH35-56","VH40-56","VH45-56","VH50-56","VH55-56","VH60-56","VH65-56","VH70-56","VH75-56","VH80+-56"]
[null,null,null,null,null,50.01,"VH35-56","VH40-56","VH45-56","VH50-56","VH55-56","VH60-56","VH65-56","VH70-56","VH75-56","VH80+-56"]
[null,null,null,null,null,52.05,"VH35-56","VH40-56","VH45-56","VH50-56","VH55-56","VH60-56","VH65-56","VH70-56","VH75-56","VH80+-56"]
[null,null,null,null,null,56.01,"VH35-62","VH40-62","VH45-62","VH50-62","VH55-62","VH60-62","VH65-62","VH70-62","VH75-62","VH80+-62"]
[null,null,null,null,null,62.01,"VH35-69","VH40-69","VH45-69","VH50-69","VH55-69","VH60-69","VH65-69","VH70-69","VH75-69","VH80+-69"]
[null,null,null,null,null,69.010000000000005,"VH35-77","VH40-77","VH45-77","VH50-77","VH55-77","VH60-77","VH65-77","VH70-77","VH75-77","VH80+-77"]
[null,null,null,null,null,77.010000000000005,"VH35-85","VH40-85","VH45-85","VH50-85","VH55-85","VH60-85","VH65-85","VH70-85","VH75-85","VH80+-85"]
[null,null,null,null,null,85.01,"VH35-94","VH40-94","VH45-94","VH50-94","VH55-94","VH60-94","VH65-94","VH70-94","VH75-94","VH80+-94"]
[null,null,null,null,null,94.01,"VH35-105","VH40-105","VH45-105","VH50-105","VH55-105","VH60-105","VH65-105","VH70-105","VH75-105","VH80+-105"]
[null,null,null,null,null,105.01,"VH35+105","VH40+105","VH45+105","VH50+105","VH55+105","VH60+105","VH65+105","VH70+105","VH75+105","VH80++105"]
[null,null,null,null,null,110,"VH35+105","VH40+105","VH45+105","VH50+105","VH55+105","VH60+105","VH65+105","VH70+105","VH75+105","VH80++105"]
[null,null,null,null,null,120,"VH35+105","VH40+105","VH45+105","VH50+105","VH55+105","VH60+105","VH65+105","VH70+105","VH75+105","VH80++105"]
[null,null,null,null,null,130,"VH35+105","VH40+105","VH45+105","VH50+105","VH55+105","VH60+105","VH65+105","VH70+105","VH75+105","VH80++105"]
[null,null,null,null,null,140,"VH35+105","VH40+105","VH45+105","VH50+105","VH55+105","VH60+105","VH65+105","VH70+105","VH75+105","VH80++105"]
[]
[null,null,null,null,null,35,1.0720000000000001]
[null,null,null,null,null,36,1.087]
[null,null,null,null,null,37,1.1000000000000001]
[null,null,null,null,null,38,1.113]
[null,null,null,null,null,39,1.125]
[null,null,null,null,null,40,1.1359999999999999]
[null,null,null,null,null,41,1.147]
[null,null,null,null,null,42,1.1579999999999999]
[null,null,null,null,null,43,1.17]
[null,null,null,null,null,44,1.1830000000000001]
[null,null,null,null,null,45,1.1950000000000001]
[null,null,null,null,null,46,1.2070000000000001]
[null,null,null,null,null,47,1.2170000000000001]
[null,null,null,null,null,48,1.226]
[null,null,null,null,null,49,1.234]
[null,null,null,null,null,50,1.2430000000000001]
[null,null,null,null,null,51,1.2549999999999999]
[null,null,null,null,null,52,1.2709999999999999]
[null,null,null,null,null,53,1.2929999999999999]
[null,null,null,null,null,54,1.319]
[null,null,null,null,null,55,1.35]
[null,null,null,null,null,56,1.3839999999999999]
[null,null,null,null,null,57,1.417]
[null,null,null,null,null,58,1.4490000000000001]
[null,null,null,null,null,59,1.48]
[null,null,null,null,null,60,1.5089999999999999]
[null,null,null,null,null,61,1.536]
[null,null,null,null,null,62,1.5609999999999999]
[null,null,null,null,null,63,1.5840000000000001]
[null,null,null,null,null,64,1.6080000000000001]
[null,null,null,null,null,65,1.6359999999999999]
[null,null,null,null,null,66,1.671]
[null,null,null,null,null,67,1.7190000000000001]
[null,null,null,null,null,68,1.782]
[null,null,null,null,null,69,1.8560000000000001]
[null,null,null,null,null,70,1.9330000000000001]
[null,null,null,null,null,71,2.0019999999999998]
[null,null,null,null,null,72,2.0529999999999999]
[null,null,null,null,null,73,2.0870000000000002]
[null,null,null,null,null,74,2.113]
[null,null,null,null,null,75,2.1419999999999999]
[null,null,null,null,null,76,2.1840000000000002]
[null,null,null,null,null,77,2.2509999999999999]
[null,null,null,null,null,78,2.3580000000000001]
[null,null,null,null,null,79,2.5]
[null,null,null,null,null,80,2.669]
[null,null,null,null,null,81,2.8490000000000002]
[null,null,null,null,null,82,3.0179999999999998]
[null,null,null,null,null,83,3.1659999999999999]
[null,null,null,null,null,84,3.2879999999999998]
[null,null,null,null,null,85,3.3860000000000001]
[null,null,null,null,null,86,3.4580000000000002]
[null,null,null,null,null,87,3.508]
[null,null,null,null,null,88,3.54]
[null,null,null,null,null,89,3.5590000000000002]
[null,null,null,null,null,90,3.5710000000000002]

{"sheet":"Feuil3","index":3,"n_rows":0,"n_cols":0,"rows_kept":0,"cut":false,"hidden":true,"merged":[]}