{"text_format":"1","workbook":"xlsx","n_sheets":4,"sheets":["Feuil1","FEMMES","HOMMES","Feuil2"],"not_rendered":{"charts":0,"images":0,"macros":1,"external_links":0,"defined_names":4,"comments":0,"pivot_tables":0},"unopened":[],"bounds":{"document_bytes":16777216,"sheet_cells":100000,"rows_first":2000,"rows_last":500,"rows_between":2000,"halvings":0,"cell_chars":16384,"cell_head_chars":4096},"cells_cut":0,"cells_raw":0,"read":"whole","date_system":"1900"}

{"sheet":"Feuil1","index":0,"n_rows":29,"n_cols":64,"rows_kept":29,"cut":false,"hidden":true,"merged":[]}
[null,null,"FC1 40","FC1 44","FC1 48","FC1 53","FC1 58","FC1 63","FC1 69","FC1 +69","FC2 44","FC2 48","FC2 53","FC2 58","FC2 63","FC2 69","FC2 +69","FJ48","FJ53","FJ58","FJ63","FJ69","FJ75","FJ+75","FS48","FS53","FS58","FS63","FS69","FS75","FS+75","C1 45","C1 50","C1 56","C1 62","C1 69","C1 77","C1 85","C1 94","C1 +94","C2 50","C2 56","C2 62","C2 69","C2 77","C2 85","C2 94","C2 +94","J56","J62","J69","J77","J85","J94","J105","J+105","S56","S62","S69","S77","S85","S94","S105","S+105"]
[null,"DEBUTANT",20,25,30,35,40,45,50,60,30,35,45,50,55,60,70,45,55,60,65,70,80,90,55,65,70,75,80,95,100,35,40,50,75,85,90,100,110,120,45,65,85,95,110,120,125,135,80,90,110,130,145,150,155,165,95,120,130,150,165,170,175,185]
[null,"DEPARTEMENTAL",25,30,35,45,50,55,60,70,40,45,55,60,65,70,80,55,65,70,75,80,95,100,65,75,80,85,90,105,110,50,55,70,95,105,110,120,130,140,65,85,105,115,130,140,145,155,100,120,130,150,165,170,175,185,115,135,150,170,185,190,195,205]
[null,"REGIONAL",35,40,45,55,60,65,70,80,50,55,65,70,75,80,95,65,75,80,85,90,105,110,75,85,90,95,105,115,125,60,65,85,105,115,130,140,145,155,80,100,120,130,150,160,165,175,115,135,150,170,185,190,195,205,130,150,170,190,205,215,220,225]
[null,"INTERREGIONAL",45,50,55,65,70,75,80,95,60,65,75,80,85,90,105,75,85,90,95,105,115,125,85,95,100,110,120,130,140,75,80,100,120,130,150,160,165,175,95,115,135,150,170,180,185,195,130,150,170,190,205,215,220,225,145,170,190,210,225,235,245,250]
[null,"FEDERAL",50,60,65,75,80,85,90,105,70,75,85,90,95,105,115,85,95,100,110,120,130,140,95,105,115,125,135,145,150,90,95,115,135,150,170,180,185,195,110,130,150,170,185,200,210,220,145,170,190,210,225,235,245,250,170,190,220,240,250,260,270,280]
[null,"NATIONAL",60,70,75,85,90,95,105,115,80,85,95,100,110,120,130,95,105,115,125,135,145,150,110,120,130,140,150,160,170,105,110,130,150,170,185,200,210,220,120,145,170,190,200,220,225,235,170,190,220,240,250,260,270,280,190,210,240,265,280,290,300,310]
[null,"INTERNATIONAL B",70,80,85,95,100,110,120,130,90,95,105,115,125,135,145,110,120,130,140,150,160,170,125,140,150,160,170,180,190,115,120,145,170,190,200,220,225,235,135,170,190,210,220,240,250,260,190,210,240,260,280,290,300,310,210,230,260,285,300,310,325,330]
[null,"INTERNATIONAL A",80,90,95,105,115,125,135,145,100,110,120,130,140,150,160,125,135,150,160,170,180,190,140,160,170,180,190,195,210,130,135,170,190,210,220,240,250,260,150,190,210,230,250,260,280,280,210,230,250,285,300,310,325,330,225,255,275,305,325,330,345,355]
[null,"OLYMPIQUE",1000,1000,1000,1000,1000,1000,1000,1000,1000,1000,1000,1000,1000,1000,1000,1000,1000,1000,1000,1000,1000,1000,155,175,190,200,205,210,225,1000,1000,1000,1000,1000,1000,10000,1000,1000,1000,1000,1000,1000,1000,10000,1000,1000,1000,1000,1000,10000,1000,1000,1000,10000,240,270,290,320,345,355,365,375]
[null,"MINIME","CADET","CADET","JUNIOR","SENIOR",null,"MINIME","CADETTE","CADETTE","JUNIOR","SENIOR"]
[20.010000000000002,"NON","C1 45","C2 50","J56","S56",20.010000000000002,"NON","FC1 40","FC2 44","FJ48","FS48"]
[34.01,"NON","C1 45","C2 50","J56","S56",30.01,"NON","FC1 40","FC2 44","FJ48","FS48"]
[38.01,"NON","C1 45","C2 50","J56","S56",35.01,"NON","FC1 40","FC2 44","FJ48","FS48"]
[40.01,"NON","C1 45","C2 50","J56","S56",36.01,"NON","FC1 40","FC2 44","FJ48","FS48"]
[45.01,"NON","C1 50","C2 50","J56","S56",40.01,"NON","FC1 44","FC2 44","FJ48","FS48"]
[50.01,"NON","C1 56","C2 56","J56","S56",44.01,"NON","FC1 48","FC2 48","FJ48","FS48"]
[52.05,"NON","C1 56","C2 56","J56","S56",48.01,"NON","FC1 53","FC2 53","FJ53","FS53"]
[56.01,"NON","C1 62","C2 62","J62","S62",53.01,"NON","FC1 58","FC2 58","FJ58","FS58"]
[62.01,"NON","C1 69","C2 69","J69","S69",58.01,"NON","FC1 63","FC2 63","FJ63","FS63"]
[69.010000000000005,"NON","C1 77","C2 77","J77","S77",63.01,"NON","FC1 69","FC2 69","FJ69","FS69"]
[77.010000000000005,"NON","C1 85","C2 85","J85","S85",69.010000000000005,"NON","FC1 +69","FC2 +69","FJ75","FS75"]
[85.01,"NON","C1 94","C2 94","J94","S94",75.010000000000005,"NON","FC1 +69","FC2 +69","FJ+75","FS+75"]
[94.01,"NON","C1 +94","C2 +94","J105","S105",110,"NON","FC1 +69","FC2 +69","FJ+75","FS+75"]
[105.01,"NON","C1 +94","C2 +94","J+105","S+105",140,"NON","FC1 +69","FC2 +69","FJ+75","FS+75"]
[110,"NON","C1 +94","C2 +94","J+105","S+105"]
[120,"NON","C1 +94","C2 +94","J+105","S+105"]
[130,"NON","C1 +94","C2 +94","J+105","S+105"]
[140,"NON","C1 +94","C2 +94","J+105","S+105",null,null,null,null,null,null,null,null,null,null,null,null,null,null,null,null,null,null,null,null,null,null,null,null,null,null,null," "]

{"sheet":"FEMMES","index":1,"n_rows":537,"n_cols":50,"rows_kept":537,"cut":false,"hidden":false,"merged":[[20,7,20,10],[24,7,24,10],[0,2,0,10],[0,17,0,18],[0,21,0,22],[4,7,4,10],[5,9,7,9],[8,7,8,10],[12,7,12,10],[16,7,16,10],[3,21,3,22],[1,11,1,13],[0,24,1,24],[1,7,1,8],[1,14,1,18],[1,19,1,20],[1,21,1,23],[30,1,30,4],[30,5,30,6],[30,10,30,15],[30,19,30,23],[31,1,31,4],[31,5,31,6],[31,8,31,9],[31,10,31,15],[31,17,31,18],[32,1,32,4],[32,5,32,6],[32,10,32,15],[33,1,33,4],[33,5,33,6],[34,1,34,4],[34,5,34,6],[34,10,34,13],[34,15,34,18],[34,21,34,23]]}
[null,null,"COUPE DE FRANCE DES CLUBS JEUNES     2017",null,null,null,null,null,null,null,null,null,null,null,"TOUR :",null,null,null,null," ",null,null,null,null,"FEMMES   CA/JU"]
[null,null,null,null,null,null,"LIEU :",null,null,null,null,"REGION :",null,null,null,null,null,null,null,"Date :"]
[]
["SEXE","ZONE","REG.","CL.","LICENCE","NOMS","Prénoms","AN","POIDS","CLUB","NAT",1,2,3,"ARR",1,2,3,"EP-J","Total","IWF","SERIE",null,"Catég"," ",null," ","DEB ","DEP +","REG +","IRG +","FED +","NAT +","INTB +","INTA +","OLY +"]
[null,"Tirage au sort :",null,null,null,null,null,"Classement :",null,null,null,{"$f":"IF(Y5=\"\",\"\",RANK(Y5,$Z$6:$Z$11,0))","v":1},null,null,null,null,null,null,null,null,null,null,null,null,{"$f":"SUM(U6:U8)","v":691.91658664457714},null," ",{"$f":"T5-HLOOKUP(X5,Feuil1!$C$1:$BJ$10,2,FALSE)","v":{"$error":"#N/A"}},{"$f":"T5-HLOOKUP(X5,Feuil1!$C$1:$BJ$10,3,FALSE)","v":{"$error":"#N/A"}},{"$f":"T5-HLOOKUP(X5,Feuil1!$C$1:$BJ$10,4,FALSE)","v":{"$error":"#N/A"}},{"$f":"T5-HLOOKUP(X5,Feuil1!$C$1:$BJ$10,5,FALSE)","v":{"$error":"#N/A"}},{"$f":"T5-HLOOKUP(X5,Feuil1!$C$1:$BJ$10,6,FALSE)","v":{"$error":"#N/A"}},{"$f":"T5-HLOOKUP(X5,Feuil1!$C$1:$BJ$10,7,FALSE)","v":{"$error":"#N/A"}},{"$f":"T5-HLOOKUP(X5,Feuil1!$C$1:$BJ$10,8,FALSE)","v":{"$error":"#N/A"}},{"$f":"T5-HLOOKUP(X5,Feuil1!$C$1:$BJ$10,9,FALSE)","v":{"$error":"#N/A"}},{"$f":"T5-HLOOKUP(X5,Feuil1!$C$1:$BJ$10,10,FALSE)","v":{"$error":"#N/A"}},null,null,null,null,null,null,{"$f":"IF(AJ5>=0,$AJ$4,IF(AI5>=0,$AI$4,IF(AH5>=0,$AH$4,IF(AG5>=0,$AG$4,IF(AF5>=0,$AF$4,IF(AE5>=0,$AE$4,IF(AD5>=0,$AD$4,IF(AC5>=0,$AC$4,$AB$4))))))))","v":{"$error":"#N/A"}}]
["F","SEST","RAL",1,null,null,null,1997,53,null,null,75,null,null,{"$f":"IF(H6=\"\",\"\",IF(MAXA(L6:N6)<=0,0,MAXA(L6:N6)))","v":75},89,null,null,{"$f":"IF(H6=\"\",\"\",IF(MAXA(P6:R6)<=0,0,MAXA(P6:R6)))","v":89},{"$f":"IF(I6=\"\",\"\",O6+S6)","v":164},{"$f":"IF(I6=\"\",\"\",IF(A6=\"H\",10^(0.794358141*LOG(I6/174.393)^2)*T6,IF(A6=\"F\",10^(0.89726074*LOG(I6/148.026)^2)*T6,\"\")))","v":247.38484922207783},{"$f":"IF(H6=\"\",\"\",AQ6)","v":"INTA +"},{"$f":"IF(AJ6>=0,AJ6,IF(AI6>=0,AI6,IF(AH6>=0,AH6,IF(AG6>=0,AG6,IF(AF6>=0,AF6,IF(AE6>=0,AE6,IF(AD6>=0,AD6,IF(AC6>=0,AC6,AB6))))))))","v":29},{"$f":"IF(I6=\"\",\"\",IF(A6=\"H\",IF(OR(H6=\"SEN\",H6<1997),VLOOKUP(I6,Feuil1!$A$11:$G$29,6),IF(AND(H6>1996,H6<2000),VLOOKUP(I6,Feuil1!$A$11:$G$29,5),IF(AND(H6>1999,H6<2002),VLOOKUP(I6,Feuil1!$A$11:$G$29,4),IF(AND(H6>2001,H6<2004),VLOOKUP(I6,Feuil1!$A$11:$G$29,3),VLOOKUP(I6,Feuil1!$A$11:$G$29,2))))),IF(OR(H6=\"SEN\",H6<1997),VLOOKUP(I6,Feuil1!$G$11:$L$25,6),IF(AND(H6>1996,H6<2000),VLOOKUP(I6,Feuil1!$G$11:$L$25,5),IF(AND(H6>1999,H6<2002),VLOOKUP(I6,Feuil1!$G$11:$L$25,4),IF(AND(H6>2001,H6<2004),VLOOKUP(I6,Feuil1!$G$11:$L$25,3),VLOOKUP(I6,Feuil1!$G$11:$L$25,2)))))))","v":"FJ53"},null,{"$f":"Y5","v":691.91658664457714}," ",{"$f":"T6-HLOOKUP(X6,Feuil1!$C$1:$BJ$10,2,FALSE)","v":109},{"$f":"T6-HLOOKUP(X6,Feuil1!$C$1:$BJ$10,3,FALSE)","v":99},{"$f":"T6-HLOOKUP(X6,Feuil1!$C$1:$BJ$10,4,FALSE)","v":89},{"$f":"T6-HLOOKUP(X6,Feuil1!$C$1:$BJ$10,5,FALSE)","v":79},{"$f":"T6-HLOOKUP(X6,Feuil1!$C$1:$BJ$10,6,FALSE)","v":69},{"$f":"T6-HLOOKUP(X6,Feuil1!$C$1:$BJ$10,7,FALSE)","v":59},{"$f":"T6-HLOOKUP(X6,Feuil1!$C$1:$BJ$10,8,FALSE)","v":44},{"$f":"T6-HLOOKUP(X6,Feuil1!$C$1:$BJ$10,9,FALSE)","v":29},{"$f":"T6-HLOOKUP(X6,Feuil1!$C$1:$BJ$10,10,FALSE)","v":-836},null,null,null,null,null,null,{"$f":"IF(AJ6>=0,$AJ$4,IF(AI6>=0,$AI$4,IF(AH6>=0,$AH$4,IF(AG6>=0,$AG$4,IF(AF6>=0,$AF$4,IF(AE6>=0,$AE$4,IF(AD6>=0,$AD$4,IF(AC6>=0,$AC$4,$AB$4))))))))","v":"INTA +"}]
["F","SEST","RAL",1,null,null,null,1998,58,null,null,72,null,null,72,88,null,null,88,{"$f":"IF(I7=\"\",\"\",O7+S7)","v":160},225.26027413604427,"INTA +",10,{"$f":"IF(I7=\"\",\"\",IF(A7=\"H\",IF(OR(H7=\"SEN\",H7<1997),VLOOKUP(I7,Feuil1!$A$11:$G$29,6),IF(AND(H7>1996,H7<2000),VLOOKUP(I7,Feuil1!$A$11:$G$29,5),IF(AND(H7>1999,H7<2002),VLOOKUP(I7,Feuil1!$A$11:$G$29,4),IF(AND(H7>2001,H7<2004),VLOOKUP(I7,Feuil1!$A$11:$G$29,3),VLOOKUP(I7,Feuil1!$A$11:$G$29,2))))),IF(OR(H7=\"SEN\",H7<1997),VLOOKUP(I7,Feuil1!$G$11:$L$25,6),IF(AND(H7>1996,H7<2000),VLOOKUP(I7,Feuil1!$G$11:$L$25,5),IF(AND(H7>1999,H7<2002),VLOOKUP(I7,Feuil1!$G$11:$L$25,4),IF(AND(H7>2001,H7<2004),VLOOKUP(I7,Feuil1!$G$11:$L$25,3),VLOOKUP(I7,Feuil1!$G$11:$L$25,2)))))))","v":"FJ58"},null,{"$f":"Y9","v":628.53456806112854}," ",{"$f":"T7-HLOOKUP(X7,Feuil1!$C$1:$BJ$10,2,FALSE)","v":100},{"$f":"T7-HLOOKUP(X7,Feuil1!$C$1:$BJ$10,3,FALSE)","v":90},{"$f":"T7-HLOOKUP(X7,Feuil1!$C$1:$BJ$10,4,FALSE)","v":80},{"$f":"T7-HLOOKUP(X7,Feuil1!$C$1:$BJ$10,5,FALSE)","v":70},{"$f":"T7-HLOOKUP(X7,Feuil1!$C$1:$BJ$10,6,FALSE)","v":60},{"$f":"T7-HLOOKUP(X7,Feuil1!$C$1:$BJ$10,7,FALSE)","v":45},{"$f":"T7-HLOOKUP(X7,Feuil1!$C$1:$BJ$10,8,FALSE)","v":30},{"$f":"T7-HLOOKUP(X7,Feuil1!$C$1:$BJ$10,9,FALSE)","v":10},{"$f":"T7-HLOOKUP(X7,Feuil1!$C$1:$BJ$10,10,FALSE)","v":-840},null,null,null,null,null,null,"INTA +"]
["F","SEST","RAL",1,null,null,null,1999,63,null,null,70,null,null,70,95,null,null,95,165,219.27146328645503,"INTA +",5,{"$f":"IF(I8=\"\",\"\",IF(A8=\"H\",IF(OR(H8=\"SEN\",H8<1997),VLOOKUP(I8,Feuil1!$A$11:$G$29,6),IF(AND(H8>1996,H8<2000),VLOOKUP(I8,Feuil1!$A$11:$G$29,5),IF(AND(H8>1999,H8<2002),VLOOKUP(I8,Feuil1!$A$11:$G$29,4),IF(AND(H8>2001,H8<2004),VLOOKUP(I8,Feuil1!$A$11:$G$29,3),VLOOKUP(I8,Feuil1!$A$11:$G$29,2))))),IF(OR(H8=\"SEN\",H8<1997),VLOOKUP(I8,Feuil1!$G$11:$L$25,6),IF(AND(H8>1996,H8<2000),VLOOKUP(I8,Feuil1!$G$11:$L$25,5),IF(AND(H8>1999,H8<2002),VLOOKUP(I8,Feuil1!$G$11:$L$25,4),IF(AND(H8>2001,H8<2004),VLOOKUP(I8,Feuil1!$G$11:$L$25,3),VLOOKUP(I8,Feuil1!$G$11:$L$25,2)))))))","v":"FJ63"},null,{"$f":"Y13","v":674.81317597419252}," ",{"$f":"T8-HLOOKUP(X8,Feuil1!$C$1:$BJ$10,2,FALSE)","v":100},{"$f":"T8-HLOOKUP(X8,Feuil1!$C$1:$BJ$10,3,FALSE)","v":90},{"$f":"T8-HLOOKUP(X8,Feuil1!$C$1:$BJ$10,4,FALSE)","v":80},{"$f":"T8-HLOOKUP(X8,Feuil1!$C$1:$BJ$10,5,FALSE)","v":70},{"$f":"T8-HLOOKUP(X8,Feuil1!$C$1:$BJ$10,6,FALSE)","v":55},{"$f":"T8-HLOOKUP(X8,Feuil1!$C$1:$BJ$10,7,FALSE)","v":40},{"$f":"T8-HLOOKUP(X8,Feuil1!$C$1:$BJ$10,8,FALSE)","v":25},{"$f":"T8-HLOOKUP(X8,Feuil1!$C$1:$BJ$10,9,FALSE)","v":5},{"$f":"T8-HLOOKUP(X8,Feuil1!$C$1:$BJ$10,10,FALSE)","v":-835},null,null,null,null,null,null,"INTA +"]
[null,"Tirage au sort :",null,null,null,null,null,"Classement :",null,null,null,{"$f":"IF(Y9=\"\",\"\",RANK(Y9,$Z$6:$Z$11,0))","v":5},null,null,null,null,null,null,null,null,null,null,null,null,{"$f":"SUM(U10:U12)","v":628.53456806112854},{"$f":"Y17","v":633.88595237425875}]
["F","SEST","RAL",1,null,null,null,1999,85,null,null,-70,-70,-70,0,80,null,null,80,{"$f":"IF(I10=\"\",\"\",O10+S10)","v":80},90.192161839446356,"DEB ",-10,{"$f":"IF(I10=\"\",\"\",IF(A10=\"H\",IF(OR(H10=\"SEN\",H10<1997),VLOOKUP(I10,Feuil1!$A$11:$G$29,6),IF(AND(H10>1996,H10<2000),VLOOKUP(I10,Feuil1!$A$11:$G$29,5),IF(AND(H10>1999,H10<2002),VLOOKUP(I10,Feuil1!$A$11:$G$29,4),IF(AND(H10>2001,H10<2004),VLOOKUP(I10,Feuil1!$A$11:$G$29,3),VLOOKUP(I10,Feuil1!$A$11:$G$29,2))))),IF(OR(H10=\"SEN\",H10<1997),VLOOKUP(I10,Feuil1!$G$11:$L$25,6),IF(AND(H10>1996,H10<2000),VLOOKUP(I10,Feuil1!$G$11:$L$25,5),IF(AND(H10>1999,H10<2002),VLOOKUP(I10,Feuil1!$G$11:$L$25,4),IF(AND(H10>2001,H10<2004),VLOOKUP(I10,Feuil1!$G$11:$L$25,3),VLOOKUP(I10,Feuil1!$G$11:$L$25,2)))))))","v":"FJ+75"},null,{"$f":"Y21","v":639.25599215233467}," ",{"$f":"T10-HLOOKUP(X10,Feuil1!$C$1:$BJ$10,2,FALSE)","v":-10},{"$f":"T10-HLOOKUP(X10,Feuil1!$C$1:$BJ$10,3,FALSE)","v":-20},{"$f":"T10-HLOOKUP(X10,Feuil1!$C$1:$BJ$10,4,FALSE)","v":-30},{"$f":"T10-HLOOKUP(X10,Feuil1!$C$1:$BJ$10,5,FALSE)","v":-45},{"$f":"T10-HLOOKUP(X10,Feuil1!$C$1:$BJ$10,6,FALSE)","v":-60},{"$f":"T10-HLOOKUP(X10,Feuil1!$C$1:$BJ$10,7,FALSE)","v":-70},{"$f":"T10-HLOOKUP(X10,Feuil1!$C$1:$BJ$10,8,FALSE)","v":-90},{"$f":"T10-HLOOKUP(X10,Feuil1!$C$1:$BJ$10,9,FALSE)","v":-110},{"$f":"T10-HLOOKUP(X10,Feuil1!$C$1:$BJ$10,10,FALSE)","v":-920},null,null,null,null,null,null,"DEB "]
["F","SEST","RAL",1,null,null,null,2002,69,null,null,90,null,null,90,110,null,null,110,{"$f":"IF(I11=\"\",\"\",O11+S11)","v":200},250.97207525620468,"INTA +",65,{"$f":"IF(I11=\"\",\"\",IF(A11=\"H\",IF(OR(H11=\"SEN\",H11<1997),VLOOKUP(I11,Feuil1!$A$11:$G$29,6),IF(AND(H11>1996,H11<2000),VLOOKUP(I11,Feuil1!$A$11:$G$29,5),IF(AND(H11>1999,H11<2002),VLOOKUP(I11,Feuil1!$A$11:$G$29,4),IF(AND(H11>2001,H11<2004),VLOOKUP(I11,Feuil1!$A$11:$G$29,3),VLOOKUP(I11,Feuil1!$A$11:$G$29,2))))),IF(OR(H11=\"SEN\",H11<1997),VLOOKUP(I11,Feuil1!$G$11:$L$25,6),IF(AND(H11>1996,H11<2000),VLOOKUP(I11,Feuil1!$G$11:$L$25,5),IF(AND(H11>1999,H11<2002),VLOOKUP(I11,Feuil1!$G$11:$L$25,4),IF(AND(H11>2001,H11<2004),VLOOKUP(I11,Feuil1!$G$11:$L$25,3),VLOOKUP(I11,Feuil1!$G$11:$L$25,2)))))))","v":"FC1 69"},null,{"$f":"Y25","v":508.36651964826598}," ",{"$f":"T11-HLOOKUP(X11,Feuil1!$C$1:$BJ$10,2,FALSE)","v":150},{"$f":"T11-HLOOKUP(X11,Feuil1!$C$1:$BJ$10,3,FALSE)","v":140},{"$f":"T11-HLOOKUP(X11,Feuil1!$C$1:$BJ$10,4,FALSE)","v":130},{"$f":"T11-HLOOKUP(X11,Feuil1!$C$1:$BJ$10,5,FALSE)","v":120},{"$f":"T11-HLOOKUP(X11,Feuil1!$C$1:$BJ$10,6,FALSE)","v":110},{"$f":"T11-HLOOKUP(X11,Feuil1!$C$1:$BJ$10,7,FALSE)","v":95},{"$f":"T11-HLOOKUP(X11,Feuil1!$C$1:$BJ$10,8,FALSE)","v":80},{"$f":"T11-HLOOKUP(X11,Feuil1!$C$1:$BJ$10,9,FALSE)","v":65},{"$f":"T11-HLOOKUP(X11,Feuil1!$C$1:$BJ$10,10,FALSE)","v":-800},null,null,null,null,null,null,"INTA +"]
["F","SEST","RAL",1,null,null,null,2000,75,null,null,110,null,null,110,130,null,null,130,240,287.37033096547748,"INTA +",80,{"$f":"IF(I12=\"\",\"\",IF(A12=\"H\",IF(OR(H12=\"SEN\",H12<1997),VLOOKUP(I12,Feuil1!$A$11:$G$29,6),IF(AND(H12>1996,H12<2000),VLOOKUP(I12,Feuil1!$A$11:$G$29,5),IF(AND(H12>1999,H12<2002),VLOOKUP(I12,Feuil1!$A$11:$G$29,4),IF(AND(H12>2001,H12<2004),VLOOKUP(I12,Feuil1!$A$11:$G$29,3),VLOOKUP(I12,Feuil1!$A$11:$G$29,2))))),IF(OR(H12=\"SEN\",H12<1997),VLOOKUP(I12,Feuil1!$G$11:$L$25,6),IF(AND(H12>1996,H12<2000),VLOOKUP(I12,Feuil1!$G$11:$L$25,5),IF(AND(H12>1999,H12<2002),VLOOKUP(I12,Feuil1!$G$11:$L$25,4),IF(AND(H12>2001,H12<2004),VLOOKUP(I12,Feuil1!$G$11:$L$25,3),VLOOKUP(I12,Feuil1!$G$11:$L$25,2)))))))","v":"FC2 +69"},null,null," ",{"$f":"T12-HLOOKUP(X12,Feuil1!$C$1:$BJ$10,2,FALSE)","v":170},{"$f":"T12-HLOOKUP(X12,Feuil1!$C$1:$BJ$10,3,FALSE)","v":160},{"$f":"T12-HLOOKUP(X12,Feuil1!$C$1:$BJ$10,4,FALSE)","v":145},{"$f":"T12-HLOOKUP(X12,Feuil1!$C$1:$BJ$10,5,FALSE)","v":135},{"$f":"T12-HLOOKUP(X12,Feuil1!$C$1:$BJ$10,6,FALSE)","v":125},{"$f":"T12-HLOOKUP(X12,Feuil1!$C$1:$BJ$10,7,FALSE)","v":110},{"$f":"T12-HLOOKUP(X12,Feuil1!$C$1:$BJ$10,8,FALSE)","v":95},{"$f":"T12-HLOOKUP(X12,Feuil1!$C$1:$BJ$10,9,FALSE)","v":80},{"$f":"T12-HLOOKUP(X12,Feuil1!$C$1:$BJ$10,10,FALSE)","v":-760},null,null,null,null,null,null,"INTA +"]
[null,"Tirage au sort :",null,null,null,null,null,"Classement :",null,null,null,{"$f":"IF(Y13=\"\",\"\",RANK(Y13,$Z$6:$Z$11,0))","v":2},null,null,null,null,null,null,null,null,null,null,null,null,{"$f":"SUM(U14:U16)","v":674.81317597419252}]
["F","SEST","RAL",1,null,null,null,2003,64,null,null,75,null,null,75,90,null,null,90,{"$f":"IF(I14=\"\",\"\",O14+S14)","v":165},217.00545521259792,"INTA +",30,{"$f":"IF(I14=\"\",\"\",IF(A14=\"H\",IF(OR(H14=\"SEN\",H14<1997),VLOOKUP(I14,Feuil1!$A$11:$G$29,6),IF(AND(H14>1996,H14<2000),VLOOKUP(I14,Feuil1!$A$11:$G$29,5),IF(AND(H14>1999,H14<2002),VLOOKUP(I14,Feuil1!$A$11:$G$29,4),IF(AND(H14>2001,H14<2004),VLOOKUP(I14,Feuil1!$A$11:$G$29,3),VLOOKUP(I14,Feuil1!$A$11:$G$29,2))))),IF(OR(H14=\"SEN\",H14<1997),VLOOKUP(I14,Feuil1!$G$11:$L$25,6),IF(AND(H14>1996,H14<2000),VLOOKUP(I14,Feuil1!$G$11:$L$25,5),IF(AND(H14>1999,H14<2002),VLOOKUP(I14,Feuil1!$G$11:$L$25,4),IF(AND(H14>2001,H14<2004),VLOOKUP(I14,Feuil1!$G$11:$L$25,3),VLOOKUP(I14,Feuil1!$G$11:$L$25,2)))))))","v":"FC1 69"},null,null," ",{"$f":"T14-HLOOKUP(X14,Feuil1!$C$1:$BJ$10,2,FALSE)","v":115},{"$f":"T14-HLOOKUP(X14,Feuil1!$C$1:$BJ$10,3,FALSE)","v":105},{"$f":"T14-HLOOKUP(X14,Feuil1!$C$1:$BJ$10,4,FALSE)","v":95},{"$f":"T14-HLOOKUP(X14,Feuil1!$C$1:$BJ$10,5,FALSE)","v":85},{"$f":"T14-HLOOKUP(X14,Feuil1!$C$1:$BJ$10,6,FALSE)","v":75},{"$f":"T14-HLOOKUP(X14,Feuil1!$C$1:$BJ$10,7,FALSE)","v":60},{"$f":"T14-HLOOKUP(X14,Feuil1!$C$1:$BJ$10,8,FALSE)","v":45},{"$f":"T14-HLOOKUP(X14,Feuil1!$C$1:$BJ$10,9,FALSE)","v":30},{"$f":"T14-HLOOKUP(X14,Feuil1!$C$1:$BJ$10,10,FALSE)","v":-835},null,null,null,null,null,null,"INTA +"]
["F","SEST","RAL",1,null,null,null,2000,66,null,null,80,null,null,80,95,null,null,95,{"$f":"IF(I15=\"\",\"\",O15+S15)","v":175},225.65855114960522,"INTA +",25,{"$f":"IF(I15=\"\",\"\",IF(A15=\"H\",IF(OR(H15=\"SEN\",H15<1997),VLOOKUP(I15,Feuil1!$A$11:$G$29,6),IF(AND(H15>1996,H15<2000),VLOOKUP(I15,Feuil1!$A$11:$G$29,5),IF(AND(H15>1999,H15<2002),VLOOKUP(I15,Feuil1!$A$11:$G$29,4),IF(AND(H15>2001,H15<2004),VLOOKUP(I15,Feuil1!$A$11:$G$29,3),VLOOKUP(I15,Feuil1!$A$11:$G$29,2))))),IF(OR(H15=\"SEN\",H15<1997),VLOOKUP(I15,Feuil1!$G$11:$L$25,6),IF(AND(H15>1996,H15<2000),VLOOKUP(I15,Feuil1!$G$11:$L$25,5),IF(AND(H15>1999,H15<2002),VLOOKUP(I15,Feuil1!$G$11:$L$25,4),IF(AND(H15>2001,H15<2004),VLOOKUP(I15,Feuil1!$G$11:$L$25,3),VLOOKUP(I15,Feuil1!$G$11:$L$25,2)))))))","v":"FC2 69"},null,null," ",{"$f":"T15-HLOOKUP(X15,Feuil1!$C$1:$BJ$10,2,FALSE)","v":115},{"$f":"T15-HLOOKUP(X15,Feuil1!$C$1:$BJ$10,3,FALSE)","v":105},{"$f":"T15-HLOOKUP(X15,Feuil1!$C$1:$BJ$10,4,FALSE)","v":95},{"$f":"T15-HLOOKUP(X15,Feuil1!$C$1:$BJ$10,5,FALSE)","v":85},{"$f":"T15-HLOOKUP(X15,Feuil1!$C$1:$BJ$10,6,FALSE)","v":70},{"$f":"T15-HLOOKUP(X15,Feuil1!$C$1:$BJ$10,7,FALSE)","v":55},{"$f":"T15-HLOOKUP(X15,Feuil1!$C$1:$BJ$10,8,FALSE)","v":40},{"$f":"T15-HLOOKUP(X15,Feuil1!$C$1:$BJ$10,9,FALSE)","v":25},{"$f":"T15-HLOOKUP(X15,Feuil1!$C$1:$BJ$10,10,FALSE)","v":-825},null,null,null,null,null,null,"INTA +"]
["F","SEST","RAL",1,null,null,null,1997,69,null,null,85,null,null,85,100,null,null,100,185,232.14916961198932,"INTA +",15,{"$f":"IF(I16=\"\",\"\",IF(A16=\"H\",IF(OR(H16=\"SEN\",H16<1997),VLOOKUP(I16,Feuil1!$A$11:$G$29,6),IF(AND(H16>1996,H16<2000),VLOOKUP(I16,Feuil1!$A$11:$G$29,5),IF(AND(H16>1999,H16<2002),VLOOKUP(I16,Feuil1!$A$11:$G$29,4),IF(AND(H16>2001,H16<2004),VLOOKUP(I16,Feuil1!$A$11:$G$29,3),VLOOKUP(I16,Feuil1!$A$11:$G$29,2))))),IF(OR(H16=\"SEN\",H16<1997),VLOOKUP(I16,Feuil1!$G$11:$L$25,6),IF(AND(H16>1996,H16<2000),VLOOKUP(I16,Feuil1!$G$11:$L$25,5),IF(AND(H16>1999,H16<2002),VLOOKUP(I16,Feuil1!$G$11:$L$25,4),IF(AND(H16>2001,H16<2004),VLOOKUP(I16,Feuil1!$G$11:$L$25,3),VLOOKUP(I16,Feuil1!$G$11:$L$25,2)))))))","v":"FJ69"},null,null," ",{"$f":"T16-HLOOKUP(X16,Feuil1!$C$1:$BJ$10,2,FALSE)","v":115},{"$f":"T16-HLOOKUP(X16,Feuil1!$C$1:$BJ$10,3,FALSE)","v":105},{"$f":"T16-HLOOKUP(X16,Feuil1!$C$1:$BJ$10,4,FALSE)","v":95},{"$f":"T16-HLOOKUP(X16,Feuil1!$C$1:$BJ$10,5,FALSE)","v":80},{"$f":"T16-HLOOKUP(X16,Feuil1!$C$1:$BJ$10,6,FALSE)","v":65},{"$f":"T16-HLOOKUP(X16,Feuil1!$C$1:$BJ$10,7,FALSE)","v":50},{"$f":"T16-HLOOKUP(X16,Feuil1!$C$1:$BJ$10,8,FALSE)","v":35},{"$f":"T16-HLOOKUP(X16,Feuil1!$C$1:$BJ$10,9,FALSE)","v":15},{"$f":"T16-HLOOKUP(X16,Feuil1!$C$1:$BJ$10,10,FALSE)","v":-815},null,null,null,null,null,null,"INTA +"]
[null,"Tirage au sort :",null,null,null,null,null,"Classement :",null,null,null,{"$f":"IF(Y17=\"\",\"\",RANK(Y17,$Z$6:$Z$11,0))","v":4},null,null,null,null,null,null,null,null,null,null,null,null,{"$f":"SUM(U18:U20)","v":633.88595237425875}]
["F","SEST","RAL",1,null,null,null,2003,75,null,null,95,null,null,95,110,null,null,110,{"$f":"IF(I18=\"\",\"\",O18+S18)","v":205},245.4621576996787,"INTA +",60,{"$f":"IF(I18=\"\",\"\",IF(A18=\"H\",IF(OR(H18=\"SEN\",H18<1997),VLOOKUP(I18,Feuil1!$A$11:$G$29,6),IF(AND(H18>1996,H18<2000),VLOOKUP(I18,Feuil1!$A$11:$G$29,5),IF(AND(H18>1999,H18<2002),VLOOKUP(I18,Feuil1!$A$11:$G$29,4),IF(AND(H18>2001,H18<2004),VLOOKUP(I18,Feuil1!$A$11:$G$29,3),VLOOKUP(I18,Feuil1!$A$11:$G$29,2))))),IF(OR(H18=\"SEN\",H18<1997),VLOOKUP(I18,Feuil1!$G$11:$L$25,6),IF(AND(H18>1996,H18<2000),VLOOKUP(I18,Feuil1!$G$11:$L$25,5),IF(AND(H18>1999,H18<2002),VLOOKUP(I18,Feuil1!$G$11:$L$25,4),IF(AND(H18>2001,H18<2004),VLOOKUP(I18,Feuil1!$G$11:$L$25,3),VLOOKUP(I18,Feuil1!$G$11:$L$25,2)))))))","v":"FC1 +69"},null,null," ",{"$f":"T18-HLOOKUP(X18,Feuil1!$C$1:$BJ$10,2,FALSE)","v":145},{"$f":"T18-HLOOKUP(X18,Feuil1!$C$1:$BJ$10,3,FALSE)","v":135},{"$f":"T18-HLOOKUP(X18,Feuil1!$C$1:$BJ$10,4,FALSE)","v":125},{"$f":"T18-HLOOKUP(X18,Feuil1!$C$1:$BJ$10,5,FALSE)","v":110},{"$f":"T18-HLOOKUP(X18,Feuil1!$C$1:$BJ$10,6,FALSE)","v":100},{"$f":"T18-HLOOKUP(X18,Feuil1!$C$1:$BJ$10,7,FALSE)","v":90},{"$f":"T18-HLOOKUP(X18,Feuil1!$C$1:$BJ$10,8,FALSE)","v":75},{"$f":"T18-HLOOKUP(X18,Feuil1!$C$1:$BJ$10,9,FALSE)","v":60},{"$f":"T18-HLOOKUP(X18,Feuil1!$C$1:$BJ$10,10,FALSE)","v":-795},null,null,null,null,null,null,"INTA +"]
["F","SEST","RAL",1,null,null,null,2004,74,null,null,70,null,null,70,85,null,null,85,{"$f":"IF(I19=\"\",\"\",O19+S19)","v":155},186.93121896359594,{"$error":"#N/A"},{"$error":"#N/A"},{"$f":"IF(I19=\"\",\"\",IF(A19=\"H\",IF(OR(H19=\"SEN\",H19<1997),VLOOKUP(I19,Feuil1!$A$11:$G$29,6),IF(AND(H19>1996,H19<2000),VLOOKUP(I19,Feuil1!$A$11:$G$29,5),IF(AND(H19>1999,H19<2002),VLOOKUP(I19,Feuil1!$A$11:$G$29,4),IF(AND(H19>2001,H19<2004),VLOOKUP(I19,Feuil1!$A$11:$G$29,3),VLOOKUP(I19,Feuil1!$A$11:$G$29,2))))),IF(OR(H19=\"SEN\",H19<1997),VLOOKUP(I19,Feuil1!$G$11:$L$25,6),IF(AND(H19>1996,H19<2000),VLOOKUP(I19,Feuil1!$G$11:$L$25,5),IF(AND(H19>1999,H19<2002),VLOOKUP(I19,Feuil1!$G$11:$L$25,4),IF(AND(H19>2001,H19<2004),VLOOKUP(I19,Feuil1!$G$11:$L$25,3),VLOOKUP(I19,Feuil1!$G$11:$L$25,2)))))))","v":"NON"},null,null," ",{"$f":"T19-HLOOKUP(X19,Feuil1!$C$1:$BJ$10,2,FALSE)","v":{"$error":"#N/A"}},{"$f":"T19-HLOOKUP(X19,Feuil1!$C$1:$BJ$10,3,FALSE)","v":{"$error":"#N/A"}},{"$f":"T19-HLOOKUP(X19,Feuil1!$C$1:$BJ$10,4,FALSE)","v":{"$error":"#N/A"}},{"$f":"T19-HLOOKUP(X19,Feuil1!$C$1:$BJ$10,5,FALSE)","v":{"$error":"#N/A"}},{"$f":"T19-HLOOKUP(X19,Feuil1!$C$1:$BJ$10,6,FALSE)","v":{"$error":"#N/A"}},{"$f":"T19-HLOOKUP(X19,Feuil1!$C$1:$BJ$10,7,FALSE)","v":{"$error":"#N/A"}},{"$f":"T19-HLOOKUP(X19,Feuil1!$C$1:$BJ$10,8,FALSE)","v":{"$error":"#N/A"}},{"$f":"T19-HLOOKUP(X19,Feuil1!$C$1:$BJ$10,9,FALSE)","v":{"$error":"#N/A"}},{"$f":"T19-HLOOKUP(X19,Feuil1!$C$1:$BJ$10,10,FALSE)","v":{"$error":"#N/A"}},null,null,null,null,null,null,{"$error":"#N/A"}]
["F","SEST","RAL",1,null,null,null,2000,62,null,null,65,null,null,65,85,null,null,85,150,201.49257571098417,"INTA +",10,{"$f":"IF(I20=\"\",\"\",IF(A20=\"H\",IF(OR(H20=\"SEN\",H20<1997),VLOOKUP(I20,Feuil1!$A$11:$G$29,6),IF(AND(H20>1996,H20<2000),VLOOKUP(I20,Feuil1!$A$11:$G$29,5),IF(AND(H20>1999,H20<2002),VLOOKUP(I20,Feuil1!$A$11:$G$29,4),IF(AND(H20>2001,H20<2004),VLOOKUP(I20,Feuil1!$A$11:$G$29,3),VLOOKUP(I20,Feuil1!$A$11:$G$29,2))))),IF(OR(H20=\"SEN\",H20<1997),VLOOKUP(I20,Feuil1!$G$11:$L$25,6),IF(AND(H20>1996,H20<2000),VLOOKUP(I20,Feuil1!$G$11:$L$25,5),IF(AND(H20>1999,H20<2002),VLOOKUP(I20,Feuil1!$G$11:$L$25,4),IF(AND(H20>2001,H20<2004),VLOOKUP(I20,Feuil1!$G$11:$L$25,3),VLOOKUP(I20,Feuil1!$G$11:$L$25,2)))))))","v":"FC2 63"},null,null," ",{"$f":"T20-HLOOKUP(X20,Feuil1!$C$1:$BJ$10,2,FALSE)","v":95},{"$f":"T20-HLOOKUP(X20,Feuil1!$C$1:$BJ$10,3,FALSE)","v":85},{"$f":"T20-HLOOKUP(X20,Feuil1!$C$1:$BJ$10,4,FALSE)","v":75},{"$f":"T20-HLOOKUP(X20,Feuil1!$C$1:$BJ$10,5,FALSE)","v":65},{"$f":"T20-HLOOKUP(X20,Feuil1!$C$1:$BJ$10,6,FALSE)","v":55},{"$f":"T20-HLOOKUP(X20,Feuil1!$C$1:$BJ$10,7,FALSE)","v":40},{"$f":"T20-HLOOKUP(X20,Feuil1!$C$1:$BJ$10,8,FALSE)","v":25},{"$f":"T20-HLOOKUP(X20,Feuil1!$C$1:$BJ$10,9,FALSE)","v":10},{"$f":"T20-HLOOKUP(X20,Feuil1!$C$1:$BJ$10,10,FALSE)","v":-850},null,null,null,null,null,null,"INTA +"]
[null,"Tirage au sort :",null,null,null,null,null,"Classement :",null,null,null,{"$f":"IF(Y21=\"\",\"\",RANK(Y21,$Z$6:$Z$11,0))","v":3},null,null,null,null,null,null,null,null,null,null,null,null,{"$f":"SUM(U22:U24)","v":639.25599215233467}]
["F","SEST","RAL",1,null,null,null,2003,44,null,null,60,null,null,60,75,null,null,75,{"$f":"IF(I22=\"\",\"\",O22+S22)","v":135},239.56350625638095,"INTA +",45,{"$f":"IF(I22=\"\",\"\",IF(A22=\"H\",IF(OR(H22=\"SEN\",H22<1997),VLOOKUP(I22,Feuil1!$A$11:$G$29,6),IF(AND(H22>1996,H22<2000),VLOOKUP(I22,Feuil1!$A$11:$G$29,5),IF(AND(H22>1999,H22<2002),VLOOKUP(I22,Feuil1!$A$11:$G$29,4),IF(AND(H22>2001,H22<2004),VLOOKUP(I22,Feuil1!$A$11:$G$29,3),VLOOKUP(I22,Feuil1!$A$11:$G$29,2))))),IF(OR(H22=\"SEN\",H22<1997),VLOOKUP(I22,Feuil1!$G$11:$L$25,6),IF(AND(H22>1996,H22<2000),VLOOKUP(I22,Feuil1!$G$11:$L$25,5),IF(AND(H22>1999,H22<2002),VLOOKUP(I22,Feuil1!$G$11:$L$25,4),IF(AND(H22>2001,H22<2004),VLOOKUP(I22,Feuil1!$G$11:$L$25,3),VLOOKUP(I22,Feuil1!$G$11:$L$25,2)))))))","v":"FC1 44"},null,null," ",{"$f":"T22-HLOOKUP(X22,Feuil1!$C$1:$BJ$10,2,FALSE)","v":110},{"$f":"T22-HLOOKUP(X22,Feuil1!$C$1:$BJ$10,3,FALSE)","v":105},{"$f":"T22-HLOOKUP(X22,Feuil1!$C$1:$BJ$10,4,FALSE)","v":95},{"$f":"T22-HLOOKUP(X22,Feuil1!$C$1:$BJ$10,5,FALSE)","v":85},{"$f":"T22-HLOOKUP(X22,Feuil1!$C$1:$BJ$10,6,FALSE)","v":75},{"$f":"T22-HLOOKUP(X22,Feuil1!$C$1:$BJ$10,7,FALSE)","v":65},{"$f":"T22-HLOOKUP(X22,Feuil1!$C$1:$BJ$10,8,FALSE)","v":55},{"$f":"T22-HLOOKUP(X22,Feuil1!$C$1:$BJ$10,9,FALSE)","v":45},{"$f":"T22-HLOOKUP(X22,Feuil1!$C$1:$BJ$10,10,FALSE)","v":-865},null,null,null,null,null,null,"INTA +"]
["F","SEST","RAL",1,null,null,null,2002,48,null," ",50,null,null,50,65,null,null,65,{"$f":"IF(I23=\"\",\"\",O23+S23)","v":115},188.51097889341219,"INTA +",20,{"$f":"IF(I23=\"\",\"\",IF(A23=\"H\",IF(OR(H23=\"SEN\",H23<1997),VLOOKUP(I23,Feuil1!$A$11:$G$29,6),IF(AND(H23>1996,H23<2000),VLOOKUP(I23,Feuil1!$A$11:$G$29,5),IF(AND(H23>1999,H23<2002),VLOOKUP(I23,Feuil1!$A$11:$G$29,4),IF(AND(H23>2001,H23<2004),VLOOKUP(I23,Feuil1!$A$11:$G$29,3),VLOOKUP(I23,Feuil1!$A$11:$G$29,2))))),IF(OR(H23=\"SEN\",H23<1997),VLOOKUP(I23,Feuil1!$G$11:$L$25,6),IF(AND(H23>1996,H23<2000),VLOOKUP(I23,Feuil1!$G$11:$L$25,5),IF(AND(H23>1999,H23<2002),VLOOKUP(I23,Feuil1!$G$11:$L$25,4),IF(AND(H23>2001,H23<2004),VLOOKUP(I23,Feuil1!$G$11:$L$25,3),VLOOKUP(I23,Feuil1!$G$11:$L$25,2)))))))","v":"FC1 48"},null,null," ",{"$f":"T23-HLOOKUP(X23,Feuil1!$C$1:$BJ$10,2,FALSE)","v":85},{"$f":"T23-HLOOKUP(X23,Feuil1!$C$1:$BJ$10,3,FALSE)","v":80},{"$f":"T23-HLOOKUP(X23,Feuil1!$C$1:$BJ$10,4,FALSE)","v":70},{"$f":"T23-HLOOKUP(X23,Feuil1!$C$1:$BJ$10,5,FALSE)","v":60},{"$f":"T23-HLOOKUP(X23,Feuil1!$C$1:$BJ$10,6,FALSE)","v":50},{"$f":"T23-HLOOKUP(X23,Feuil1!$C$1:$BJ$10,7,FALSE)","v":40},{"$f":"T23-HLOOKUP(X23,Feuil1!$C$1:$BJ$10,8,FALSE)","v":30},{"$f":"T23-HLOOKUP(X23,Feuil1!$C$1:$BJ$10,9,FALSE)","v":20},{"$f":"T23-HLOOKUP(X23,Feuil1!$C$1:$BJ$10,10,FALSE)","v":-885},null,null,null,null,null,null,"INTA +"]
["F","SEST","RAL",1,null,null,null,2001,58,null,null,65,null,null,65,85,null,null,85,150,211.18150700254151,"INTA +",20,{"$f":"IF(I24=\"\",\"\",IF(A24=\"H\",IF(OR(H24=\"SEN\",H24<1997),VLOOKUP(I24,Feuil1!$A$11:$G$29,6),IF(AND(H24>1996,H24<2000),VLOOKUP(I24,Feuil1!$A$11:$G$29,5),IF(AND(H24>1999,H24<2002),VLOOKUP(I24,Feuil1!$A$11:$G$29,4),IF(AND(H24>2001,H24<2004),VLOOKUP(I24,Feuil1!$A$11:$G$29,3),VLOOKUP(I24,Feuil1!$A$11:$G$29,2))))),IF(OR(H24=\"SEN\",H24<1997),VLOOKUP(I24,Feuil1!$G$11:$L$25,6),IF(AND(H24>1996,H24<2000),VLOOKUP(I24,Feuil1!$G$11:$L$25,5),IF(AND(H24>1999,H24<2002),VLOOKUP(I24,Feuil1!$G$11:$L$25,4),IF(AND(H24>2001,H24<2004),VLOOKUP(I24,Feuil1!$G$11:$L$25,3),VLOOKUP(I24,Feuil1!$G$11:$L$25,2)))))))","v":"FC2 58"},null,null," ",{"$f":"T24-HLOOKUP(X24,Feuil1!$C$1:$BJ$10,2,FALSE)","v":100},{"$f":"T24-HLOOKUP(X24,Feuil1!$C$1:$BJ$10,3,FALSE)","v":90},{"$f":"T24-HLOOKUP(X24,Feuil1!$C$1:$BJ$10,4,FALSE)","v":80},{"$f":"T24-HLOOKUP(X24,Feuil1!$C$1:$BJ$10,5,FALSE)","v":70},{"$f":"T24-HLOOKUP(X24,Feuil1!$C$1:$BJ$10,6,FALSE)","v":60},{"$f":"T24-HLOOKUP(X24,Feuil1!$C$1:$BJ$10,7,FALSE)","v":50},{"$f":"T24-HLOOKUP(X24,Feuil1!$C$1:$BJ$10,8,FALSE)","v":35},{"$f":"T24-HLOOKUP(X24,Feuil1!$C$1:$BJ$10,9,FALSE)","v":20},{"$f":"T24-HLOOKUP(X24,Feuil1!$C$1:$BJ$10,10,FALSE)","v":-850},null,null,null,null,null,null,"INTA +"]
[null,"Tirage au sort :",null,null,null,null,null,"Classement :",null,null,null,{"$f":"IF(Y25=\"\",\"\",RANK(Y25,$Z$6:$Z$11,0))","v":6},null,null,null,null,null,null,null,null,null,null,null,null,{"$f":"SUM(U26:U28)","v":508.36651964826598}]
["F","SEST","RAL",1,null,null,null,1997,53,null,null,50,null,null,50,70,null,null,70,{"$f":"IF(I26=\"\",\"\",O26+S26)","v":120},181.01330430883743,"INTB +",0,{"$f":"IF(I26=\"\",\"\",IF(A26=\"H\",IF(OR(H26=\"SEN\",H26<1997),VLOOKUP(I26,Feuil1!$A$11:$G$29,6),IF(AND(H26>1996,H26<2000),VLOOKUP(I26,Feuil1!$A$11:$G$29,5),IF(AND(H26>1999,H26<2002),VLOOKUP(I26,Feuil1!$A$11:$G$29,4),IF(AND(H26>2001,H26<2004),VLOOKUP(I26,Feuil1!$A$11:$G$29,3),VLOOKUP(I26,Feuil1!$A$11:$G$29,2))))),IF(OR(H26=\"SEN\",H26<1997),VLOOKUP(I26,Feuil1!$G$11:$L$25,6),IF(AND(H26>1996,H26<2000),VLOOKUP(I26,Feuil1!$G$11:$L$25,5),IF(AND(H26>1999,H26<2002),VLOOKUP(I26,Feuil1!$G$11:$L$25,4),IF(AND(H26>2001,H26<2004),VLOOKUP(I26,Feuil1!$G$11:$L$25,3),VLOOKUP(I26,Feuil1!$G$11:$L$25,2)))))))","v":"FJ53"},null,null," ",{"$f":"T26-HLOOKUP(X26,Feuil1!$C$1:$BJ$10,2,FALSE)","v":65},{"$f":"T26-HLOOKUP(X26,Feuil1!$C$1:$BJ$10,3,FALSE)","v":55},{"$f":"T26-HLOOKUP(X26,Feuil1!$C$1:$BJ$10,4,FALSE)","v":45},{"$f":"T26-HLOOKUP(X26,Feuil1!$C$1:$BJ$10,5,FALSE)","v":35},{"$f":"T26-HLOOKUP(X26,Feuil1!$C$1:$BJ$10,6,FALSE)","v":25},{"$f":"T26-HLOOKUP(X26,Feuil1!$C$1:$BJ$10,7,FALSE)","v":15},{"$f":"T26-HLOOKUP(X26,Feuil1!$C$1:$BJ$10,8,FALSE)","v":0},{"$f":"T26-HLOOKUP(X26,Feuil1!$C$1:$BJ$10,9,FALSE)","v":-15},{"$f":"T26-HLOOKUP(X26,Feuil1!$C$1:$BJ$10,10,FALSE)","v":-880},null,null,null,null,null,null,"INTB +"]
["F","SEST","RAL",1,null,null,null,1999,59,null,null,50,null,null,50,55,null,null,55,{"$f":"IF(I27=\"\",\"\",O27+S27)","v":105},146.00989719954279,"IRG +",10,{"$f":"IF(I27=\"\",\"\",IF(A27=\"H\",IF(OR(H27=\"SEN\",H27<1997),VLOOKUP(I27,Feuil1!$A$11:$G$29,6),IF(AND(H27>1996,H27<2000),VLOOKUP(I27,Feuil1!$A$11:$G$29,5),IF(AND(H27>1999,H27<2002),VLOOKUP(I27,Feuil1!$A$11:$G$29,4),IF(AND(H27>2001,H27<2004),VLOOKUP(I27,Feuil1!$A$11:$G$29,3),VLOOKUP(I27,Feuil1!$A$11:$G$29,2))))),IF(OR(H27=\"SEN\",H27<1997),VLOOKUP(I27,Feuil1!$G$11:$L$25,6),IF(AND(H27>1996,H27<2000),VLOOKUP(I27,Feuil1!$G$11:$L$25,5),IF(AND(H27>1999,H27<2002),VLOOKUP(I27,Feuil1!$G$11:$L$25,4),IF(AND(H27>2001,H27<2004),VLOOKUP(I27,Feuil1!$G$11:$L$25,3),VLOOKUP(I27,Feuil1!$G$11:$L$25,2)))))))","v":"FJ63"},null,null," ",{"$f":"T27-HLOOKUP(X27,Feuil1!$C$1:$BJ$10,2,FALSE)","v":40},{"$f":"T27-HLOOKUP(X27,Feuil1!$C$1:$BJ$10,3,FALSE)","v":30},{"$f":"T27-HLOOKUP(X27,Feuil1!$C$1:$BJ$10,4,FALSE)","v":20},{"$f":"T27-HLOOKUP(X27,Feuil1!$C$1:$BJ$10,5,FALSE)","v":10},{"$f":"T27-HLOOKUP(X27,Feuil1!$C$1:$BJ$10,6,FALSE)","v":-5},{"$f":"T27-HLOOKUP(X27,Feuil1!$C$1:$BJ$10,7,FALSE)","v":-20},{"$f":"T27-HLOOKUP(X27,Feuil1!$C$1:$BJ$10,8,FALSE)","v":-35},{"$f":"T27-HLOOKUP(X27,Feuil1!$C$1:$BJ$10,9,FALSE)","v":-55},{"$f":"T27-HLOOKUP(X27,Feuil1!$C$1:$BJ$10,10,FALSE)","v":-895},null,null,null,null,null,null,"IRG +"]
["F","SEST","RAL",1,null,null,null,2005,62,null,null,60,null,null,60,75,null,null,75,135,181.34331813988575,{"$error":"#N/A"},{"$error":"#N/A"},{"$f":"IF(I28=\"\",\"\",IF(A28=\"H\",IF(OR(H28=\"SEN\",H28<1997),VLOOKUP(I28,Feuil1!$A$11:$G$29,6),IF(AND(H28>1996,H28<2000),VLOOKUP(I28,Feuil1!$A$11:$G$29,5),IF(AND(H28>1999,H28<2002),VLOOKUP(I28,Feuil1!$A$11:$G$29,4),IF(AND(H28>2001,H28<2004),VLOOKUP(I28,Feuil1!$A$11:$G$29,3),VLOOKUP(I28,Feuil1!$A$11:$G$29,2))))),IF(OR(H28=\"SEN\",H28<1997),VLOOKUP(I28,Feuil1!$G$11:$L$25,6),IF(AND(H28>1996,H28<2000),VLOOKUP(I28,Feuil1!$G$11:$L$25,5),IF(AND(H28>1999,H28<2002),VLOOKUP(I28,Feuil1!$G$11:$L$25,4),IF(AND(H28>2001,H28<2004),VLOOKUP(I28,Feuil1!$G$11:$L$25,3),VLOOKUP(I28,Feuil1!$G$11:$L$25,2)))))))","v":"NON"},null,null," ",{"$f":"T28-HLOOKUP(X28,Feuil1!$C$1:$BJ$10,2,FALSE)","v":{"$error":"#N/A"}},{"$f":"T28-HLOOKUP(X28,Feuil1!$C$1:$BJ$10,3,FALSE)","v":{"$error":"#N/A"}},{"$f":"T28-HLOOKUP(X28,Feuil1!$C$1:$BJ$10,4,FALSE)","v":{"$error":"#N/A"}},{"$f":"T28-HLOOKUP(X28,Feuil1!$C$1:$BJ$10,5,FALSE)","v":{"$error":"#N/A"}},{"$f":"T28-HLOOKUP(X28,Feuil1!$C$1:$BJ$10,6,FALSE)","v":{"$error":"#N/A"}},{"$f":"T28-HLOOKUP(X28,Feuil1!$C$1:$BJ$10,7,FALSE)","v":{"$error":"#N/A"}},{"$f":"T28-HLOOKUP(X28,Feuil1!$C$1:$BJ$10,8,FALSE)","v":{"$error":"#N/A"}},{"$f":"T28-HLOOKUP(X28,Feuil1!$C$1:$BJ$10,9,FALSE)","v":{"$error":"#N/A"}},{"$f":"T28-HLOOKUP(X28,Feuil1!$C$1:$BJ$10,10,FALSE)","v":{"$error":"#N/A"}},null,null,null,null,null,null,{"$error":"#N/A"}]
[null,null,null,null,null,null,null,null,null,null,null,null," "," ",null,null,null,null,null,null,null,null,null,null,null,null,null,null,null,null,null,null,null,null,null,null,null,null,null,null,null,null," "]
[null,null,null,null,null,null,null,null,null,null,null,null," "," "]
[null,"Secrétaire :",null,null,null," ",null," ",null,1," "]
[null,null,null,null,null,null,null," ","ARBITRES :                        2",null," ",null,null,null,null,null,null,"Signatures :"]
[null,"Contrôleur Technique 1 :",null,null,null," ",null," ",null,3," "]
[null,"Contrôleur Technique 2 :"]
[null,"Chronométreur :",null,null,null," ",null,null,null,"JURY :"," ",null,null,null,null," ",null,null,null,null,null," "]
[]
[]
[]
[]
[]
[]
[]
[]
[]
[]
[]
[]
[]
[]
[]
[]
[]
[]
[]
[]
[]
[]
[]
[]
[]
[]
[]
[]
[]
[]
[]
[]
[]
[]
[]
[]
[]
[]
[]
[]
[]
[]
[]
[]
[]
[]
[]
[]
[]
[]
[]
[]
[]
[]
[]
[]
[]
[]
[]
[]
[]
[]
[]
[]
[]
[]
[]
[]
[]
[]
[]
[]
[]
[]
[]
[]
[]
[]
[]
[]
[]
[]
[]
[]
[]
[]
[]
[]
[]
[]
[]
[]
[]
[]
[]
[]
[]
[]
[]
[]
[]
[]
[]
[]
[]
[]
[]
[]
[]
[]
[]
[]
[]
[]
[]
[]
[]
[]
[]
[]
[]
[]
[]
[]
[]
[]
[]
[]
[]
[]
[]
[]
[]
[]
[]
[]
[]
[]
[]
[]
[]
[]
[]
[]
[]
[]
[]
[]
[]
[]
[]
[]
[]
[]
[]
[]
[]
[]
[]
[]
[]
[]
[]
[]
[]
[]
[]
[]
[]
[]
[]
[]
[]
[]
[]
[]
[]
[]
[]
[]
[]
[]
[]
[]
[]
[]
[]
[]
[]
[]
[]
[]
[]
[]
[]
[]
[]
[]
[]
[]
[]
[]
[]
[]
[]
[]
[]
[]
[]
[]
[]
[]
[]
[]
[]
[]
[]
[]
[]
[]
[]
[]
[]
[]
[]
[]
[]
[]
[]
[]
[]
[]
[]
[]
[]
[]
[]
[]
[]
[]
[]
[]
[]
[]
[]
[]
[]
[]
[]
[]
[]
[]
[]
[]
[]
[]
[]
[]
[]
[]
[]
[]
[]
[]
[]
[]
[]
[]
[]
[]
[]
[]
[]
[]
[]
[]
[]
[]
[]
[]
[]
[]
[]
[]
[]
[]
[]
[]
[]
[]
[]
[]
[]
[]
[]
[]
[]
[]
[]
[]
[]
[]
[]
[]
[]
[]
[]
[]
[]
[]
[]
[]
[]
[]
[]
[]
[]
[]
[]
[]
[]
[]
[]
[]
[]
[]
[]
[]
[]
[]
[]
[]
[]
[]
[]
[]
[]
[]
[]
[]
[]
[]
[]
[]
[]
[]
[]
[]
[]
[]
[]
[]
[]
[]
[]
[]
[]
[]
[]
[]
[]
[]
[]
[]
[]
[]
[]
[]
[]
[]
[]
[]
[]
[]
[]
[]
[]
[]
[]
[]
[]
[]
[]
[]
[]
[]
[]
[]
[]
[]
[]
[]
[]
[]
[]
[]
[]
[]
[]
[]
[]
[]
[]
[]
[]
[]
[]
[]
[]
[]
[]
[]
[]
[]
[]
[]
[]
[]
[]
[]
[]
[]
[]
[]
[]
[]
[]
[]
[]
[]
[]
[]
[]
[]
[]
[]
[]
[]
[]
[]
[]
[]
[]
[]
[]
[]
[]
[]
[]
[]
[]
[]
[]
[]
[]
[]
[]
[]
[]
[]
[]
[]
[]
[]
[]
[]
[]
[]
[]
[]
[]
[]
[]
[]
[]
[]
[]
[]
[]
[]
[]
[]
[]
[]
[]
[]
[]
[]
[]
[]
[]
[]
[]
[]
[null,null,null,null,null,null,null,null,null,null,null,null,null,null,null,null,null,null,null,null,null,null,null,null,null,null,null,"J77","J85","J94","J105","J+105",null,"J56","J62","J69","J77","J85","J94","J105","J+105",null,"S56","S62","S69","S77","S85","S94","S105","S+105"]
[null,null,null,null,null,null,null,null,null,null,null,null,null,null,null,null,null,null,null,null,null,null,null,null,null,null,null,145,160,170,180,190,null,100,115,130,145,160,170,180,190,null,115,135,150,165,180,190,200,210]
[null,null,null,null,null,null,null,null,null,null,null,null,null,null,null,null,null,null,null,null,null,null,null,null,null,null,null,165,180,190,200,210,null,115,135,150,165,180,190,200,210,null,130,150,165,185,200,210,220,230]
[null,null,null,null,null,null,null,null,null,null,null,null,null,null,null,null,null,null,null,null,null,null,null,null,null,null,null,185,200,210,220,230,null,130,150,165,185,200,210,220,230,null,145,165,180,200,220,230,240,250]
[null,null,null,null,null,null,null,null,null,null,null,null,null,null,null,null,null,null,null,null,null,null,null,null,null,null,null,200,220,230,240,250,null,145,165,180,200,220,230,240,250,null,175,195,215,235,250,260,275,280]
[null,null,null,null,null,null,null,null,null,null,null,null,null,null,null,null,null,null,null,null,null,null,null,null,null,null,null,235,250,260,275,280,null,175,195,215,235,250,260,275,280,null,210,230,250,270,290,300,310,325]
[null,null,null,null,null,null,null,null,null,null,null,null,null,null,null,null,null,null,null,null,null,null,null,null,null,null,null,270,290,300,310,325,null,210,230,250,270,290,300,310,325,null,230,255,275,300,315,335,345,355]
[null,null,null,null,null,null,null,null,null,null,null,null,null,null,null,null,null,null,null,null,null,null,null,null,null,null,null,320,335,355,370,380,null,245,270,295,320,335,355,370,380,null,245,270,295,320,335,355,370,380]

{"sheet":"HOMMES","index":2,"n_rows":537,"n_cols":50,"rows_kept":537,"cut":false,"hidden":false,"merged":[[0,2,0,10],[0,17,0,18],[0,21,0,22],[0,24,1,24],[1,7,1,8],[1,11,1,13],[1,14,1,18],[1,19,1,20],[1,21,1,23],[30,19,30,23],[3,21,3,22],[4,7,4,10],[5,9,7,9],[8,7,8,10],[12,7,12,10],[16,7,16,10],[20,7,20,10],[24,7,24,10],[31,17,31,18],[34,21,34,23],[33,1,33,4],[33,5,33,6],[34,1,34,4],[34,5,34,6],[34,10,34,13],[34,15,34,18],[32,1,32,4],[32,5,32,6],[32,10,32,15],[31,1,31,4],[31,5,31,6],[31,8,31,9],[31,10,31,15],[30,1,30,4],[30,5,30,6],[30,10,30,15]]}
[null,null,"COUPE DE FRANCE DES CLUBS JEUNES     2017",null,null,null,null,null,null,null,null,null,null,null,"TOUR :",null,null,null,null," ",null,null,null,null,"HOMMES   CA ou JU"]
[null,null,null,null,null,null,"LIEU :",null,null,null,null,"REGION :",null,null,null,null,null,null,null,"Date :"]
[]
["SEXE","ZONE","REG.","CL.","LICENCE","NOMS","Prénoms","AN","POIDS","CLUB","NAT",1,2,3,"ARR",1,2,3,"EP-J","Total","IWF","SERIE",null,"Catég"," ",null," ","DEB ","DEP +","REG +","IRG +","FED +","NAT +","INTB +","INTA +","OLY +"]
[null,"Tirage au sort :",null,null,null,null,null,"Classement :",null,null,null,{"$f":"IF(Y5=\"\",\"\",RANK(Y5,$Z$6:$Z$11,0))","v":3},null,null,null,null,null,null,null,null,null,null,null,null,{"$f":"SUM(U6:U8)","v":703.14340162890517},null," ",{"$f":"T5-HLOOKUP(X5,Feuil1!$C$1:$BJ$10,2,FALSE)","v":{"$error":"#N/A"}},{"$f":"T5-HLOOKUP(X5,Feuil1!$C$1:$BJ$10,3,FALSE)","v":{"$error":"#N/A"}},{"$f":"T5-HLOOKUP(X5,Feuil1!$C$1:$BJ$10,4,FALSE)","v":{"$error":"#N/A"}},{"$f":"T5-HLOOKUP(X5,Feuil1!$C$1:$BJ$10,5,FALSE)","v":{"$error":"#N/A"}},{"$f":"T5-HLOOKUP(X5,Feuil1!$C$1:$BJ$10,6,FALSE)","v":{"$error":"#N/A"}},{"$f":"T5-HLOOKUP(X5,Feuil1!$C$1:$BJ$10,7,FALSE)","v":{"$error":"#N/A"}},{"$f":"T5-HLOOKUP(X5,Feuil1!$C$1:$BJ$10,8,FALSE)","v":{"$error":"#N/A"}},{"$f":"T5-HLOOKUP(X5,Feuil1!$C$1:$BJ$10,9,FALSE)","v":{"$error":"#N/A"}},{"$f":"T5-HLOOKUP(X5,Feuil1!$C$1:$BJ$10,10,FALSE)","v":{"$error":"#N/A"}},null,null,null,null,null,null,{"$f":"IF(AJ5>=0,$AJ$4,IF(AI5>=0,$AI$4,IF(AH5>=0,$AH$4,IF(AG5>=0,$AG$4,IF(AF5>=0,$AF$4,IF(AE5>=0,$AE$4,IF(AD5>=0,$AD$4,IF(AC5>=0,$AC$4,$AB$4))))))))","v":{"$error":"#N/A"}}]
["H","SEST","RAL",1,null,null,null,1997,75,null,null,-90,-90,-90,{"$f":"IF(H6=\"\",\"\",IF(MAXA(L6:N6)<=0,0,MAXA(L6:N6)))","v":0},100,null,null,{"$f":"IF(H6=\"\",\"\",IF(MAXA(P6:R6)<=0,0,MAXA(P6:R6)))","v":100},{"$f":"IF(I6=\"\",\"\",O6+S6)","v":100},{"$f":"IF(I6=\"\",\"\",IF(A6=\"H\",10^(0.794358141*LOG(I6/174.393)^2)*T6,IF(A6=\"F\",10^(0.89726074*LOG(I6/148.026)^2)*T6,\"\")))","v":127.84425484161912},{"$f":"IF(H6=\"\",\"\",AQ6)","v":"DEB "},{"$f":"IF(AJ6>=0,AJ6,IF(AI6>=0,AI6,IF(AH6>=0,AH6,IF(AG6>=0,AG6,IF(AF6>=0,AF6,IF(AE6>=0,AE6,IF(AD6>=0,AD6,IF(AC6>=0,AC6,AB6))))))))","v":-30},{"$f":"IF(I6=\"\",\"\",IF(A6=\"H\",IF(OR(H6=\"SEN\",H6<1997),VLOOKUP(I6,Feuil1!$A$11:$G$29,6),IF(AND(H6>1996,H6<2000),VLOOKUP(I6,Feuil1!$A$11:$G$29,5),IF(AND(H6>1999,H6<2002),VLOOKUP(I6,Feuil1!$A$11:$G$29,4),IF(AND(H6>2001,H6<2004),VLOOKUP(I6,Feuil1!$A$11:$G$29,3),VLOOKUP(I6,Feuil1!$A$11:$G$29,2))))),IF(OR(H6=\"SEN\",H6<1997),VLOOKUP(I6,Feuil1!$G$11:$L$25,6),IF(AND(H6>1996,H6<2000),VLOOKUP(I6,Feuil1!$G$11:$L$25,5),IF(AND(H6>1999,H6<2002),VLOOKUP(I6,Feuil1!$G$11:$L$25,4),IF(AND(H6>2001,H6<2004),VLOOKUP(I6,Feuil1!$G$11:$L$25,3),VLOOKUP(I6,Feuil1!$G$11:$L$25,2)))))))","v":"J77"},null,{"$f":"Y5","v":703.14340162890517}," ",{"$f":"T6-HLOOKUP(X6,Feuil1!$C$1:$BJ$10,2,FALSE)","v":-30},{"$f":"T6-HLOOKUP(X6,Feuil1!$C$1:$BJ$10,3,FALSE)","v":-50},{"$f":"T6-HLOOKUP(X6,Feuil1!$C$1:$BJ$10,4,FALSE)","v":-70},{"$f":"T6-HLOOKUP(X6,Feuil1!$C$1:$BJ$10,5,FALSE)","v":-90},{"$f":"T6-HLOOKUP(X6,Feuil1!$C$1:$BJ$10,6,FALSE)","v":-110},{"$f":"T6-HLOOKUP(X6,Feuil1!$C$1:$BJ$10,7,FALSE)","v":-140},{"$f":"T6-HLOOKUP(X6,Feuil1!$C$1:$BJ$10,8,FALSE)","v":-160},{"$f":"T6-HLOOKUP(X6,Feuil1!$C$1:$BJ$10,9,FALSE)","v":-185},{"$f":"T6-HLOOKUP(X6,Feuil1!$C$1:$BJ$10,10,FALSE)","v":-9900},null,null,null,null,null,null,{"$f":"IF(AJ6>=0,$AJ$4,IF(AI6>=0,$AI$4,IF(AH6>=0,$AH$4,IF(AG6>=0,$AG$4,IF(AF6>=0,$AF$4,IF(AE6>=0,$AE$4,IF(AD6>=0,$AD$4,IF(AC6>=0,$AC$4,$AB$4))))))))","v":"DEB "}]
["H","SEST","RAL",1,null,null,null,1998,75,null,null,100,null,null,100,110,null,null,110,{"$f":"IF(I7=\"\",\"\",O7+S7)","v":210},268.47293516740018,"FED +",0,{"$f":"IF(I7=\"\",\"\",IF(A7=\"H\",IF(OR(H7=\"SEN\",H7<1997),VLOOKUP(I7,Feuil1!$A$11:$G$29,6),IF(AND(H7>1996,H7<2000),VLOOKUP(I7,Feuil1!$A$11:$G$29,5),IF(AND(H7>1999,H7<2002),VLOOKUP(I7,Feuil1!$A$11:$G$29,4),IF(AND(H7>2001,H7<2004),VLOOKUP(I7,Feuil1!$A$11:$G$29,3),VLOOKUP(I7,Feuil1!$A$11:$G$29,2))))),IF(OR(H7=\"SEN\",H7<1997),VLOOKUP(I7,Feuil1!$G$11:$L$25,6),IF(AND(H7>1996,H7<2000),VLOOKUP(I7,Feuil1!$G$11:$L$25,5),IF(AND(H7>1999,H7<2002),VLOOKUP(I7,Feuil1!$G$11:$L$25,4),IF(AND(H7>2001,H7<2004),VLOOKUP(I7,Feuil1!$G$11:$L$25,3),VLOOKUP(I7,Feuil1!$G$11:$L$25,2)))))))","v":"J77"},null,{"$f":"Y9","v":939.65527308590049}," ",{"$f":"T7-HLOOKUP(X7,Feuil1!$C$1:$BJ$10,2,FALSE)","v":80},{"$f":"T7-HLOOKUP(X7,Feuil1!$C$1:$BJ$10,3,FALSE)","v":60},{"$f":"T7-HLOOKUP(X7,Feuil1!$C$1:$BJ$10,4,FALSE)","v":40},{"$f":"T7-HLOOKUP(X7,Feuil1!$C$1:$BJ$10,5,FALSE)","v":20},{"$f":"T7-HLOOKUP(X7,Feuil1!$C$1:$BJ$10,6,FALSE)","v":0},{"$f":"T7-HLOOKUP(X7,Feuil1!$C$1:$BJ$10,7,FALSE)","v":-30},{"$f":"T7-HLOOKUP(X7,Feuil1!$C$1:$BJ$10,8,FALSE)","v":-50},{"$f":"T7-HLOOKUP(X7,Feuil1!$C$1:$BJ$10,9,FALSE)","v":-75},{"$f":"T7-HLOOKUP(X7,Feuil1!$C$1:$BJ$10,10,FALSE)","v":-9790},null,null,null,null,null,null,"FED +"]
["H","SEST","RAL",1,null,null,null,1999,75,null,null,110,null,null,110,130,null,null,130,240,306.8262116198859,"NAT +",0,{"$f":"IF(I8=\"\",\"\",IF(A8=\"H\",IF(OR(H8=\"SEN\",H8<1997),VLOOKUP(I8,Feuil1!$A$11:$G$29,6),IF(AND(H8>1996,H8<2000),VLOOKUP(I8,Feuil1!$A$11:$G$29,5),IF(AND(H8>1999,H8<2002),VLOOKUP(I8,Feuil1!$A$11:$G$29,4),IF(AND(H8>2001,H8<2004),VLOOKUP(I8,Feuil1!$A$11:$G$29,3),VLOOKUP(I8,Feuil1!$A$11:$G$29,2))))),IF(OR(H8=\"SEN\",H8<1997),VLOOKUP(I8,Feuil1!$G$11:$L$25,6),IF(AND(H8>1996,H8<2000),VLOOKUP(I8,Feuil1!$G$11:$L$25,5),IF(AND(H8>1999,H8<2002),VLOOKUP(I8,Feuil1!$G$11:$L$25,4),IF(AND(H8>2001,H8<2004),VLOOKUP(I8,Feuil1!$G$11:$L$25,3),VLOOKUP(I8,Feuil1!$G$11:$L$25,2)))))))","v":"J77"},null,{"$f":"Y13","v":830.98765647052437}," ",{"$f":"T8-HLOOKUP(X8,Feuil1!$C$1:$BJ$10,2,FALSE)","v":110},{"$f":"T8-HLOOKUP(X8,Feuil1!$C$1:$BJ$10,3,FALSE)","v":90},{"$f":"T8-HLOOKUP(X8,Feuil1!$C$1:$BJ$10,4,FALSE)","v":70},{"$f":"T8-HLOOKUP(X8,Feuil1!$C$1:$BJ$10,5,FALSE)","v":50},{"$f":"T8-HLOOKUP(X8,Feuil1!$C$1:$BJ$10,6,FALSE)","v":30},{"$f":"T8-HLOOKUP(X8,Feuil1!$C$1:$BJ$10,7,FALSE)","v":0},{"$f":"T8-HLOOKUP(X8,Feuil1!$C$1:$BJ$10,8,FALSE)","v":-20},{"$f":"T8-HLOOKUP(X8,Feuil1!$C$1:$BJ$10,9,FALSE)","v":-45},{"$f":"T8-HLOOKUP(X8,Feuil1!$C$1:$BJ$10,10,FALSE)","v":-9760},null,null,null,null,null,null,"NAT +"]
[null,"Tirage au sort :",null,null,null,null,null,"Classement :",null,null,null,{"$f":"IF(Y9=\"\",\"\",RANK(Y9,$Z$6:$Z$11,0))","v":1},null,null,null,null,null,null,null,null,null,null,null,null,{"$f":"SUM(U10:U12)","v":939.65527308590049},{"$f":"Y17","v":686.08237229097233}]
["H","SEST","RAL",1,null,null,null,1997,75,null,null,120,null,null,120,145,null,null,145,{"$f":"IF(I10=\"\",\"\",O10+S10)","v":265},338.7872753302907,"INTB +",5,{"$f":"IF(I10=\"\",\"\",IF(A10=\"H\",IF(OR(H10=\"SEN\",H10<1997),VLOOKUP(I10,Feuil1!$A$11:$G$29,6),IF(AND(H10>1996,H10<2000),VLOOKUP(I10,Feuil1!$A$11:$G$29,5),IF(AND(H10>1999,H10<2002),VLOOKUP(I10,Feuil1!$A$11:$G$29,4),IF(AND(H10>2001,H10<2004),VLOOKUP(I10,Feuil1!$A$11:$G$29,3),VLOOKUP(I10,Feuil1!$A$11:$G$29,2))))),IF(OR(H10=\"SEN\",H10<1997),VLOOKUP(I10,Feuil1!$G$11:$L$25,6),IF(AND(H10>1996,H10<2000),VLOOKUP(I10,Feuil1!$G$11:$L$25,5),IF(AND(H10>1999,H10<2002),VLOOKUP(I10,Feuil1!$G$11:$L$25,4),IF(AND(H10>2001,H10<2004),VLOOKUP(I10,Feuil1!$G$11:$L$25,3),VLOOKUP(I10,Feuil1!$G$11:$L$25,2)))))))","v":"J77"},null,{"$f":"Y21","v":659.17718122073813}," ",{"$f":"T10-HLOOKUP(X10,Feuil1!$C$1:$BJ$10,2,FALSE)","v":135},{"$f":"T10-HLOOKUP(X10,Feuil1!$C$1:$BJ$10,3,FALSE)","v":115},{"$f":"T10-HLOOKUP(X10,Feuil1!$C$1:$BJ$10,4,FALSE)","v":95},{"$f":"T10-HLOOKUP(X10,Feuil1!$C$1:$BJ$10,5,FALSE)","v":75},{"$f":"T10-HLOOKUP(X10,Feuil1!$C$1:$BJ$10,6,FALSE)","v":55},{"$f":"T10-HLOOKUP(X10,Feuil1!$C$1:$BJ$10,7,FALSE)","v":25},{"$f":"T10-HLOOKUP(X10,Feuil1!$C$1:$BJ$10,8,FALSE)","v":5},{"$f":"T10-HLOOKUP(X10,Feuil1!$C$1:$BJ$10,9,FALSE)","v":-20},{"$f":"T10-HLOOKUP(X10,Feuil1!$C$1:$BJ$10,10,FALSE)","v":-9735},null,null,null,null,null,null,"INTB +"]
["H","SEST","RAL",1,null,null,null,1998,75,null,null,100,null,null,100,120,null,null,120,{"$f":"IF(I11=\"\",\"\",O11+S11)","v":220},281.25736065156207,"FED +",10,{"$f":"IF(I11=\"\",\"\",IF(A11=\"H\",IF(OR(H11=\"SEN\",H11<1997),VLOOKUP(I11,Feuil1!$A$11:$G$29,6),IF(AND(H11>1996,H11<2000),VLOOKUP(I11,Feuil1!$A$11:$G$29,5),IF(AND(H11>1999,H11<2002),VLOOKUP(I11,Feuil1!$A$11:$G$29,4),IF(AND(H11>2001,H11<2004),VLOOKUP(I11,Feuil1!$A$11:$G$29,3),VLOOKUP(I11,Feuil1!$A$11:$G$29,2))))),IF(OR(H11=\"SEN\",H11<1997),VLOOKUP(I11,Feuil1!$G$11:$L$25,6),IF(AND(H11>1996,H11<2000),VLOOKUP(I11,Feuil1!$G$11:$L$25,5),IF(AND(H11>1999,H11<2002),VLOOKUP(I11,Feuil1!$G$11:$L$25,4),IF(AND(H11>2001,H11<2004),VLOOKUP(I11,Feuil1!$G$11:$L$25,3),VLOOKUP(I11,Feuil1!$G$11:$L$25,2)))))))","v":"J77"},null,{"$f":"Y25","v":484.29343926421575}," ",{"$f":"T11-HLOOKUP(X11,Feuil1!$C$1:$BJ$10,2,FALSE)","v":90},{"$f":"T11-HLOOKUP(X11,Feuil1!$C$1:$BJ$10,3,FALSE)","v":70},{"$f":"T11-HLOOKUP(X11,Feuil1!$C$1:$BJ$10,4,FALSE)","v":50},{"$f":"T11-HLOOKUP(X11,Feuil1!$C$1:$BJ$10,5,FALSE)","v":30},{"$f":"T11-HLOOKUP(X11,Feuil1!$C$1:$BJ$10,6,FALSE)","v":10},{"$f":"T11-HLOOKUP(X11,Feuil1!$C$1:$BJ$10,7,FALSE)","v":-20},{"$f":"T11-HLOOKUP(X11,Feuil1!$C$1:$BJ$10,8,FALSE)","v":-40},{"$f":"T11-HLOOKUP(X11,Feuil1!$C$1:$BJ$10,9,FALSE)","v":-65},{"$f":"T11-HLOOKUP(X11,Feuil1!$C$1:$BJ$10,10,FALSE)","v":-9780},null,null,null,null,null,null,"FED +"]
["H","SEST","RAL",1,null,null,null,1999,75,null,null,115,null,null,115,135,null,null,135,250,319.61063710404778,"NAT +",10,{"$f":"IF(I12=\"\",\"\",IF(A12=\"H\",IF(OR(H12=\"SEN\",H12<1997),VLOOKUP(I12,Feuil1!$A$11:$G$29,6),IF(AND(H12>1996,H12<2000),VLOOKUP(I12,Feuil1!$A$11:$G$29,5),IF(AND(H12>1999,H12<2002),VLOOKUP(I12,Feuil1!$A$11:$G$29,4),IF(AND(H12>2001,H12<2004),VLOOKUP(I12,Feuil1!$A$11:$G$29,3),VLOOKUP(I12,Feuil1!$A$11:$G$29,2))))),IF(OR(H12=\"SEN\",H12<1997),VLOOKUP(I12,Feuil1!$G$11:$L$25,6),IF(AND(H12>1996,H12<2000),VLOOKUP(I12,Feuil1!$G$11:$L$25,5),IF(AND(H12>1999,H12<2002),VLOOKUP(I12,Feuil1!$G$11:$L$25,4),IF(AND(H12>2001,H12<2004),VLOOKUP(I12,Feuil1!$G$11:$L$25,3),VLOOKUP(I12,Feuil1!$G$11:$L$25,2)))))))","v":"J77"},null,null," ",{"$f":"T12-HLOOKUP(X12,Feuil1!$C$1:$BJ$10,2,FALSE)","v":120},{"$f":"T12-HLOOKUP(X12,Feuil1!$C$1:$BJ$10,3,FALSE)","v":100},{"$f":"T12-HLOOKUP(X12,Feuil1!$C$1:$BJ$10,4,FALSE)","v":80},{"$f":"T12-HLOOKUP(X12,Feuil1!$C$1:$BJ$10,5,FALSE)","v":60},{"$f":"T12-HLOOKUP(X12,Feuil1!$C$1:$BJ$10,6,FALSE)","v":40},{"$f":"T12-HLOOKUP(X12,Feuil1!$C$1:$BJ$10,7,FALSE)","v":10},{"$f":"T12-HLOOKUP(X12,Feuil1!$C$1:$BJ$10,8,FALSE)","v":-10},{"$f":"T12-HLOOKUP(X12,Feuil1!$C$1:$BJ$10,9,FALSE)","v":-35},{"$f":"T12-HLOOKUP(X12,Feuil1!$C$1:$BJ$10,10,FALSE)","v":-9750},null,null,null,null,null,null,"NAT +"]
[null,"Tirage au sort :",null,null,null,null,null,"Classement :",null,null,null,{"$f":"IF(Y13=\"\",\"\",RANK(Y13,$Z$6:$Z$11,0))","v":2},null,null,null,null,null,null,null,null,null,null,null,null,{"$f":"SUM(U14:U16)","v":830.98765647052437}]
["H","SEST","RAL",1,null,null,null,2003,75,null,null,100,null,null,100,110,null,null,110,{"$f":"IF(I14=\"\",\"\",O14+S14)","v":210},268.47293516740018,"INTB +",10,{"$f":"IF(I14=\"\",\"\",IF(A14=\"H\",IF(OR(H14=\"SEN\",H14<1997),VLOOKUP(I14,Feuil1!$A$11:$G$29,6),IF(AND(H14>1996,H14<2000),VLOOKUP(I14,Feuil1!$A$11:$G$29,5),IF(AND(H14>1999,H14<2002),VLOOKUP(I14,Feuil1!$A$11:$G$29,4),IF(AND(H14>2001,H14<2004),VLOOKUP(I14,Feuil1!$A$11:$G$29,3),VLOOKUP(I14,Feuil1!$A$11:$G$29,2))))),IF(OR(H14=\"SEN\",H14<1997),VLOOKUP(I14,Feuil1!$G$11:$L$25,6),IF(AND(H14>1996,H14<2000),VLOOKUP(I14,Feuil1!$G$11:$L$25,5),IF(AND(H14>1999,H14<2002),VLOOKUP(I14,Feuil1!$G$11:$L$25,4),IF(AND(H14>2001,H14<2004),VLOOKUP(I14,Feuil1!$G$11:$L$25,3),VLOOKUP(I14,Feuil1!$G$11:$L$25,2)))))))","v":"C1 77"},null,null," ",{"$f":"T14-HLOOKUP(X14,Feuil1!$C$1:$BJ$10,2,FALSE)","v":120},{"$f":"T14-HLOOKUP(X14,Feuil1!$C$1:$BJ$10,3,FALSE)","v":100},{"$f":"T14-HLOOKUP(X14,Feuil1!$C$1:$BJ$10,4,FALSE)","v":80},{"$f":"T14-HLOOKUP(X14,Feuil1!$C$1:$BJ$10,5,FALSE)","v":60},{"$f":"T14-HLOOKUP(X14,Feuil1!$C$1:$BJ$10,6,FALSE)","v":40},{"$f":"T14-HLOOKUP(X14,Feuil1!$C$1:$BJ$10,7,FALSE)","v":25},{"$f":"T14-HLOOKUP(X14,Feuil1!$C$1:$BJ$10,8,FALSE)","v":10},{"$f":"T14-HLOOKUP(X14,Feuil1!$C$1:$BJ$10,9,FALSE)","v":-10},{"$f":"T14-HLOOKUP(X14,Feuil1!$C$1:$BJ$10,10,FALSE)","v":-790},null,null,null,null,null,null,"INTB +"]
["H","SEST","RAL",1,null,null,null,2000,75,null,null,100,null,null,100,120,null,null,120,{"$f":"IF(I15=\"\",\"\",O15+S15)","v":220},281.25736065156207,"INTB +",0,{"$f":"IF(I15=\"\",\"\",IF(A15=\"H\",IF(OR(H15=\"SEN\",H15<1997),VLOOKUP(I15,Feuil1!$A$11:$G$29,6),IF(AND(H15>1996,H15<2000),VLOOKUP(I15,Feuil1!$A$11:$G$29,5),IF(AND(H15>1999,H15<2002),VLOOKUP(I15,Feuil1!$A$11:$G$29,4),IF(AND(H15>2001,H15<2004),VLOOKUP(I15,Feuil1!$A$11:$G$29,3),VLOOKUP(I15,Feuil1!$A$11:$G$29,2))))),IF(OR(H15=\"SEN\",H15<1997),VLOOKUP(I15,Feuil1!$G$11:$L$25,6),IF(AND(H15>1996,H15<2000),VLOOKUP(I15,Feuil1!$G$11:$L$25,5),IF(AND(H15>1999,H15<2002),VLOOKUP(I15,Feuil1!$G$11:$L$25,4),IF(AND(H15>2001,H15<2004),VLOOKUP(I15,Feuil1!$G$11:$L$25,3),VLOOKUP(I15,Feuil1!$G$11:$L$25,2)))))))","v":"C2 77"},null,null," ",{"$f":"T15-HLOOKUP(X15,Feuil1!$C$1:$BJ$10,2,FALSE)","v":110},{"$f":"T15-HLOOKUP(X15,Feuil1!$C$1:$BJ$10,3,FALSE)","v":90},{"$f":"T15-HLOOKUP(X15,Feuil1!$C$1:$BJ$10,4,FALSE)","v":70},{"$f":"T15-HLOOKUP(X15,Feuil1!$C$1:$BJ$10,5,FALSE)","v":50},{"$f":"T15-HLOOKUP(X15,Feuil1!$C$1:$BJ$10,6,FALSE)","v":35},{"$f":"T15-HLOOKUP(X15,Feuil1!$C$1:$BJ$10,7,FALSE)","v":20},{"$f":"T15-HLOOKUP(X15,Feuil1!$C$1:$BJ$10,8,FALSE)","v":0},{"$f":"T15-HLOOKUP(X15,Feuil1!$C$1:$BJ$10,9,FALSE)","v":-30},{"$f":"T15-HLOOKUP(X15,Feuil1!$C$1:$BJ$10,10,FALSE)","v":-780},null,null,null,null,null,null,"INTB +"]
["H","SEST","RAL",1,null,null,null,1997,75,null,null,120,null,null,120,100,null,null,100,220,281.25736065156207,"FED +",10,{"$f":"IF(I16=\"\",\"\",IF(A16=\"H\",IF(OR(H16=\"SEN\",H16<1997),VLOOKUP(I16,Feuil1!$A$11:$G$29,6),IF(AND(H16>1996,H16<2000),VLOOKUP(I16,Feuil1!$A$11:$G$29,5),IF(AND(H16>1999,H16<2002),VLOOKUP(I16,Feuil1!$A$11:$G$29,4),IF(AND(H16>2001,H16<2004),VLOOKUP(I16,Feuil1!$A$11:$G$29,3),VLOOKUP(I16,Feuil1!$A$11:$G$29,2))))),IF(OR(H16=\"SEN\",H16<1997),VLOOKUP(I16,Feuil1!$G$11:$L$25,6),IF(AND(H16>1996,H16<2000),VLOOKUP(I16,Feuil1!$G$11:$L$25,5),IF(AND(H16>1999,H16<2002),VLOOKUP(I16,Feuil1!$G$11:$L$25,4),IF(AND(H16>2001,H16<2004),VLOOKUP(I16,Feuil1!$G$11:$L$25,3),VLOOKUP(I16,Feuil1!$G$11:$L$25,2)))))))","v":"J77"},null,null," ",{"$f":"T16-HLOOKUP(X16,Feuil1!$C$1:$BJ$10,2,FALSE)","v":90},{"$f":"T16-HLOOKUP(X16,Feuil1!$C$1:$BJ$10,3,FALSE)","v":70},{"$f":"T16-HLOOKUP(X16,Feuil1!$C$1:$BJ$10,4,FALSE)","v":50},{"$f":"T16-HLOOKUP(X16,Feuil1!$C$1:$BJ$10,5,FALSE)","v":30},{"$f":"T16-HLOOKUP(X16,Feuil1!$C$1:$BJ$10,6,FALSE)","v":10},{"$f":"T16-HLOOKUP(X16,Feuil1!$C$1:$BJ$10,7,FALSE)","v":-20},{"$f":"T16-HLOOKUP(X16,Feuil1!$C$1:$BJ$10,8,FALSE)","v":-40},{"$f":"T16-HLOOKUP(X16,Feuil1!$C$1:$BJ$10,9,FALSE)","v":-65},{"$f":"T16-HLOOKUP(X16,Feuil1!$C$1:$BJ$10,10,FALSE)","v":-9780},null,null,null,null,null,null,"FED +"]
[null,"Tirage au sort :",null,null,null,null,null,"Classement :",null,null,null,{"$f":"IF(Y17=\"\",\"\",RANK(Y17,$Z$6:$Z$11,0))","v":4},null,null,null,null,null,null,null,null,null,null,null,null,{"$f":"SUM(U18:U20)","v":686.08237229097233}]
["H","SEST","RAL",1,null,null,null,2003,69,null,null,95,null,null,95,110,null,null,110,{"$f":"IF(I18=\"\",\"\",O18+S18)","v":205},275.77820846990062,"INTB +",15,{"$f":"IF(I18=\"\",\"\",IF(A18=\"H\",IF(OR(H18=\"SEN\",H18<1997),VLOOKUP(I18,Feuil1!$A$11:$G$29,6),IF(AND(H18>1996,H18<2000),VLOOKUP(I18,Feuil1!$A$11:$G$29,5),IF(AND(H18>1999,H18<2002),VLOOKUP(I18,Feuil1!$A$11:$G$29,4),IF(AND(H18>2001,H18<2004),VLOOKUP(I18,Feuil1!$A$11:$G$29,3),VLOOKUP(I18,Feuil1!$A$11:$G$29,2))))),IF(OR(H18=\"SEN\",H18<1997),VLOOKUP(I18,Feuil1!$G$11:$L$25,6),IF(AND(H18>1996,H18<2000),VLOOKUP(I18,Feuil1!$G$11:$L$25,5),IF(AND(H18>1999,H18<2002),VLOOKUP(I18,Feuil1!$G$11:$L$25,4),IF(AND(H18>2001,H18<2004),VLOOKUP(I18,Feuil1!$G$11:$L$25,3),VLOOKUP(I18,Feuil1!$G$11:$L$25,2)))))))","v":"C1 69"},null,null," ",{"$f":"T18-HLOOKUP(X18,Feuil1!$C$1:$BJ$10,2,FALSE)","v":120},{"$f":"T18-HLOOKUP(X18,Feuil1!$C$1:$BJ$10,3,FALSE)","v":100},{"$f":"T18-HLOOKUP(X18,Feuil1!$C$1:$BJ$10,4,FALSE)","v":90},{"$f":"T18-HLOOKUP(X18,Feuil1!$C$1:$BJ$10,5,FALSE)","v":75},{"$f":"T18-HLOOKUP(X18,Feuil1!$C$1:$BJ$10,6,FALSE)","v":55},{"$f":"T18-HLOOKUP(X18,Feuil1!$C$1:$BJ$10,7,FALSE)","v":35},{"$f":"T18-HLOOKUP(X18,Feuil1!$C$1:$BJ$10,8,FALSE)","v":15},{"$f":"T18-HLOOKUP(X18,Feuil1!$C$1:$BJ$10,9,FALSE)","v":-5},{"$f":"T18-HLOOKUP(X18,Feuil1!$C$1:$BJ$10,10,FALSE)","v":-795},null,null,null,null,null,null,"INTB +"]
["H","SEST","RAL",1,null,null,null,2004,69,null,null,70,null,null,70,85,null,null,85,{"$f":"IF(I19=\"\",\"\",O19+S19)","v":155},208.51523079431513,{"$error":"#N/A"},{"$error":"#N/A"},{"$f":"IF(I19=\"\",\"\",IF(A19=\"H\",IF(OR(H19=\"SEN\",H19<1997),VLOOKUP(I19,Feuil1!$A$11:$G$29,6),IF(AND(H19>1996,H19<2000),VLOOKUP(I19,Feuil1!$A$11:$G$29,5),IF(AND(H19>1999,H19<2002),VLOOKUP(I19,Feuil1!$A$11:$G$29,4),IF(AND(H19>2001,H19<2004),VLOOKUP(I19,Feuil1!$A$11:$G$29,3),VLOOKUP(I19,Feuil1!$A$11:$G$29,2))))),IF(OR(H19=\"SEN\",H19<1997),VLOOKUP(I19,Feuil1!$G$11:$L$25,6),IF(AND(H19>1996,H19<2000),VLOOKUP(I19,Feuil1!$G$11:$L$25,5),IF(AND(H19>1999,H19<2002),VLOOKUP(I19,Feuil1!$G$11:$L$25,4),IF(AND(H19>2001,H19<2004),VLOOKUP(I19,Feuil1!$G$11:$L$25,3),VLOOKUP(I19,Feuil1!$G$11:$L$25,2)))))))","v":"NON"},null,null," ",{"$f":"T19-HLOOKUP(X19,Feuil1!$C$1:$BJ$10,2,FALSE)","v":{"$error":"#N/A"}},{"$f":"T19-HLOOKUP(X19,Feuil1!$C$1:$BJ$10,3,FALSE)","v":{"$error":"#N/A"}},{"$f":"T19-HLOOKUP(X19,Feuil1!$C$1:$BJ$10,4,FALSE)","v":{"$error":"#N/A"}},{"$f":"T19-HLOOKUP(X19,Feuil1!$C$1:$BJ$10,5,FALSE)","v":{"$error":"#N/A"}},{"$f":"T19-HLOOKUP(X19,Feuil1!$C$1:$BJ$10,6,FALSE)","v":{"$error":"#N/A"}},{"$f":"T19-HLOOKUP(X19,Feuil1!$C$1:$BJ$10,7,FALSE)","v":{"$error":"#N/A"}},{"$f":"T19-HLOOKUP(X19,Feuil1!$C$1:$BJ$10,8,FALSE)","v":{"$error":"#N/A"}},{"$f":"T19-HLOOKUP(X19,Feuil1!$C$1:$BJ$10,9,FALSE)","v":{"$error":"#N/A"}},{"$f":"T19-HLOOKUP(X19,Feuil1!$C$1:$BJ$10,10,FALSE)","v":{"$error":"#N/A"}},null,null,null,null,null,null,{"$error":"#N/A"}]
["H","SEST","RAL",1,null,null,null,2000,69,null,null,65,null,null,65,85,null,null,85,150,201.78893302675658,"IRG +",0,{"$f":"IF(I20=\"\",\"\",IF(A20=\"H\",IF(OR(H20=\"SEN\",H20<1997),VLOOKUP(I20,Feuil1!$A$11:$G$29,6),IF(AND(H20>1996,H20<2000),VLOOKUP(I20,Feuil1!$A$11:$G$29,5),IF(AND(H20>1999,H20<2002),VLOOKUP(I20,Feuil1!$A$11:$G$29,4),IF(AND(H20>2001,H20<2004),VLOOKUP(I20,Feuil1!$A$11:$G$29,3),VLOOKUP(I20,Feuil1!$A$11:$G$29,2))))),IF(OR(H20=\"SEN\",H20<1997),VLOOKUP(I20,Feuil1!$G$11:$L$25,6),IF(AND(H20>1996,H20<2000),VLOOKUP(I20,Feuil1!$G$11:$L$25,5),IF(AND(H20>1999,H20<2002),VLOOKUP(I20,Feuil1!$G$11:$L$25,4),IF(AND(H20>2001,H20<2004),VLOOKUP(I20,Feuil1!$G$11:$L$25,3),VLOOKUP(I20,Feuil1!$G$11:$L$25,2)))))))","v":"C2 69"},null,null," ",{"$f":"T20-HLOOKUP(X20,Feuil1!$C$1:$BJ$10,2,FALSE)","v":55},{"$f":"T20-HLOOKUP(X20,Feuil1!$C$1:$BJ$10,3,FALSE)","v":35},{"$f":"T20-HLOOKUP(X20,Feuil1!$C$1:$BJ$10,4,FALSE)","v":20},{"$f":"T20-HLOOKUP(X20,Feuil1!$C$1:$BJ$10,5,FALSE)","v":0},{"$f":"T20-HLOOKUP(X20,Feuil1!$C$1:$BJ$10,6,FALSE)","v":-20},{"$f":"T20-HLOOKUP(X20,Feuil1!$C$1:$BJ$10,7,FALSE)","v":-40},{"$f":"T20-HLOOKUP(X20,Feuil1!$C$1:$BJ$10,8,FALSE)","v":-60},{"$f":"T20-HLOOKUP(X20,Feuil1!$C$1:$BJ$10,9,FALSE)","v":-80},{"$f":"T20-HLOOKUP(X20,Feuil1!$C$1:$BJ$10,10,FALSE)","v":-850},null,null,null,null,null,null,"IRG +"]
[null,"Tirage au sort :",null,null,null,null,null,"Classement :",null,null,null,{"$f":"IF(Y21=\"\",\"\",RANK(Y21,$Z$6:$Z$11,0))","v":5},null,null,null,null,null,null,null,null,null,null,null,null,{"$f":"SUM(U22:U24)","v":659.17718122073813}]
["H","SEST","RAL",1,null,null,null,2003,69,null,null,60,null,null,60,75,null,null,75,{"$f":"IF(I22=\"\",\"\",O22+S22)","v":135},181.61003972408091,"IRG +",5,{"$f":"IF(I22=\"\",\"\",IF(A22=\"H\",IF(OR(H22=\"SEN\",H22<1997),VLOOKUP(I22,Feuil1!$A$11:$G$29,6),IF(AND(H22>1996,H22<2000),VLOOKUP(I22,Feuil1!$A$11:$G$29,5),IF(AND(H22>1999,H22<2002),VLOOKUP(I22,Feuil1!$A$11:$G$29,4),IF(AND(H22>2001,H22<2004),VLOOKUP(I22,Feuil1!$A$11:$G$29,3),VLOOKUP(I22,Feuil1!$A$11:$G$29,2))))),IF(OR(H22=\"SEN\",H22<1997),VLOOKUP(I22,Feuil1!$G$11:$L$25,6),IF(AND(H22>1996,H22<2000),VLOOKUP(I22,Feuil1!$G$11:$L$25,5),IF(AND(H22>1999,H22<2002),VLOOKUP(I22,Feuil1!$G$11:$L$25,4),IF(AND(H22>2001,H22<2004),VLOOKUP(I22,Feuil1!$G$11:$L$25,3),VLOOKUP(I22,Feuil1!$G$11:$L$25,2)))))))","v":"C1 69"},null,null," ",{"$f":"T22-HLOOKUP(X22,Feuil1!$C$1:$BJ$10,2,FALSE)","v":50},{"$f":"T22-HLOOKUP(X22,Feuil1!$C$1:$BJ$10,3,FALSE)","v":30},{"$f":"T22-HLOOKUP(X22,Feuil1!$C$1:$BJ$10,4,FALSE)","v":20},{"$f":"T22-HLOOKUP(X22,Feuil1!$C$1:$BJ$10,5,FALSE)","v":5},{"$f":"T22-HLOOKUP(X22,Feuil1!$C$1:$BJ$10,6,FALSE)","v":-15},{"$f":"T22-HLOOKUP(X22,Feuil1!$C$1:$BJ$10,7,FALSE)","v":-35},{"$f":"T22-HLOOKUP(X22,Feuil1!$C$1:$BJ$10,8,FALSE)","v":-55},{"$f":"T22-HLOOKUP(X22,Feuil1!$C$1:$BJ$10,9,FALSE)","v":-75},{"$f":"T22-HLOOKUP(X22,Feuil1!$C$1:$BJ$10,10,FALSE)","v":-865},null,null,null,null,null,null,"IRG +"]
["H","SEST","RAL",1,null,null,null,2000,69,null," ",90,null,null,90,115,null,null,115,{"$f":"IF(I23=\"\",\"\",O23+S23)","v":205},275.77820846990062,"NAT +",15,{"$f":"IF(I23=\"\",\"\",IF(A23=\"H\",IF(OR(H23=\"SEN\",H23<1997),VLOOKUP(I23,Feuil1!$A$11:$G$29,6),IF(AND(H23>1996,H23<2000),VLOOKUP(I23,Feuil1!$A$11:$G$29,5),IF(AND(H23>1999,H23<2002),VLOOKUP(I23,Feuil1!$A$11:$G$29,4),IF(AND(H23>2001,H23<2004),VLOOKUP(I23,Feuil1!$A$11:$G$29,3),VLOOKUP(I23,Feuil1!$A$11:$G$29,2))))),IF(OR(H23=\"SEN\",H23<1997),VLOOKUP(I23,Feuil1!$G$11:$L$25,6),IF(AND(H23>1996,H23<2000),VLOOKUP(I23,Feuil1!$G$11:$L$25,5),IF(AND(H23>1999,H23<2002),VLOOKUP(I23,Feuil1!$G$11:$L$25,4),IF(AND(H23>2001,H23<2004),VLOOKUP(I23,Feuil1!$G$11:$L$25,3),VLOOKUP(I23,Feuil1!$G$11:$L$25,2)))))))","v":"C2 69"},null,null," ",{"$f":"T23-HLOOKUP(X23,Feuil1!$C$1:$BJ$10,2,FALSE)","v":110},{"$f":"T23-HLOOKUP(X23,Feuil1!$C$1:$BJ$10,3,FALSE)","v":90},{"$f":"T23-HLOOKUP(X23,Feuil1!$C$1:$BJ$10,4,FALSE)","v":75},{"$f":"T23-HLOOKUP(X23,Feuil1!$C$1:$BJ$10,5,FALSE)","v":55},{"$f":"T23-HLOOKUP(X23,Feuil1!$C$1:$BJ$10,6,FALSE)","v":35},{"$f":"T23-HLOOKUP(X23,Feuil1!$C$1:$BJ$10,7,FALSE)","v":15},{"$f":"T23-HLOOKUP(X23,Feuil1!$C$1:$BJ$10,8,FALSE)","v":-5},{"$f":"T23-HLOOKUP(X23,Feuil1!$C$1:$BJ$10,9,FALSE)","v":-25},{"$f":"T23-HLOOKUP(X23,Feuil1!$C$1:$BJ$10,10,FALSE)","v":-795},null,null,null,null,null,null,"NAT +"]
["H","SEST","RAL",1,null,null,null,1997,69,null,null,65,null,null,65,85,null,null,85,150,201.78893302675658,"REG +",0,{"$f":"IF(I24=\"\",\"\",IF(A24=\"H\",IF(OR(H24=\"SEN\",H24<1997),VLOOKUP(I24,Feuil1!$A$11:$G$29,6),IF(AND(H24>1996,H24<2000),VLOOKUP(I24,Feuil1!$A$11:$G$29,5),IF(AND(H24>1999,H24<2002),VLOOKUP(I24,Feuil1!$A$11:$G$29,4),IF(AND(H24>2001,H24<2004),VLOOKUP(I24,Feuil1!$A$11:$G$29,3),VLOOKUP(I24,Feuil1!$A$11:$G$29,2))))),IF(OR(H24=\"SEN\",H24<1997),VLOOKUP(I24,Feuil1!$G$11:$L$25,6),IF(AND(H24>1996,H24<2000),VLOOKUP(I24,Feuil1!$G$11:$L$25,5),IF(AND(H24>1999,H24<2002),VLOOKUP(I24,Feuil1!$G$11:$L$25,4),IF(AND(H24>2001,H24<2004),VLOOKUP(I24,Feuil1!$G$11:$L$25,3),VLOOKUP(I24,Feuil1!$G$11:$L$25,2)))))))","v":"J69"},null,null," ",{"$f":"T24-HLOOKUP(X24,Feuil1!$C$1:$BJ$10,2,FALSE)","v":40},{"$f":"T24-HLOOKUP(X24,Feuil1!$C$1:$BJ$10,3,FALSE)","v":20},{"$f":"T24-HLOOKUP(X24,Feuil1!$C$1:$BJ$10,4,FALSE)","v":0},{"$f":"T24-HLOOKUP(X24,Feuil1!$C$1:$BJ$10,5,FALSE)","v":-20},{"$f":"T24-HLOOKUP(X24,Feuil1!$C$1:$BJ$10,6,FALSE)","v":-40},{"$f":"T24-HLOOKUP(X24,Feuil1!$C$1:$BJ$10,7,FALSE)","v":-70},{"$f":"T24-HLOOKUP(X24,Feuil1!$C$1:$BJ$10,8,FALSE)","v":-90},{"$f":"T24-HLOOKUP(X24,Feuil1!$C$1:$BJ$10,9,FALSE)","v":-100},{"$f":"T24-HLOOKUP(X24,Feuil1!$C$1:$BJ$10,10,FALSE)","v":-850},null,null,null,null,null,null,"REG +"]
[null,"Tirage au sort :",null,null,null,null,null,"Classement :",null,null,null,{"$f":"IF(Y25=\"\",\"\",RANK(Y25,$Z$6:$Z$11,0))","v":6},null,null,null,null,null,null,null,null,null,null,null,null,{"$f":"SUM(U26:U28)","v":484.29343926421575}]
["H","SEST","RAL",1,null,null,null,2003,69,null,null,50,null,null,50,70,null,null,70,{"$f":"IF(I26=\"\",\"\",O26+S26)","v":120},161.43114642140526,"REG +",5,{"$f":"IF(I26=\"\",\"\",IF(A26=\"H\",IF(OR(H26=\"SEN\",H26<1997),VLOOKUP(I26,Feuil1!$A$11:$G$29,6),IF(AND(H26>1996,H26<2000),VLOOKUP(I26,Feuil1!$A$11:$G$29,5),IF(AND(H26>1999,H26<2002),VLOOKUP(I26,Feuil1!$A$11:$G$29,4),IF(AND(H26>2001,H26<2004),VLOOKUP(I26,Feuil1!$A$11:$G$29,3),VLOOKUP(I26,Feuil1!$A$11:$G$29,2))))),IF(OR(H26=\"SEN\",H26<1997),VLOOKUP(I26,Feuil1!$G$11:$L$25,6),IF(AND(H26>1996,H26<2000),VLOOKUP(I26,Feuil1!$G$11:$L$25,5),IF(AND(H26>1999,H26<2002),VLOOKUP(I26,Feuil1!$G$11:$L$25,4),IF(AND(H26>2001,H26<2004),VLOOKUP(I26,Feuil1!$G$11:$L$25,3),VLOOKUP(I26,Feuil1!$G$11:$L$25,2)))))))","v":"C1 69"},null,null," ",{"$f":"T26-HLOOKUP(X26,Feuil1!$C$1:$BJ$10,2,FALSE)","v":35},{"$f":"T26-HLOOKUP(X26,Feuil1!$C$1:$BJ$10,3,FALSE)","v":15},{"$f":"T26-HLOOKUP(X26,Feuil1!$C$1:$BJ$10,4,FALSE)","v":5},{"$f":"T26-HLOOKUP(X26,Feuil1!$C$1:$BJ$10,5,FALSE)","v":-10},{"$f":"T26-HLOOKUP(X26,Feuil1!$C$1:$BJ$10,6,FALSE)","v":-30},{"$f":"T26-HLOOKUP(X26,Feuil1!$C$1:$BJ$10,7,FALSE)","v":-50},{"$f":"T26-HLOOKUP(X26,Feuil1!$C$1:$BJ$10,8,FALSE)","v":-70},{"$f":"T26-HLOOKUP(X26,Feuil1!$C$1:$BJ$10,9,FALSE)","v":-90},{"$f":"T26-HLOOKUP(X26,Feuil1!$C$1:$BJ$10,10,FALSE)","v":-880},null,null,null,null,null,null,"REG +"]
["H","SEST","RAL",1,null,null,null,2004,69,null,null,50,null,null,50,55,null,null,55,{"$f":"IF(I27=\"\",\"\",O27+S27)","v":105},141.25225311872958,{"$error":"#N/A"},{"$error":"#N/A"},{"$f":"IF(I27=\"\",\"\",IF(A27=\"H\",IF(OR(H27=\"SEN\",H27<1997),VLOOKUP(I27,Feuil1!$A$11:$G$29,6),IF(AND(H27>1996,H27<2000),VLOOKUP(I27,Feuil1!$A$11:$G$29,5),IF(AND(H27>1999,H27<2002),VLOOKUP(I27,Feuil1!$A$11:$G$29,4),IF(AND(H27>2001,H27<2004),VLOOKUP(I27,Feuil1!$A$11:$G$29,3),VLOOKUP(I27,Feuil1!$A$11:$G$29,2))))),IF(OR(H27=\"SEN\",H27<1997),VLOOKUP(I27,Feuil1!$G$11:$L$25,6),IF(AND(H27>1996,H27<2000),VLOOKUP(I27,Feuil1!$G$11:$L$25,5),IF(AND(H27>1999,H27<2002),VLOOKUP(I27,Feuil1!$G$11:$L$25,4),IF(AND(H27>2001,H27<2004),VLOOKUP(I27,Feuil1!$G$11:$L$25,3),VLOOKUP(I27,Feuil1!$G$11:$L$25,2)))))))","v":"NON"},null,null," ",{"$f":"T27-HLOOKUP(X27,Feuil1!$C$1:$BJ$10,2,FALSE)","v":{"$error":"#N/A"}},{"$f":"T27-HLOOKUP(X27,Feuil1!$C$1:$BJ$10,3,FALSE)","v":{"$error":"#N/A"}},{"$f":"T27-HLOOKUP(X27,Feuil1!$C$1:$BJ$10,4,FALSE)","v":{"$error":"#N/A"}},{"$f":"T27-HLOOKUP(X27,Feuil1!$C$1:$BJ$10,5,FALSE)","v":{"$error":"#N/A"}},{"$f":"T27-HLOOKUP(X27,Feuil1!$C$1:$BJ$10,6,FALSE)","v":{"$error":"#N/A"}},{"$f":"T27-HLOOKUP(X27,Feuil1!$C$1:$BJ$10,7,FALSE)","v":{"$error":"#N/A"}},{"$f":"T27-HLOOKUP(X27,Feuil1!$C$1:$BJ$10,8,FALSE)","v":{"$error":"#N/A"}},{"$f":"T27-HLOOKUP(X27,Feuil1!$C$1:$BJ$10,9,FALSE)","v":{"$error":"#N/A"}},{"$f":"T27-HLOOKUP(X27,Feuil1!$C$1:$BJ$10,10,FALSE)","v":{"$error":"#N/A"}},null,null,null,null,null,null,{"$error":"#N/A"}]
["H","SEST","RAL",1,null,null,null,2000,69,null,null,60,null,null,60,75,null,null,75,135,181.61003972408091,"REG +",5,{"$f":"IF(I28=\"\",\"\",IF(A28=\"H\",IF(OR(H28=\"SEN\",H28<1997),VLOOKUP(I28,Feuil1!$A$11:$G$29,6),IF(AND(H28>1996,H28<2000),VLOOKUP(I28,Feuil1!$A$11:$G$29,5),IF(AND(H28>1999,H28<2002),VLOOKUP(I28,Feuil1!$A$11:$G$29,4),IF(AND(H28>2001,H28<2004),VLOOKUP(I28,Feuil1!$A$11:$G$29,3),VLOOKUP(I28,Feuil1!$A$11:$G$29,2))))),IF(OR(H28=\"SEN\",H28<1997),VLOOKUP(I28,Feuil1!$G$11:$L$25,6),IF(AND(H28>1996,H28<2000),VLOOKUP(I28,Feuil1!$G$11:$L$25,5),IF(AND(H28>1999,H28<2002),VLOOKUP(I28,Feuil1!$G$11:$L$25,4),IF(AND(H28>2001,H28<2004),VLOOKUP(I28,Feuil1!$G$11:$L$25,3),VLOOKUP(I28,Feuil1!$G$11:$L$25,2)))))))","v":"C2 69"},null,null," ",{"$f":"T28-HLOOKUP(X28,Feuil1!$C$1:$BJ$10,2,FALSE)","v":40},{"$f":"T28-HLOOKUP(X28,Feuil1!$C$1:$BJ$10,3,FALSE)","v":20},{"$f":"T28-HLOOKUP(X28,Feuil1!$C$1:$BJ$10,4,FALSE)","v":5},{"$f":"T28-HLOOKUP(X28,Feuil1!$C$1:$BJ$10,5,FALSE)","v":-15},{"$f":"T28-HLOOKUP(X28,Feuil1!$C$1:$BJ$10,6,FALSE)","v":-35},{"$f":"T28-HLOOKUP(X28,Feuil1!$C$1:$BJ$10,7,FALSE)","v":-55},{"$f":"T28-HLOOKUP(X28,Feuil1!$C$1:$BJ$10,8,FALSE)","v":-75},{"$f":"T28-HLOOKUP(X28,Feuil1!$C$1:$BJ$10,9,FALSE)","v":-95},{"$f":"T28-HLOOKUP(X28,Feuil1!$C$1:$BJ$10,10,FALSE)","v":-865},null,null,null,null,null,null,"REG +"]
[null,null,null,null,null,null,null,null,null,null,null,null," "," ",null,null,null,null,null,null,null,null,null,null,null,null,null,null,null,null,null,null,null,null,null,null,null,null,null,null,null,null," "]
[null,null,null,null,null,null,null,null,null,null,null,null," "," "]
[null,"Secrétaire :",null,null,null," ",null," ",null,1," "]
[null,null,null,null,null,null,null," ","ARBITRES :                        2",null," ",null,null,null,null,null,null,"Signatures :"]
[null,"Contrôleur Technique 1 :",null,null,null," ",null," ",null,3," "]
[null,"Contrôleur Technique 2 :"]
[null,"Chronométreur :",null,null,null," ",null,null,null,"JURY :"," ",null,null,null,null," ",null,null,null,null,null," "]
[]
[]
[]
[]
[]
[]
[]
[]
[]
[]
[]
[]
[]
[]
[]
[]
[]
[]
[]
[]
[]
[]
[]
[]
[]
[]
[]
[]
[]
[]
[]
[]
[]
[]
[]
[]
[]
[]
[]
[]
[]
[]
[]
[]
[]
[]
[]
[]
[]
[]
[]
[]
[]
[]
[]
[]
[]
[]
[]
[]
[]
[]
[]
[]
[]
[]
[]
[]
[]
[]
[]
[]
[]
[]
[]
[]
[]
[]
[]
[]
[]
[]
[]
[]
[]
[]
[]
[]
[]
[]
[]
[]
[]
[]
[]
[]
[]
[]
[]
[]
[]
[]
[]
[]
[]
[]
[]
[]
[]
[]
[]
[]
[]
[]
[]
[]
[]
[]
[]
[]
[]
[]
[]
[]
[]
[]
[]
[]
[]
[]
[]
[]
[]
[]
[]
[]
[]
[]
[]
[]
[]
[]
[]
[]
[]
[]
[]
[]
[]
[]
[]
[]
[]
[]
[]
[]
[]
[]
[]
[]
[]
[]
[]
[]
[]
[]
[]
[]
[]
[]
[]
[]
[]
[]
[]
[]
[]
[]
[]
[]
[]
[]
[]
[]
[]
[]
[]
[]
[]
[]
[]
[]
[]
[]
[]
[]
[]
[]
[]
[]
[]
[]
[]
[]
[]
[]
[]
[]
[]
[]
[]
[]
[]
[]
[]
[]
[]
[]
[]
[]
[]
[]
[]
[]
[]
[]
[]
[]
[]
[]
[]
[]
[]
[]
[]
[]
[]
[]
[]
[]
[]
[]
[]
[]
[]
[]
[]
[]
[]
[]
[]
[]
[]
[]
[]
[]
[]
[]
[]
[]
[]
[]
[]
[]
[]
[]
[]
[]
[]
[]
[]
[]
[]
[]
[]
[]
[]
[]
[]
[]
[]
[]
[]
[]
[]
[]
[]
[]
[]
[]
[]
[]
[]
[]
[]
[]
[]
[]
[]
[]
[]
[]
[]
[]
[]
[]
[]
[]
[]
[]
[]
[]
[]
[]
[]
[]
[]
[]
[]
[]
[]
[]
[]
[]
[]
[]
[]
[]
[]
[]
[]
[]
[]
[]
[]
[]
[]
[]
[]
[]
[]
[]
[]
[]
[]
[]
[]
[]
[]
[]
[]
[]
[]
[]
[]
[]
[]
[]
[]
[]
[]
[]
[]
[]
[]
[]
[]
[]
[]
[]
[]
[]
[]
[]
[]
[]
[]
[]
[]
[]
[]
[]
[]
[]
[]
[]
[]
[]
[]
[]
[]
[]
[]
[]
[]
[]
[]
[]
[]
[]
[]
[]
[]
[]
[]
[]
[]
[]
[]
[]
[]
[]
[]
[]
[]
[]
[]
[]
[]
[]
[]
[]
[]
[]
[]
[]
[]
[]
[]
[]
[]
[]
[]
[]
[]
[]
[]
[]
[]
[]
[]
[]
[]
[]
[]
[]
[]
[]
[]
[]
[]
[]
[]
[]
[]
[]
[]
[]
[]
[]
[]
[]
[]
[]
[]
[]
[]
[]
[]
[]
[]
[]
[]
[]
[]
[]
[]
[]
[]
[]
[]
[]
[]
[]
[]
[]
[]
[]
[]
[]
[]
[]
[]
[]
[null,null,null,null,null,null,null,null,null,null,null,null,null,null,null,null,null,null,null,null,null,null,null,null,null,null,null,"J77","J85","J94","J105","J+105",null,"J56","J62","J69","J77","J85","J94","J105","J+105",null,"S56","S62","S69","S77","S85","S94","S105","S+105"]
[null,null,null,null,null,null,null,null,null,null,null,null,null,null,null,null,null,null,null,null,null,null,null,null,null,null,null,145,160,170,180,190,null,100,115,130,145,160,170,180,190,null,115,135,150,165,180,190,200,210]
[null,null,null,null,null,null,null,null,null,null,null,null,null,null,null,null,null,null,null,null,null,null,null,null,null,null,null,165,180,190,200,210,null,115,135,150,165,180,190,200,210,null,130,150,165,185,200,210,220,230]
[null,null,null,null,null,null,null,null,null,null,null,null,null,null,null,null,null,null,null,null,null,null,null,null,null,null,null,185,200,210,220,230,null,130,150,165,185,200,210,220,230,null,145,165,180,200,220,230,240,250]
[null,null,null,null,null,null,null,null,null,null,null,null,null,null,null,null,null,null,null,null,null,null,null,null,null,null,null,200,220,230,240,250,null,145,165,180,200,220,230,240,250,null,175,195,215,235,250,260,275,280]
[null,null,null,null,null,null,null,null,null,null,null,null,null,null,null,null,null,null,null,null,null,null,null,null,null,null,null,235,250,260,275,280,null,175,195,215,235,250,260,275,280,null,210,230,250,270,290,300,310,325]
[null,null,null,null,null,null,null,null,null,null,null,null,null,null,null,null,null,null,null,null,null,null,null,null,null,null,null,270,290,300,310,325,null,210,230,250,270,290,300,310,325,null,230,255,275,300,315,335,345,355]
[null,null,null,null,null,null,null,null,null,null,null,null,null,null,null,null,null,null,null,null,null,null,null,null,null,null,null,320,335,355,370,380,null,245,270,295,320,335,355,370,380,null,245,270,295,320,335,355,370,380]

{"sheet":"Feuil2","index":3,"n_rows":0,"n_cols":0,"rows_kept":0,"cut":false,"hidden":false,"merged":[]}