{"text_format":"1","workbook":"xlsx","n_sheets":4,"sheets":["Feuil1","FEMMES","HOMMES","Feuil2"],"not_rendered":{"charts":0,"images":0,"macros":1,"external_links":0,"defined_names":4,"comments":0,"pivot_tables":0},"unopened":[],"bounds":{"document_bytes":16777216,"sheet_cells":100000,"rows_first":2000,"rows_last":500,"rows_between":2000,"halvings":0,"cell_chars":16384,"cell_head_chars":4096},"cells_cut":0,"cells_raw":0,"read":"whole","date_system":"1900"}

{"sheet":"Feuil1","index":0,"n_rows":29,"n_cols":64,"rows_kept":29,"cut":false,"hidden":true,"merged":[]}
[null,null,"FC1 40","FC1 44","FC1 48","FC1 53","FC1 58","FC1 63","FC1 69","FC1 +69","FC2 44","FC2 48","FC2 53","FC2 58","FC2 63","FC2 69","FC2 +69","FJ48","FJ53","FJ58","FJ63","FJ69","FJ75","FJ+75","FS48","FS53","FS58","FS63","FS69","FS75","FS+75","C1 45","C1 50","C1 56","C1 62","C1 69","C1 77","C1 85","C1 94","C1 +94","C2 50","C2 56","C2 62","C2 69","C2 77","C2 85","C2 94","C2 +94","J56","J62","J69","J77","J85","J94","J105","J+105","S56","S62","S69","S77","S85","S94","S105","S+105"]
[null,"DEBUTANT",20,25,30,35,40,45,50,60,30,35,45,50,55,60,70,45,55,60,65,70,80,90,55,65,70,75,80,95,100,35,40,50,75,85,90,100,110,120,45,65,85,95,110,120,125,135,80,90,110,130,145,150,155,165,95,120,130,150,165,170,175,185]
[null,"DEPARTEMENTAL",25,30,35,45,50,55,60,70,40,45,55,60,65,70,80,55,65,70,75,80,95,100,65,75,80,85,90,105,110,50,55,70,95,105,110,120,130,140,65,85,105,115,130,140,145,155,100,120,130,150,165,170,175,185,115,135,150,170,185,190,195,205]
[null,"REGIONAL",35,40,45,55,60,65,70,80,50,55,65,70,75,80,95,65,75,80,85,90,105,110,75,85,90,95,105,115,125,60,65,85,105,115,130,140,145,155,80,100,120,130,150,160,165,175,115,135,150,170,185,190,195,205,130,150,170,190,205,215,220,225]
[null,"INTERREGIONAL",45,50,55,65,70,75,80,95,60,65,75,80,85,90,105,75,85,90,95,105,115,125,85,95,100,110,120,130,140,75,80,100,120,130,150,160,165,175,95,115,135,150,170,180,185,195,130,150,170,190,205,215,220,225,145,170,190,210,225,235,245,250]
[null,"FEDERAL",50,60,65,75,80,85,90,105,70,75,85,90,95,105,115,85,95,100,110,120,130,140,95,105,115,125,135,145,150,90,95,115,135,150,170,180,185,195,110,130,150,170,185,200,210,220,145,170,190,210,225,235,245,250,170,190,220,240,250,260,270,280]
[null,"NATIONAL",60,70,75,85,90,95,105,115,80,85,95,100,110,120,130,95,105,115,125,135,145,150,110,120,130,140,150,160,170,105,110,130,150,170,185,200,210,220,120,145,170,190,200,220,225,235,170,190,220,240,250,260,270,280,190,210,240,265,280,290,300,310]
[null,"INTERNATIONAL B",70,80,85,95,100,110,120,130,90,95,105,115,125,135,145,110,120,130,140,150,160,170,125,140,150,160,170,180,190,115,120,145,170,190,200,220,225,235,135,170,190,210,220,240,250,260,190,210,240,260,280,290,300,310,210,230,260,285,300,310,325,330]
[null,"INTERNATIONAL A",80,90,95,105,115,125,135,145,100,110,120,130,140,150,160,125,135,150,160,170,180,190,140,160,170,180,190,195,210,130,135,170,190,210,220,240,250,260,150,190,210,230,250,260,280,280,210,230,250,285,300,310,325,330,225,255,275,305,325,330,345,355]
[null,"OLYMPIQUE",1000,1000,1000,1000,1000,1000,1000,1000,1000,1000,1000,1000,1000,1000,1000,1000,1000,1000,1000,1000,1000,1000,155,175,190,200,205,210,225,1000,1000,1000,1000,1000,1000,10000,1000,1000,1000,1000,1000,1000,1000,10000,1000,1000,1000,1000,1000,10000,1000,1000,1000,10000,240,270,290,320,345,355,365,375]
{"$rows_left_out":20}
{"sheet":"FEMMES","index":1,"n_rows":537,"n_cols":50,"rows_kept":537,"cut":false,"hidden":false,"merged":[[20,7,20,10],[24,7,24,10],[0,2,0,10],[0,17,0,18],[0,21,0,22],[4,7,4,10],[5,9,7,9],[8,7,8,10],[12,7,12,10],[16,7,16,10],[3,21,3,22],[1,11,1,13],[0,24,1,24],[1,7,1,8],[1,14,1,18],[1,19,1,20],[1,21,1,23],[30,1,30,4],[30,5,30,6],[30,10,30,15],[30,19,30,23],[31,1,31,4],[31,5,31,6],[31,8,31,9],[31,10,31,15],[31,17,31,18],[32,1,32,4],[32,5,32,6],[32,10,32,15],[33,1,33,4],[33,5,33,6],[34,1,34,4],[34,5,34,6],[34,10,34,13],[34,15,34,18],[34,21,34,23]]}
[null,null,"COUPE DE FRANCE DES CLUBS JEUNES     2017",null,null,null,null,null,null,null,null,null,null,null,"TOUR :",null,null,null,null," ",null,null,null,null,"FEMMES   CA/JU"]
[null,null,null,null,null,null,"LIEU :",null,null,null,null,"REGION :",null,null,null,null,null,null,null,"Date :"]
[]
["SEXE","ZONE","REG.","CL.","LICENCE","NOMS","Prénoms","AN","POIDS","CLUB","NAT",1,2,3,"ARR",1,2,3,"EP-J","Total","IWF","SERIE",null,"Catég"," ",null," ","DEB ","DEP +","REG +","IRG +","FED +","NAT +","INTB +","INTA +","OLY +"]
[null,"Tirage au sort :",null,null,null,null,null,"Classement :",null,null,null,{"$f":"IF(Y5=\"\",\"\",RANK(Y5,$Z$6:$Z$11,0))","v":1},null,null,null,null,null,null,null,null,null,null,null,null,{"$f":"SUM(U6:U8)","v":691.91658664457714},null," ",{"$f":"T5-HLOOKUP(X5,Feuil1!$C$1:$BJ$10,2,FALSE)","v":{"$error":"#N/A"}},{"$f":"T5-HLOOKUP(X5,Feuil1!$C$1:$BJ$10,3,FALSE)","v":{"$error":"#N/A"}},{"$f":"T5-HLOOKUP(X5,Feuil1!$C$1:$BJ$10,4,FALSE)","v":{"$error":"#N/A"}},{"$f":"T5-HLOOKUP(X5,Feuil1!$C$1:$BJ$10,5,FALSE)","v":{"$error":"#N/A"}},{"$f":"T5-HLOOKUP(X5,Feuil1!$C$1:$BJ$10,6,FALSE)","v":{"$error":"#N/A"}},{"$f":"T5-HLOOKUP(X5,Feuil1!$C$1:$BJ$10,7,FALSE)","v":{"$error":"#N/A"}},{"$f":"T5-HLOOKUP(X5,Feuil1!$C$1:$BJ$10,8,FALSE)","v":{"$error":"#N/A"}},{"$f":"T5-HLOOKUP(X5,Feuil1!$C$1:$BJ$10,9,FALSE)","v":{"$error":"#N/A"}},{"$f":"T5-HLOOKUP(X5,Feuil1!$C$1:$BJ$10,10,FALSE)","v":{"$error":"#N/A"}},null,null,null,null,null,null,{"$f":"IF(AJ5>=0,$AJ$4,IF(AI5>=0,$AI$4,IF(AH5>=0,$AH$4,IF(AG5>=0,$AG$4,IF(AF5>=0,$AF$4,IF(AE5>=0,$AE$4,IF(AD5>=0,$AD$4,IF(AC5>=0,$AC$4,$AB$4))))))))","v":{"$error":"#N/A"}}]
["F","SEST","RAL",1,null,null,null,1997,53,null,null,75,null,null,{"$f":"IF(H6=\"\",\"\",IF(MAXA(L6:N6)<=0,0,MAXA(L6:N6)))","v":75},89,null,null,{"$f":"IF(H6=\"\",\"\",IF(MAXA(P6:R6)<=0,0,MAXA(P6:R6)))","v":89},{"$f":"IF(I6=\"\",\"\",O6+S6)","v":164},{"$f":"IF(I6=\"\",\"\",IF(A6=\"H\",10^(0.794358141*LOG(I6/174.393)^2)*T6,IF(A6=\"F\",10^(0.89726074*LOG(I6/148.026)^2)*T6,\"\")))","v":247.38484922207783},{"$f":"IF(H6=\"\",\"\",AQ6)","v":"INTA +"},{"$f":"IF(AJ6>=0,AJ6,IF(AI6>=0,AI6,IF(AH6>=0,AH6,IF(AG6>=0,AG6,IF(AF6>=0,AF6,IF(AE6>=0,AE6,IF(AD6>=0,AD6,IF(AC6>=0,AC6,AB6))))))))","v":29},{"$f":"IF(I6=\"\",\"\",IF(A6=\"H\",IF(OR(H6=\"SEN\",H6<1997),VLOOKUP(I6,Feuil1!$A$11:$G$29,6),IF(AND(H6>1996,H6<2000),VLOOKUP(I6,Feuil1!$A$11:$G$29,5),IF(AND(H6>1999,H6<2002),VLOOKUP(I6,Feuil1!$A$11:$G$29,4),IF(AND(H6>2001,H6<2004),VLOOKUP(I6,Feuil1!$A$11:$G$29,3),VLOOKUP(I6,Feuil1!$A$11:$G$29,2))))),IF(OR(H6=\"SEN\",H6<1997),VLOOKUP(I6,Feuil1!$G$11:$L$25,6),IF(AND(H6>1996,H6<2000),VLOOKUP(I6,Feuil1!$G$11:$L$25,5),IF(AND(H6>1999,H6<2002),VLOOKUP(I6,Feuil1!$G$11:$L$25,4),IF(AND(H6>2001,H6<2004),VLOOKUP(I6,Feuil1!$G$11:$L$25,3),VLOOKUP(I6,Feuil1!$G$11:$L$25,2)))))))","v":"FJ53"},null,{"$f":"Y5","v":691.91658664457714}," ",{"$f":"T6-HLOOKUP(X6,Feuil1!$C$1:$BJ$10,2,FALSE)","v":109},{"$f":"T6-HLOOKUP(X6,Feuil1!$C$1:$BJ$10,3,FALSE)","v":99},{"$f":"T6-HLOOKUP(X6,Feuil1!$C$1:$BJ$10,4,FALSE)","v":89},{"$f":"T6-HLOOKUP(X6,Feuil1!$C$1:$BJ$10,5,FALSE)","v":79},{"$f":"T6-HLOOKUP(X6,Feuil1!$C$1:$BJ$10,6,FALSE)","v":69},{"$f":"T6-HLOOKUP(X6,Feuil1!$C$1:$BJ$10,7,FALSE)","v":59},{"$f":"T6-HLOOKUP(X6,Feuil1!$C$1:$BJ$10,8,FALSE)","v":44},{"$f":"T6-HLOOKUP(X6,Feuil1!$C$1:$BJ$10,9,FALSE)","v":29},{"$f":"T6-HLOOKUP(X6,Feuil1!$C$1:$BJ$10,10,FALSE)","v":-836},null,null,null,null,null,null,{"$f":"IF(AJ6>=0,$AJ$4,IF(AI6>=0,$AI$4,IF(AH6>=0,$AH$4,IF(AG6>=0,$AG$4,IF(AF6>=0,$AF$4,IF(AE6>=0,$AE$4,IF(AD6>=0,$AD$4,IF(AC6>=0,$AC$4,$AB$4))))))))","v":"INTA +"}]
["F","SEST","RAL",1,null,null,null,1998,58,null,null,72,null,null,72,88,null,null,88,{"$f":"IF(I7=\"\",\"\",O7+S7)","v":160},225.26027413604427,"INTA +",10,{"$f":"IF(I7=\"\",\"\",IF(A7=\"H\",IF(OR(H7=\"SEN\",H7<1997),VLOOKUP(I7,Feuil1!$A$11:$G$29,6),IF(AND(H7>1996,H7<2000),VLOOKUP(I7,Feuil1!$A$11:$G$29,5),IF(AND(H7>1999,H7<2002),VLOOKUP(I7,Feuil1!$A$11:$G$29,4),IF(AND(H7>2001,H7<2004),VLOOKUP(I7,Feuil1!$A$11:$G$29,3),VLOOKUP(I7,Feuil1!$A$11:$G$29,2))))),IF(OR(H7=\"SEN\",H7<1997),VLOOKUP(I7,Feuil1!$G$11:$L$25,6),IF(AND(H7>1996,H7<2000),VLOOKUP(I7,Feuil1!$G$11:$L$25,5),IF(AND(H7>1999,H7<2002),VLOOKUP(I7,Feuil1!$G$11:$L$25,4),IF(AND(H7>2001,H7<2004),VLOOKUP(I7,Feuil1!$G$11:$L$25,3),VLOOKUP(I7,Feuil1!$G$11:$L$25,2)))))))","v":"FJ58"},null,{"$f":"Y9","v":628.53456806112854}," ",{"$f":"T7-HLOOKUP(X7,Feuil1!$C$1:$BJ$10,2,FALSE)","v":100},{"$f":"T7-HLOOKUP(X7,Feuil1!$C$1:$BJ$10,3,FALSE)","v":90},{"$f":"T7-HLOOKUP(X7,Feuil1!$C$1:$BJ$10,4,FALSE)","v":80},{"$f":"T7-HLOOKUP(X7,Feuil1!$C$1:$BJ$10,5,FALSE)","v":70},{"$f":"T7-HLOOKUP(X7,Feuil1!$C$1:$BJ$10,6,FALSE)","v":60},{"$f":"T7-HLOOKUP(X7,Feuil1!$C$1:$BJ$10,7,FALSE)","v":45},{"$f":"T7-HLOOKUP(X7,Feuil1!$C$1:$BJ$10,8,FALSE)","v":30},{"$f":"T7-HLOOKUP(X7,Feuil1!$C$1:$BJ$10,9,FALSE)","v":10},{"$f":"T7-HLOOKUP(X7,Feuil1!$C$1:$BJ$10,10,FALSE)","v":-840},null,null,null,null,null,null,"INTA +"]
["F","SEST","RAL",1,null,null,null,1999,63,null,null,70,null,null,70,95,null,null,95,165,219.27146328645503,"INTA +",5,{"$f":"IF(I8=\"\",\"\",IF(A8=\"H\",IF(OR(H8=\"SEN\",H8<1997),VLOOKUP(I8,Feuil1!$A$11:$G$29,6),IF(AND(H8>1996,H8<2000),VLOOKUP(I8,Feuil1!$A$11:$G$29,5),IF(AND(H8>1999,H8<2002),VLOOKUP(I8,Feuil1!$A$11:$G$29,4),IF(AND(H8>2001,H8<2004),VLOOKUP(I8,Feuil1!$A$11:$G$29,3),VLOOKUP(I8,Feuil1!$A$11:$G$29,2))))),IF(OR(H8=\"SEN\",H8<1997),VLOOKUP(I8,Feuil1!$G$11:$L$25,6),IF(AND(H8>1996,H8<2000),VLOOKUP(I8,Feuil1!$G$11:$L$25,5),IF(AND(H8>1999,H8<2002),VLOOKUP(I8,Feuil1!$G$11:$L$25,4),IF(AND(H8>2001,H8<2004),VLOOKUP(I8,Feuil1!$G$11:$L$25,3),VLOOKUP(I8,Feuil1!$G$11:$L$25,2)))))))","v":"FJ63"},null,{"$f":"Y13","v":674.81317597419252}," ",{"$f":"T8-HLOOKUP(X8,Feuil1!$C$1:$BJ$10,2,FALSE)","v":100},{"$f":"T8-HLOOKUP(X8,Feuil1!$C$1:$BJ$10,3,FALSE)","v":90},{"$f":"T8-HLOOKUP(X8,Feuil1!$C$1:$BJ$10,4,FALSE)","v":80},{"$f":"T8-HLOOKUP(X8,Feuil1!$C$1:$BJ$10,5,FALSE)","v":70},{"$f":"T8-HLOOKUP(X8,Feuil1!$C$1:$BJ$10,6,FALSE)","v":55},{"$f":"T8-HLOOKUP(X8,Feuil1!$C$1:$BJ$10,7,FALSE)","v":40},{"$f":"T8-HLOOKUP(X8,Feuil1!$C$1:$BJ$10,8,FALSE)","v":25},{"$f":"T8-HLOOKUP(X8,Feuil1!$C$1:$BJ$10,9,FALSE)","v":5},{"$f":"T8-HLOOKUP(X8,Feuil1!$C$1:$BJ$10,10,FALSE)","v":-835},null,null,null,null,null,null,"INTA +"]
[null,"Tirage au sort :",null,null,null,null,null,"Classement :",null,null,null,{"$f":"IF(Y9=\"\",\"\",RANK(Y9,$Z$6:$Z$11,0))","v":5},null,null,null,null,null,null,null,null,null,null,null,null,{"$f":"SUM(U10:U12)","v":628.53456806112854},{"$f":"Y17","v":633.88595237425875}]
["F","SEST","RAL",1,null,null,null,1999,85,null,null,-70,-70,-70,0,80,null,null,80,{"$f":"IF(I10=\"\",\"\",O10+S10)","v":80},90.192161839446356,"DEB ",-10,{"$f":"IF(I10=\"\",\"\",IF(A10=\"H\",IF(OR(H10=\"SEN\",H10<1997),VLOOKUP(I10,Feuil1!$A$11:$G$29,6),IF(AND(H10>1996,H10<2000),VLOOKUP(I10,Feuil1!$A$11:$G$29,5),IF(AND(H10>1999,H10<2002),VLOOKUP(I10,Feuil1!$A$11:$G$29,4),IF(AND(H10>2001,H10<2004),VLOOKUP(I10,Feuil1!$A$11:$G$29,3),VLOOKUP(I10,Feuil1!$A$11:$G$29,2))))),IF(OR(H10=\"SEN\",H10<1997),VLOOKUP(I10,Feuil1!$G$11:$L$25,6),IF(AND(H10>1996,H10<2000),VLOOKUP(I10,Feuil1!$G$11:$L$25,5),IF(AND(H10>1999,H10<2002),VLOOKUP(I10,Feuil1!$G$11:$L$25,4),IF(AND(H10>2001,H10<2004),VLOOKUP(I10,Feuil1!$G$11:$L$25,3),VLOOKUP(I10,Feuil1!$G$11:$L$25,2)))))))","v":"FJ+75"},null,{"$f":"Y21","v":639.25599215233467}," ",{"$f":"T10-HLOOKUP(X10,Feuil1!$C$1:$BJ$10,2,FALSE)","v":-10},{"$f":"T10-HLOOKUP(X10,Feuil1!$C$1:$BJ$10,3,FALSE)","v":-20},{"$f":"T10-HLOOKUP(X10,Feuil1!$C$1:$BJ$10,4,FALSE)","v":-30},{"$f":"T10-HLOOKUP(X10,Feuil1!$C$1:$BJ$10,5,FALSE)","v":-45},{"$f":"T10-HLOOKUP(X10,Feuil1!$C$1:$BJ$10,6,FALSE)","v":-60},{"$f":"T10-HLOOKUP(X10,Feuil1!$C$1:$BJ$10,7,FALSE)","v":-70},{"$f":"T10-HLOOKUP(X10,Feuil1!$C$1:$BJ$10,8,FALSE)","v":-90},{"$f":"T10-HLOOKUP(X10,Feuil1!$C$1:$BJ$10,9,FALSE)","v":-110},{"$f":"T10-HLOOKUP(X10,Feuil1!$C$1:$BJ$10,10,FALSE)","v":-920},null,null,null,null,null,null,"DEB "]
{"$rows_left_out":528}
{"sheet":"HOMMES","index":2,"n_rows":537,"n_cols":50,"rows_kept":537,"cut":false,"hidden":false,"merged":[[0,2,0,10],[0,17,0,18],[0,21,0,22],[0,24,1,24],[1,7,1,8],[1,11,1,13],[1,14,1,18],[1,19,1,20],[1,21,1,23],[30,19,30,23],[3,21,3,22],[4,7,4,10],[5,9,7,9],[8,7,8,10],[12,7,12,10],[16,7,16,10],[20,7,20,10],[24,7,24,10],[31,17,31,18],[34,21,34,23],[33,1,33,4],[33,5,33,6],[34,1,34,4],[34,5,34,6],[34,10,34,13],[34,15,34,18],[32,1,32,4],[32,5,32,6],[32,10,32,15],[31,1,31,4],[31,5,31,6],[31,8,31,9],[31,10,31,15],[30,1,30,4],[30,5,30,6],[30,10,30,15]]}
[null,null,"COUPE DE FRANCE DES CLUBS JEUNES     2017",null,null,null,null,null,null,null,null,null,null,null,"TOUR :",null,null,null,null," ",null,null,null,null,"HOMMES   CA ou JU"]
[null,null,null,null,null,null,"LIEU :",null,null,null,null,"REGION :",null,null,null,null,null,null,null,"Date :"]
[]
["SEXE","ZONE","REG.","CL.","LICENCE","NOMS","Prénoms","AN","POIDS","CLUB","NAT",1,2,3,"ARR",1,2,3,"EP-J","Total","IWF","SERIE",null,"Catég"," ",null," ","DEB ","DEP +","REG +","IRG +","FED +","NAT +","INTB +","INTA +","OLY +"]
[null,"Tirage au sort :",null,null,null,null,null,"Classement :",null,null,null,{"$f":"IF(Y5=\"\",\"\",RANK(Y5,$Z$6:$Z$11,0))","v":3},null,null,null,null,null,null,null,null,null,null,null,null,{"$f":"SUM(U6:U8)","v":703.14340162890517},null," ",{"$f":"T5-HLOOKUP(X5,Feuil1!$C$1:$BJ$10,2,FALSE)","v":{"$error":"#N/A"}},{"$f":"T5-HLOOKUP(X5,Feuil1!$C$1:$BJ$10,3,FALSE)","v":{"$error":"#N/A"}},{"$f":"T5-HLOOKUP(X5,Feuil1!$C$1:$BJ$10,4,FALSE)","v":{"$error":"#N/A"}},{"$f":"T5-HLOOKUP(X5,Feuil1!$C$1:$BJ$10,5,FALSE)","v":{"$error":"#N/A"}},{"$f":"T5-HLOOKUP(X5,Feuil1!$C$1:$BJ$10,6,FALSE)","v":{"$error":"#N/A"}},{"$f":"T5-HLOOKUP(X5,Feuil1!$C$1:$BJ$10,7,FALSE)","v":{"$error":"#N/A"}},{"$f":"T5-HLOOKUP(X5,Feuil1!$C$1:$BJ$10,8,FALSE)","v":{"$error":"#N/A"}},{"$f":"T5-HLOOKUP(X5,Feuil1!$C$1:$BJ$10,9,FALSE)","v":{"$error":"#N/A"}},{"$f":"T5-HLOOKUP(X5,Feuil1!$C$1:$BJ$10,10,FALSE)","v":{"$error":"#N/A"}},null,null,null,null,null,null,{"$f":"IF(AJ5>=0,$AJ$4,IF(AI5>=0,$AI$4,IF(AH5>=0,$AH$4,IF(AG5>=0,$AG$4,IF(AF5>=0,$AF$4,IF(AE5>=0,$AE$4,IF(AD5>=0,$AD$4,IF(AC5>=0,$AC$4,$AB$4))))))))","v":{"$error":"#N/A"}}]
["H","SEST","RAL",1,null,null,null,1997,75,null,null,-90,-90,-90,{"$f":"IF(H6=\"\",\"\",IF(MAXA(L6:N6)<=0,0,MAXA(L6:N6)))","v":0},100,null,null,{"$f":"IF(H6=\"\",\"\",IF(MAXA(P6:R6)<=0,0,MAXA(P6:R6)))","v":100},{"$f":"IF(I6=\"\",\"\",O6+S6)","v":100},{"$f":"IF(I6=\"\",\"\",IF(A6=\"H\",10^(0.794358141*LOG(I6/174.393)^2)*T6,IF(A6=\"F\",10^(0.89726074*LOG(I6/148.026)^2)*T6,\"\")))","v":127.84425484161912},{"$f":"IF(H6=\"\",\"\",AQ6)","v":"DEB "},{"$f":"IF(AJ6>=0,AJ6,IF(AI6>=0,AI6,IF(AH6>=0,AH6,IF(AG6>=0,AG6,IF(AF6>=0,AF6,IF(AE6>=0,AE6,IF(AD6>=0,AD6,IF(AC6>=0,AC6,AB6))))))))","v":-30},{"$f":"IF(I6=\"\",\"\",IF(A6=\"H\",IF(OR(H6=\"SEN\",H6<1997),VLOOKUP(I6,Feuil1!$A$11:$G$29,6),IF(AND(H6>1996,H6<2000),VLOOKUP(I6,Feuil1!$A$11:$G$29,5),IF(AND(H6>1999,H6<2002),VLOOKUP(I6,Feuil1!$A$11:$G$29,4),IF(AND(H6>2001,H6<2004),VLOOKUP(I6,Feuil1!$A$11:$G$29,3),VLOOKUP(I6,Feuil1!$A$11:$G$29,2))))),IF(OR(H6=\"SEN\",H6<1997),VLOOKUP(I6,Feuil1!$G$11:$L$25,6),IF(AND(H6>1996,H6<2000),VLOOKUP(I6,Feuil1!$G$11:$L$25,5),IF(AND(H6>1999,H6<2002),VLOOKUP(I6,Feuil1!$G$11:$L$25,4),IF(AND(H6>2001,H6<2004),VLOOKUP(I6,Feuil1!$G$11:$L$25,3),VLOOKUP(I6,Feuil1!$G$11:$L$25,2)))))))","v":"J77"},null,{"$f":"Y5","v":703.14340162890517}," ",{"$f":"T6-HLOOKUP(X6,Feuil1!$C$1:$BJ$10,2,FALSE)","v":-30},{"$f":"T6-HLOOKUP(X6,Feuil1!$C$1:$BJ$10,3,FALSE)","v":-50},{"$f":"T6-HLOOKUP(X6,Feuil1!$C$1:$BJ$10,4,FALSE)","v":-70},{"$f":"T6-HLOOKUP(X6,Feuil1!$C$1:$BJ$10,5,FALSE)","v":-90},{"$f":"T6-HLOOKUP(X6,Feuil1!$C$1:$BJ$10,6,FALSE)","v":-110},{"$f":"T6-HLOOKUP(X6,Feuil1!$C$1:$BJ$10,7,FALSE)","v":-140},{"$f":"T6-HLOOKUP(X6,Feuil1!$C$1:$BJ$10,8,FALSE)","v":-160},{"$f":"T6-HLOOKUP(X6,Feuil1!$C$1:$BJ$10,9,FALSE)","v":-185},{"$f":"T6-HLOOKUP(X6,Feuil1!$C$1:$BJ$10,10,FALSE)","v":-9900},null,null,null,null,null,null,{"$f":"IF(AJ6>=0,$AJ$4,IF(AI6>=0,$AI$4,IF(AH6>=0,$AH$4,IF(AG6>=0,$AG$4,IF(AF6>=0,$AF$4,IF(AE6>=0,$AE$4,IF(AD6>=0,$AD$4,IF(AC6>=0,$AC$4,$AB$4))))))))","v":"DEB "}]
["H","SEST","RAL",1,null,null,null,1998,75,null,null,100,null,null,100,110,null,null,110,{"$f":"IF(I7=\"\",\"\",O7+S7)","v":210},268.47293516740018,"FED +",0,{"$f":"IF(I7=\"\",\"\",IF(A7=\"H\",IF(OR(H7=\"SEN\",H7<1997),VLOOKUP(I7,Feuil1!$A$11:$G$29,6),IF(AND(H7>1996,H7<2000),VLOOKUP(I7,Feuil1!$A$11:$G$29,5),IF(AND(H7>1999,H7<2002),VLOOKUP(I7,Feuil1!$A$11:$G$29,4),IF(AND(H7>2001,H7<2004),VLOOKUP(I7,Feuil1!$A$11:$G$29,3),VLOOKUP(I7,Feuil1!$A$11:$G$29,2))))),IF(OR(H7=\"SEN\",H7<1997),VLOOKUP(I7,Feuil1!$G$11:$L$25,6),IF(AND(H7>1996,H7<2000),VLOOKUP(I7,Feuil1!$G$11:$L$25,5),IF(AND(H7>1999,H7<2002),VLOOKUP(I7,Feuil1!$G$11:$L$25,4),IF(AND(H7>2001,H7<2004),VLOOKUP(I7,Feuil1!$G$11:$L$25,3),VLOOKUP(I7,Feuil1!$G$11:$L$25,2)))))))","v":"J77"},null,{"$f":"Y9","v":939.65527308590049}," ",{"$f":"T7-HLOOKUP(X7,Feuil1!$C$1:$BJ$10,2,FALSE)","v":80},{"$f":"T7-HLOOKUP(X7,Feuil1!$C$1:$BJ$10,3,FALSE)","v":60},{"$f":"T7-HLOOKUP(X7,Feuil1!$C$1:$BJ$10,4,FALSE)","v":40},{"$f":"T7-HLOOKUP(X7,Feuil1!$C$1:$BJ$10,5,FALSE)","v":20},{"$f":"T7-HLOOKUP(X7,Feuil1!$C$1:$BJ$10,6,FALSE)","v":0},{"$f":"T7-HLOOKUP(X7,Feuil1!$C$1:$BJ$10,7,FALSE)","v":-30},{"$f":"T7-HLOOKUP(X7,Feuil1!$C$1:$BJ$10,8,FALSE)","v":-50},{"$f":"T7-HLOOKUP(X7,Feuil1!$C$1:$BJ$10,9,FALSE)","v":-75},{"$f":"T7-HLOOKUP(X7,Feuil1!$C$1:$BJ$10,10,FALSE)","v":-9790},null,null,null,null,null,null,"FED +"]
["H","SEST","RAL",1,null,null,null,1999,75,null,null,110,null,null,110,130,null,null,130,240,306.8262116198859,"NAT +",0,{"$f":"IF(I8=\"\",\"\",IF(A8=\"H\",IF(OR(H8=\"SEN\",H8<1997),VLOOKUP(I8,Feuil1!$A$11:$G$29,6),IF(AND(H8>1996,H8<2000),VLOOKUP(I8,Feuil1!$A$11:$G$29,5),IF(AND(H8>1999,H8<2002),VLOOKUP(I8,Feuil1!$A$11:$G$29,4),IF(AND(H8>2001,H8<2004),VLOOKUP(I8,Feuil1!$A$11:$G$29,3),VLOOKUP(I8,Feuil1!$A$11:$G$29,2))))),IF(OR(H8=\"SEN\",H8<1997),VLOOKUP(I8,Feuil1!$G$11:$L$25,6),IF(AND(H8>1996,H8<2000),VLOOKUP(I8,Feuil1!$G$11:$L$25,5),IF(AND(H8>1999,H8<2002),VLOOKUP(I8,Feuil1!$G$11:$L$25,4),IF(AND(H8>2001,H8<2004),VLOOKUP(I8,Feuil1!$G$11:$L$25,3),VLOOKUP(I8,Feuil1!$G$11:$L$25,2)))))))","v":"J77"},null,{"$f":"Y13","v":830.98765647052437}," ",{"$f":"T8-HLOOKUP(X8,Feuil1!$C$1:$BJ$10,2,FALSE)","v":110},{"$f":"T8-HLOOKUP(X8,Feuil1!$C$1:$BJ$10,3,FALSE)","v":90},{"$f":"T8-HLOOKUP(X8,Feuil1!$C$1:$BJ$10,4,FALSE)","v":70},{"$f":"T8-HLOOKUP(X8,Feuil1!$C$1:$BJ$10,5,FALSE)","v":50},{"$f":"T8-HLOOKUP(X8,Feuil1!$C$1:$BJ$10,6,FALSE)","v":30},{"$f":"T8-HLOOKUP(X8,Feuil1!$C$1:$BJ$10,7,FALSE)","v":0},{"$f":"T8-HLOOKUP(X8,Feuil1!$C$1:$BJ$10,8,FALSE)","v":-20},{"$f":"T8-HLOOKUP(X8,Feuil1!$C$1:$BJ$10,9,FALSE)","v":-45},{"$f":"T8-HLOOKUP(X8,Feuil1!$C$1:$BJ$10,10,FALSE)","v":-9760},null,null,null,null,null,null,"NAT +"]
[null,"Tirage au sort :",null,null,null,null,null,"Classement :",null,null,null,{"$f":"IF(Y9=\"\",\"\",RANK(Y9,$Z$6:$Z$11,0))","v":1},null,null,null,null,null,null,null,null,null,null,null,null,{"$f":"SUM(U10:U12)","v":939.65527308590049},{"$f":"Y17","v":686.08237229097233}]
["H","SEST","RAL",1,null,null,null,1997,75,null,null,120,null,null,120,145,null,null,145,{"$f":"IF(I10=\"\",\"\",O10+S10)","v":265},338.7872753302907,"INTB +",5,{"$f":"IF(I10=\"\",\"\",IF(A10=\"H\",IF(OR(H10=\"SEN\",H10<1997),VLOOKUP(I10,Feuil1!$A$11:$G$29,6),IF(AND(H10>1996,H10<2000),VLOOKUP(I10,Feuil1!$A$11:$G$29,5),IF(AND(H10>1999,H10<2002),VLOOKUP(I10,Feuil1!$A$11:$G$29,4),IF(AND(H10>2001,H10<2004),VLOOKUP(I10,Feuil1!$A$11:$G$29,3),VLOOKUP(I10,Feuil1!$A$11:$G$29,2))))),IF(OR(H10=\"SEN\",H10<1997),VLOOKUP(I10,Feuil1!$G$11:$L$25,6),IF(AND(H10>1996,H10<2000),VLOOKUP(I10,Feuil1!$G$11:$L$25,5),IF(AND(H10>1999,H10<2002),VLOOKUP(I10,Feuil1!$G$11:$L$25,4),IF(AND(H10>2001,H10<2004),VLOOKUP(I10,Feuil1!$G$11:$L$25,3),VLOOKUP(I10,Feuil1!$G$11:$L$25,2)))))))","v":"J77"},null,{"$f":"Y21","v":659.17718122073813}," ",{"$f":"T10-HLOOKUP(X10,Feuil1!$C$1:$BJ$10,2,FALSE)","v":135},{"$f":"T10-HLOOKUP(X10,Feuil1!$C$1:$BJ$10,3,FALSE)","v":115},{"$f":"T10-HLOOKUP(X10,Feuil1!$C$1:$BJ$10,4,FALSE)","v":95},{"$f":"T10-HLOOKUP(X10,Feuil1!$C$1:$BJ$10,5,FALSE)","v":75},{"$f":"T10-HLOOKUP(X10,Feuil1!$C$1:$BJ$10,6,FALSE)","v":55},{"$f":"T10-HLOOKUP(X10,Feuil1!$C$1:$BJ$10,7,FALSE)","v":25},{"$f":"T10-HLOOKUP(X10,Feuil1!$C$1:$BJ$10,8,FALSE)","v":5},{"$f":"T10-HLOOKUP(X10,Feuil1!$C$1:$BJ$10,9,FALSE)","v":-20},{"$f":"T10-HLOOKUP(X10,Feuil1!$C$1:$BJ$10,10,FALSE)","v":-9735},null,null,null,null,null,null,"INTB +"]
{"$rows_left_out":528}
{"sheet":"Feuil2","index":3,"n_rows":0,"n_cols":0,"rows_kept":0,"cut":false,"hidden":false,"merged":[]}