{"text_format":"1","workbook":"xlsx","n_sheets":5,"sheets":["Feuil1","HA-FA Filles","HA-FA Garçons","DC EQUIPE","HALTERO FIT BARRE"],"not_rendered":{"charts":0,"images":3,"macros":1,"external_links":2,"defined_names":5,"comments":0,"pivot_tables":0},"unopened":[],"bounds":{"document_bytes":16777216,"sheet_cells":100000,"rows_first":2000,"rows_last":500,"rows_between":2000,"halvings":0,"cell_chars":16384,"cell_head_chars":4096},"cells_cut":0,"cells_raw":0,"read":"whole","date_system":"1900"}

{"sheet":"Feuil1","index":0,"n_rows":29,"n_cols":64,"rows_kept":29,"cut":false,"hidden":true,"merged":[]}
[null,null,"FC1 40","FC1 44","FC1 48","FC1 53","FC1 58","FC1 63","FC1 69","FC1 +69","FC2 44","FC2 48","FC2 53","FC2 58","FC2 63","FC2 69","FC2 +69","FJ48","FJ53","FJ58","FJ63","FJ69","FJ75","FJ+75","FS48","FS53","FS58","FS63","FS69","FS75","FS+75","C1 45","C1 50","C1 56","C1 62","C1 69","C1 77","C1 85","C1 94","C1 +94","C2 50","C2 56","C2 62","C2 69","C2 77","C2 85","C2 94","C2 +94","J56","J62","J69","J77","J85","J94","J105","J+105","S56","S62","S69","S77","S85","S94","S105","S+105"]
[null,"DEBUTANT",20,25,25,35,40,45,50,60,30,35,45,50,55,60,70,45,55,60,65,70,80,90,55,65,70,75,80,95,100,35,40,50,75,85,90,100,110,120,45,65,85,95,110,120,125,135,80,90,110,130,145,150,155,165,95,120,130,150,165,170,175,185]
[null,"DEPARTEMENTAL",25,30,35,45,50,55,60,70,40,45,55,60,65,70,80,55,65,70,75,80,95,100,65,75,80,85,90,105,110,50,55,70,95,105,110,120,130,140,65,85,105,115,130,140,145,155,100,120,130,150,165,170,175,185,115,135,150,170,185,190,195,205]
[null,"REGIONAL",35,40,45,55,60,65,70,80,50,55,65,70,75,80,95,65,75,80,85,90,105,110,75,85,90,95,105,115,125,60,65,85,105,115,130,140,145,155,80,100,120,130,150,160,165,175,115,135,150,170,185,190,195,205,130,150,170,190,205,215,220,225]
[null,"INTERREGIONAL",45,50,55,65,70,75,80,95,60,65,75,80,85,90,105,75,85,90,95,105,115,125,85,95,100,110,120,130,140,75,80,100,120,130,150,160,165,175,95,115,135,150,170,180,185,195,130,150,170,190,205,215,220,225,145,170,190,210,225,235,245,250]
[null,"FEDERAL",50,60,65,75,80,85,90,105,70,75,85,90,95,105,115,85,95,100,110,120,130,140,95,105,115,125,135,145,150,90,95,115,135,150,170,180,185,195,110,130,150,170,185,200,210,220,145,170,190,210,225,235,245,250,170,190,220,240,250,260,270,280]
[null,"NATIONAL",60,70,75,85,90,95,105,115,80,85,95,100,110,120,130,95,105,115,125,135,145,150,110,120,130,140,150,160,170,105,110,130,150,170,185,200,210,220,120,145,170,190,200,220,225,235,170,190,220,240,250,260,270,280,190,210,240,265,280,290,300,310]
[null,"INTERNATIONAL B",70,80,85,95,100,110,120,130,90,95,105,115,125,135,145,110,120,130,140,150,160,170,125,140,150,160,170,180,190,115,120,145,170,190,200,220,225,235,135,170,190,210,220,240,250,260,190,210,240,260,280,290,300,310,210,230,260,285,300,310,325,330]
[null,"INTERNATIONAL A",80,90,95,105,115,125,135,145,100,110,120,130,140,150,160,125,135,150,160,170,180,190,140,160,170,180,190,195,210,130,135,170,190,210,220,240,250,260,150,190,210,230,250,260,280,280,210,230,250,285,300,310,325,330,225,255,275,305,325,330,345,355]
[null,"OLYMPIQUE",1000,1000,1000,1000,1000,1000,1000,1000,1000,1000,1000,1000,1000,1000,1000,1000,1000,1000,1000,1000,1000,1000,155,175,190,200,205,210,225,1000,1000,1000,1000,1000,1000,10000,1000,1000,1000,1000,1000,1000,1000,10000,1000,1000,1000,1000,1000,10000,1000,1000,1000,10000,240,270,290,320,345,355,365,375]
[null,"MINIME","CADET","CADET","JUNIOR","SENIOR",null,"MINIME","CADETTE","CADETTE","JUNIOR","SENIOR"]
[20.010000000000002,"NON","C1 45","C2 50","J56","S56",20.010000000000002,"NON","FC1 40","FC2 44","FJ48","FS48"]
[34.01,"NON","C1 45","C2 50","J56","S56",30.01,"NON","FC1 40","FC2 44","FJ48","FS48"]
[38.01,"NON","C1 45","C2 50","J56","S56",35.01,"NON","FC1 40","FC2 44","FJ48","FS48"]
[40.01,"NON","C1 45","C2 50","J56","S56",36.01,"NON","FC1 40","FC2 44","FJ48","FS48"]
[45.01,"NON","C1 50","C2 50","J56","S56",40.01,"NON","FC1 44","FC2 44","FJ48","FS48"]
[50.01,"NON","C1 56","C2 56","J56","S56",44.01,"NON","FC1 48","FC2 48","FJ48","FS48"]
[52.05,"NON","C1 56","C2 56","J56","S56",48.01,"NON","FC1 53","FC2 53","FJ53","FS53"]
[56.01,"NON","C1 62","C2 62","J62","S62",53.01,"NON","FC1 58","FC2 58","FJ58","FS58"]
[62.01,"NON","C1 69","C2 69","J69","S69",58.01,"NON","FC1 63","FC2 63","FJ63","FS63"]
[69.010000000000005,"NON","C1 77","C2 77","J77","S77",63.01,"NON","FC1 69","FC2 69","FJ69","FS69"]
[77.010000000000005,"NON","C1 85","C2 85","J85","S85",69.010000000000005,"NON","FC1 +69","FC2 +69","FJ75","FS75"]
[85.01,"NON","C1 94","C2 94","J94","S94",75.010000000000005,"NON","FC1 +69","FC2 +69","FJ+75","FS+75"]
[94.01,"NON","C1 +94","C2 +94","J105","S105",110,"NON","FC1 +69","FC2 +69","FJ+75","FS+75"]
[105.01,"NON","C1 +94","C2 +94","J+105","S+105",140,"NON","FC1 +69","FC2 +69","FJ+75","FS+75"]
[110,"NON","C1 +94","C2 +94","J+105","S+105"]
[120,"NON","C1 +94","C2 +94","J+105","S+105"]
[130,"NON","C1 +94","C2 +94","J+105","S+105"]
[140,"NON","C1 +94","C2 +94","J+105","S+105",null,null,null,null,null,null,null,null,null,null,null,null,null,null,null,null,null,null,null,null,null,null,null,null,null,null,null," "]

{"sheet":"HA-FA Filles","index":1,"n_rows":516,"n_cols":53,"rows_kept":516,"cut":false,"hidden":false,"merged":[[1,17,1,18],[0,17,0,19],[3,24,3,25],[0,3,0,4],[1,3,1,4],[1,13,1,16],[4,0,6,0],[7,0,10,0],[11,0,13,0],[1,5,1,9],[1,10,1,12]]}
[null,null,null,"EPREUVE :",null,"HALTEROPHILIE",null,null,null,"HALTERO/FORCE",null,null,null,null,null,null,"DATE :","2015-05-12"]
[null,null,null,"LIEU :",null,"CLERMONT L'HERAULT",null,null,null,null,"CFU 2015",null,null,null,null,null,null,"ZONE :",null,"SUD",null,null,null,null," "]
[]
["CAT.POIDS","CL.HA","CL.FA","LICENCE","NOMS","Prénoms","AS","Académie","AN","POIDS",1,2,3,"ARR",1,2,3,"EP-J","Total HA",1,2,3,"DC","Total FA","SERIE",null,"Catég","IWF",null," ","DEB ","DEP +","REG +","IRG +","FED +","NAT +","INTB +","INTA +","OLY +"]
["53 kg",2,1,"B10U090677","SEIGNEUR","MANON","Université de Picardie","AMIENS",null,52.8,48,-50,-50,{"$f":"IF(J5=\"\",\"\",IF(MAXA(K5:M5)<=0,0,MAXA(K5:M5)))","v":48},55,60,-63,{"$f":"IF(J5=\"\",\"\",IF(MAXA(O5:Q5)<=0,0,MAXA(O5:Q5)))","v":60},{"$f":"IF(J5=\"\",\"\",IF(OR(N5=0,R5=0),0,N5+R5))","v":108},30,32.5,35,{"$f":"IF(J5=\"\",\"\",IF(MAXA(T5:V5)<=0,0,MAXA(T5:V5)))","v":35},{"$f":"IF(J5=\"\",\"\",IF(OR(R5=0,W5=0),0,R5+W5))","v":95},{"$f":"IF(J5=\"\",\"\",AT5)","v":{"$error":"#REF!"}},{"$f":"IF(AM5>=0,AM5,IF(AL5>=0,AL5,IF(AK5>=0,AK5,IF(AJ5>=0,AJ5,IF(AI5>=0,AI5,IF(AH5>=0,AH5,IF(AG5>=0,AG5,IF(AF5>=0,AF5,AE5))))))))","v":{"$error":"#REF!"}},{"$f":"IF(J5=\"\",\"\",IF(#REF!=\"H\",IF(OR(I5=\"SEN\",I5<1995),VLOOKUP(J5,[1]Feuil1!$A$11:$G$29,6),IF(AND(I5>1994,I5<1998),VLOOKUP(J5,[1]Feuil1!$A$11:$G$29,5),IF(AND(I5>1997,I5<2000),VLOOKUP(J5,[1]Feuil1!$A$11:$G$29,4),IF(AND(I5>1999,I5<2002),VLOOKUP(J5,[1]Feuil1!$A$11:$G$29,3),VLOOKUP(J5,[1]Feuil1!$A$11:$G$29,2))))),IF(OR(I5=\"SEN\",I5<1995),VLOOKUP(J5,[1]Feuil1!$G$11:$L$25,6),IF(AND(I5>1994,I5<1998),VLOOKUP(J5,[1]Feuil1!$G$11:$L$25,5),IF(AND(I5>1997,I5<2000),VLOOKUP(J5,[1]Feuil1!$G$11:$L$25,4),IF(AND(I5>1999,I5<2002),VLOOKUP(J5,[1]Feuil1!$G$11:$L$25,3),VLOOKUP(J5,[1]Feuil1!$G$11:$L$25,2)))))))","v":{"$error":"#REF!"}},{"$f":"IF(J5=\"\",\"\",IF(#REF!=\"H\",10^(0.794358141*LOG(J5/174.393)^2)*S5,IF(#REF!=\"F\",10^(0.89726074*LOG(J5/148.026)^2)*S5,\"\")))","v":{"$error":"#REF!"}},null," ",{"$f":"S5-HLOOKUP(AA5,[1]Feuil1!$C$1:$BL$10,2,FALSE)","v":{"$error":"#REF!"}},{"$f":"S5-HLOOKUP(AA5,[1]Feuil1!$C$1:$BL$10,3,FALSE)","v":{"$error":"#REF!"}},{"$f":"S5-HLOOKUP(AA5,[1]Feuil1!$C$1:$BL$10,4,FALSE)","v":{"$error":"#REF!"}},{"$f":"S5-HLOOKUP(AA5,[1]Feuil1!$C$1:$BL$10,5,FALSE)","v":{"$error":"#REF!"}},{"$f":"S5-HLOOKUP(AA5,[1]Feuil1!$C$1:$BL$10,6,FALSE)","v":{"$error":"#REF!"}},{"$f":"S5-HLOOKUP(AA5,[1]Feuil1!$C$1:$BL$10,7,FALSE)","v":{"$error":"#REF!"}},{"$f":"S5-HLOOKUP(AA5,[1]Feuil1!$C$1:$BL$10,8,FALSE)","v":{"$error":"#REF!"}},{"$f":"S5-HLOOKUP(AA5,[1]Feuil1!$C$1:$BL$10,9,FALSE)","v":{"$error":"#REF!"}},{"$f":"S5-HLOOKUP(AA5,[1]Feuil1!$C$1:$BL$10,10,FALSE)","v":{"$error":"#REF!"}},null,null,null,null,null,null,{"$f":"IF(AM5>=0,$AM$4,IF(AL5>=0,$AL$4,IF(AK5>=0,$AK$4,IF(AJ5>=0,$AJ$4,IF(AI5>=0,$AI$4,IF(AH5>=0,$AH$4,IF(AG5>=0,$AG$4,IF(AF5>=0,$AF$4,$AE$4))))))))","v":{"$error":"#REF!"}}]
[null,1,null,"B101004633","CARON","AMELIE","Université de Picardie","AMIENS",null,53,50,55,58,{"$f":"IF(J6=\"\",\"\",IF(MAXA(K6:M6)<=0,0,MAXA(K6:M6)))","v":58},60,65,-68,65,{"$f":"IF(J6=\"\",\"\",IF(OR(N6=0,R6=0),0,N6+R6))","v":123},null,null,null,{"$f":"IF(I6=\"\",\"\",IF(MAXA(T6:V6)<=0,0,MAXA(T6:V6)))","v":""},{"$f":"IF(I6=\"\",\"\",IF(OR(R6=0,W6=0),0,R6+W6))","v":""},{"$f":"IF(I6=\"\",\"\",AT6)","v":""},{"$error":"#REF!"},{"$f":"IF(J6=\"\",\"\",IF(#REF!=\"H\",IF(OR(I6=\"SEN\",I6<1995),VLOOKUP(J6,[1]Feuil1!$A$11:$G$29,6),IF(AND(I6>1994,I6<1998),VLOOKUP(J6,[1]Feuil1!$A$11:$G$29,5),IF(AND(I6>1997,I6<2000),VLOOKUP(J6,[1]Feuil1!$A$11:$G$29,4),IF(AND(I6>1999,I6<2002),VLOOKUP(J6,[1]Feuil1!$A$11:$G$29,3),VLOOKUP(J6,[1]Feuil1!$A$11:$G$29,2))))),IF(OR(I6=\"SEN\",I6<1995),VLOOKUP(J6,[1]Feuil1!$G$11:$L$25,6),IF(AND(I6>1994,I6<1998),VLOOKUP(J6,[1]Feuil1!$G$11:$L$25,5),IF(AND(I6>1997,I6<2000),VLOOKUP(J6,[1]Feuil1!$G$11:$L$25,4),IF(AND(I6>1999,I6<2002),VLOOKUP(J6,[1]Feuil1!$G$11:$L$25,3),VLOOKUP(J6,[1]Feuil1!$G$11:$L$25,2)))))))","v":{"$error":"#REF!"}},{"$f":"IF(J6=\"\",\"\",IF(#REF!=\"H\",10^(0.794358141*LOG(J6/174.393)^2)*S6,IF(#REF!=\"F\",10^(0.89726074*LOG(J6/148.026)^2)*S6,\"\")))","v":{"$error":"#REF!"}},null," ",{"$f":"S6-HLOOKUP(AA6,[1]Feuil1!$C$1:$BL$10,2,FALSE)","v":{"$error":"#REF!"}},{"$f":"S6-HLOOKUP(AA6,[1]Feuil1!$C$1:$BL$10,3,FALSE)","v":{"$error":"#REF!"}},{"$f":"S6-HLOOKUP(AA6,[1]Feuil1!$C$1:$BL$10,4,FALSE)","v":{"$error":"#REF!"}},{"$f":"S6-HLOOKUP(AA6,[1]Feuil1!$C$1:$BL$10,5,FALSE)","v":{"$error":"#REF!"}},{"$f":"S6-HLOOKUP(AA6,[1]Feuil1!$C$1:$BL$10,6,FALSE)","v":{"$error":"#REF!"}},{"$f":"S6-HLOOKUP(AA6,[1]Feuil1!$C$1:$BL$10,7,FALSE)","v":{"$error":"#REF!"}},{"$f":"S6-HLOOKUP(AA6,[1]Feuil1!$C$1:$BL$10,8,FALSE)","v":{"$error":"#REF!"}},{"$f":"S6-HLOOKUP(AA6,[1]Feuil1!$C$1:$BL$10,9,FALSE)","v":{"$error":"#REF!"}},{"$f":"S6-HLOOKUP(AA6,[1]Feuil1!$C$1:$BL$10,10,FALSE)","v":{"$error":"#REF!"}},null,null,null,null,null,null,{"$error":"#REF!"}]
[null,3,null,"NN11093541","HERRING","LAUREEN","UNIVERSITE MONTPELLIER STAPS","MONTPELLIER",null,52.8,36,39,-41,{"$f":"IF(J7=\"\",\"\",IF(MAXA(K7:M7)<=0,0,MAXA(K7:M7)))","v":39},45,47,49,49,{"$f":"IF(J7=\"\",\"\",IF(OR(N7=0,R7=0),0,N7+R7))","v":88},null,null,null,{"$f":"IF(I7=\"\",\"\",IF(MAXA(T7:V7)<=0,0,MAXA(T7:V7)))","v":""},{"$f":"IF(I7=\"\",\"\",IF(OR(R7=0,W7=0),0,R7+W7))","v":""},"",{"$error":"#REF!"},{"$f":"IF(J7=\"\",\"\",IF(#REF!=\"H\",IF(OR(I7=\"SEN\",I7<1995),VLOOKUP(J7,[1]Feuil1!$A$11:$G$29,6),IF(AND(I7>1994,I7<1998),VLOOKUP(J7,[1]Feuil1!$A$11:$G$29,5),IF(AND(I7>1997,I7<2000),VLOOKUP(J7,[1]Feuil1!$A$11:$G$29,4),IF(AND(I7>1999,I7<2002),VLOOKUP(J7,[1]Feuil1!$A$11:$G$29,3),VLOOKUP(J7,[1]Feuil1!$A$11:$G$29,2))))),IF(OR(I7=\"SEN\",I7<1995),VLOOKUP(J7,[1]Feuil1!$G$11:$L$25,6),IF(AND(I7>1994,I7<1998),VLOOKUP(J7,[1]Feuil1!$G$11:$L$25,5),IF(AND(I7>1997,I7<2000),VLOOKUP(J7,[1]Feuil1!$G$11:$L$25,4),IF(AND(I7>1999,I7<2002),VLOOKUP(J7,[1]Feuil1!$G$11:$L$25,3),VLOOKUP(J7,[1]Feuil1!$G$11:$L$25,2)))))))","v":{"$error":"#REF!"}},{"$f":"IF(J7=\"\",\"\",IF(#REF!=\"H\",10^(0.794358141*LOG(J7/174.393)^2)*S7,IF(#REF!=\"F\",10^(0.89726074*LOG(J7/148.026)^2)*S7,\"\")))","v":{"$error":"#REF!"}},null," ",{"$f":"S7-HLOOKUP(AA7,[1]Feuil1!$C$1:$BL$10,2,FALSE)","v":{"$error":"#REF!"}},{"$f":"S7-HLOOKUP(AA7,[1]Feuil1!$C$1:$BL$10,3,FALSE)","v":{"$error":"#REF!"}},{"$f":"S7-HLOOKUP(AA7,[1]Feuil1!$C$1:$BL$10,4,FALSE)","v":{"$error":"#REF!"}},{"$f":"S7-HLOOKUP(AA7,[1]Feuil1!$C$1:$BL$10,5,FALSE)","v":{"$error":"#REF!"}},{"$f":"S7-HLOOKUP(AA7,[1]Feuil1!$C$1:$BL$10,6,FALSE)","v":{"$error":"#REF!"}},{"$f":"S7-HLOOKUP(AA7,[1]Feuil1!$C$1:$BL$10,7,FALSE)","v":{"$error":"#REF!"}},{"$f":"S7-HLOOKUP(AA7,[1]Feuil1!$C$1:$BL$10,8,FALSE)","v":{"$error":"#REF!"}},{"$f":"S7-HLOOKUP(AA7,[1]Feuil1!$C$1:$BL$10,9,FALSE)","v":{"$error":"#REF!"}},{"$f":"S7-HLOOKUP(AA7,[1]Feuil1!$C$1:$BL$10,10,FALSE)","v":{"$error":"#REF!"}},null,null,null,null,null,null,{"$error":"#REF!"}]
["58 kg",1,3,"B101078461","RIMBERT","VANESSA","Université de Picardie","AMIENS",null,55.9,42,-45,45,{"$f":"IF(J8=\"\",\"\",IF(MAXA(K8:M8)<=0,0,MAXA(K8:M8)))","v":45},52,55,-58,55,{"$f":"IF(J8=\"\",\"\",IF(OR(N8=0,R8=0),0,N8+R8))","v":100},45,-47.5,-47.5,{"$f":"IF(J8=\"\",\"\",IF(MAXA(T8:V8)<=0,0,MAXA(T8:V8)))","v":45},{"$f":"IF(J8=\"\",\"\",IF(OR(R8=0,W8=0),0,R8+W8))","v":100},"",{"$error":"#REF!"},{"$f":"IF(J8=\"\",\"\",IF(#REF!=\"H\",IF(OR(I8=\"SEN\",I8<1995),VLOOKUP(J8,[1]Feuil1!$A$11:$G$29,6),IF(AND(I8>1994,I8<1998),VLOOKUP(J8,[1]Feuil1!$A$11:$G$29,5),IF(AND(I8>1997,I8<2000),VLOOKUP(J8,[1]Feuil1!$A$11:$G$29,4),IF(AND(I8>1999,I8<2002),VLOOKUP(J8,[1]Feuil1!$A$11:$G$29,3),VLOOKUP(J8,[1]Feuil1!$A$11:$G$29,2))))),IF(OR(I8=\"SEN\",I8<1995),VLOOKUP(J8,[1]Feuil1!$G$11:$L$25,6),IF(AND(I8>1994,I8<1998),VLOOKUP(J8,[1]Feuil1!$G$11:$L$25,5),IF(AND(I8>1997,I8<2000),VLOOKUP(J8,[1]Feuil1!$G$11:$L$25,4),IF(AND(I8>1999,I8<2002),VLOOKUP(J8,[1]Feuil1!$G$11:$L$25,3),VLOOKUP(J8,[1]Feuil1!$G$11:$L$25,2)))))))","v":{"$error":"#REF!"}},{"$f":"IF(J8=\"\",\"\",IF(#REF!=\"H\",10^(0.794358141*LOG(J8/174.393)^2)*S8,IF(#REF!=\"F\",10^(0.89726074*LOG(J8/148.026)^2)*S8,\"\")))","v":{"$error":"#REF!"}},null," ",{"$f":"S8-HLOOKUP(AA8,[1]Feuil1!$C$1:$BL$10,2,FALSE)","v":{"$error":"#REF!"}},{"$f":"S8-HLOOKUP(AA8,[1]Feuil1!$C$1:$BL$10,3,FALSE)","v":{"$error":"#REF!"}},{"$f":"S8-HLOOKUP(AA8,[1]Feuil1!$C$1:$BL$10,4,FALSE)","v":{"$error":"#REF!"}},{"$f":"S8-HLOOKUP(AA8,[1]Feuil1!$C$1:$BL$10,5,FALSE)","v":{"$error":"#REF!"}},{"$f":"S8-HLOOKUP(AA8,[1]Feuil1!$C$1:$BL$10,6,FALSE)","v":{"$error":"#REF!"}},{"$f":"S8-HLOOKUP(AA8,[1]Feuil1!$C$1:$BL$10,7,FALSE)","v":{"$error":"#REF!"}},{"$f":"S8-HLOOKUP(AA8,[1]Feuil1!$C$1:$BL$10,8,FALSE)","v":{"$error":"#REF!"}},{"$f":"S8-HLOOKUP(AA8,[1]Feuil1!$C$1:$BL$10,9,FALSE)","v":{"$error":"#REF!"}},{"$f":"S8-HLOOKUP(AA8,[1]Feuil1!$C$1:$BL$10,10,FALSE)","v":{"$error":"#REF!"}},null,null,null,null,null,null,{"$error":"#REF!"}]
[null,2,4,"NN11092927","GUIBAL","EMMANUELLE","UNIVERSITE MONTPELLIER STAPS","MONTPELLIER",null,56.7,35,37,39,{"$f":"IF(J9=\"\",\"\",IF(MAXA(K9:M9)<=0,0,MAXA(K9:M9)))","v":39},47,50,52,52,{"$f":"IF(J9=\"\",\"\",IF(OR(N9=0,R9=0),0,N9+R9))","v":91},45,-47.5,-47.5,45,97,"",{"$error":"#REF!"},{"$f":"IF(J9=\"\",\"\",IF(#REF!=\"H\",IF(OR(I9=\"SEN\",I9<1995),VLOOKUP(J9,[1]Feuil1!$A$11:$G$29,6),IF(AND(I9>1994,I9<1998),VLOOKUP(J9,[1]Feuil1!$A$11:$G$29,5),IF(AND(I9>1997,I9<2000),VLOOKUP(J9,[1]Feuil1!$A$11:$G$29,4),IF(AND(I9>1999,I9<2002),VLOOKUP(J9,[1]Feuil1!$A$11:$G$29,3),VLOOKUP(J9,[1]Feuil1!$A$11:$G$29,2))))),IF(OR(I9=\"SEN\",I9<1995),VLOOKUP(J9,[1]Feuil1!$G$11:$L$25,6),IF(AND(I9>1994,I9<1998),VLOOKUP(J9,[1]Feuil1!$G$11:$L$25,5),IF(AND(I9>1997,I9<2000),VLOOKUP(J9,[1]Feuil1!$G$11:$L$25,4),IF(AND(I9>1999,I9<2002),VLOOKUP(J9,[1]Feuil1!$G$11:$L$25,3),VLOOKUP(J9,[1]Feuil1!$G$11:$L$25,2)))))))","v":{"$error":"#REF!"}},{"$f":"IF(J9=\"\",\"\",IF(#REF!=\"H\",10^(0.794358141*LOG(J9/174.393)^2)*S9,IF(#REF!=\"F\",10^(0.89726074*LOG(J9/148.026)^2)*S9,\"\")))","v":{"$error":"#REF!"}},null," ",{"$f":"S9-HLOOKUP(AA9,[1]Feuil1!$C$1:$BL$10,2,FALSE)","v":{"$error":"#REF!"}},{"$f":"S9-HLOOKUP(AA9,[1]Feuil1!$C$1:$BL$10,3,FALSE)","v":{"$error":"#REF!"}},{"$f":"S9-HLOOKUP(AA9,[1]Feuil1!$C$1:$BL$10,4,FALSE)","v":{"$error":"#REF!"}},{"$f":"S9-HLOOKUP(AA9,[1]Feuil1!$C$1:$BL$10,5,FALSE)","v":{"$error":"#REF!"}},{"$f":"S9-HLOOKUP(AA9,[1]Feuil1!$C$1:$BL$10,6,FALSE)","v":{"$error":"#REF!"}},{"$f":"S9-HLOOKUP(AA9,[1]Feuil1!$C$1:$BL$10,7,FALSE)","v":{"$error":"#REF!"}},{"$f":"S9-HLOOKUP(AA9,[1]Feuil1!$C$1:$BL$10,8,FALSE)","v":{"$error":"#REF!"}},{"$f":"S9-HLOOKUP(AA9,[1]Feuil1!$C$1:$BL$10,9,FALSE)","v":{"$error":"#REF!"}},{"$f":"S9-HLOOKUP(AA9,[1]Feuil1!$C$1:$BL$10,10,FALSE)","v":{"$error":"#REF!"}},null,null,null,null,null,null,{"$error":"#REF!"}]
[null,null,1,"F121098241","MOUILLIERE","MANON","PRE CLERMONT STAPS","CLERMOND FD",null,57.9,null,null,null,null,47,49,-52,49,null,-60,60,62.5,62.5,111.5,"",{"$error":"#REF!"},{"$f":"IF(J10=\"\",\"\",IF(#REF!=\"H\",IF(OR(I10=\"SEN\",I10<1995),VLOOKUP(J10,[1]Feuil1!$A$11:$G$29,6),IF(AND(I10>1994,I10<1998),VLOOKUP(J10,[1]Feuil1!$A$11:$G$29,5),IF(AND(I10>1997,I10<2000),VLOOKUP(J10,[1]Feuil1!$A$11:$G$29,4),IF(AND(I10>1999,I10<2002),VLOOKUP(J10,[1]Feuil1!$A$11:$G$29,3),VLOOKUP(J10,[1]Feuil1!$A$11:$G$29,2))))),IF(OR(I10=\"SEN\",I10<1995),VLOOKUP(J10,[1]Feuil1!$G$11:$L$25,6),IF(AND(I10>1994,I10<1998),VLOOKUP(J10,[1]Feuil1!$G$11:$L$25,5),IF(AND(I10>1997,I10<2000),VLOOKUP(J10,[1]Feuil1!$G$11:$L$25,4),IF(AND(I10>1999,I10<2002),VLOOKUP(J10,[1]Feuil1!$G$11:$L$25,3),VLOOKUP(J10,[1]Feuil1!$G$11:$L$25,2)))))))","v":{"$error":"#REF!"}},{"$f":"IF(J10=\"\",\"\",IF(#REF!=\"H\",10^(0.794358141*LOG(J10/174.393)^2)*S10,IF(#REF!=\"F\",10^(0.89726074*LOG(J10/148.026)^2)*S10,\"\")))","v":{"$error":"#REF!"}},null," ",{"$f":"S10-HLOOKUP(AA10,[1]Feuil1!$C$1:$BL$10,2,FALSE)","v":{"$error":"#REF!"}},{"$f":"S10-HLOOKUP(AA10,[1]Feuil1!$C$1:$BL$10,3,FALSE)","v":{"$error":"#REF!"}},{"$f":"S10-HLOOKUP(AA10,[1]Feuil1!$C$1:$BL$10,4,FALSE)","v":{"$error":"#REF!"}},{"$f":"S10-HLOOKUP(AA10,[1]Feuil1!$C$1:$BL$10,5,FALSE)","v":{"$error":"#REF!"}},{"$f":"S10-HLOOKUP(AA10,[1]Feuil1!$C$1:$BL$10,6,FALSE)","v":{"$error":"#REF!"}},{"$f":"S10-HLOOKUP(AA10,[1]Feuil1!$C$1:$BL$10,7,FALSE)","v":{"$error":"#REF!"}},{"$f":"S10-HLOOKUP(AA10,[1]Feuil1!$C$1:$BL$10,8,FALSE)","v":{"$error":"#REF!"}},{"$f":"S10-HLOOKUP(AA10,[1]Feuil1!$C$1:$BL$10,9,FALSE)","v":{"$error":"#REF!"}},{"$f":"S10-HLOOKUP(AA10,[1]Feuil1!$C$1:$BL$10,10,FALSE)","v":{"$error":"#REF!"}},null,null,null,null,null,null,{"$error":"#REF!"}]
[null,null,2,"NN11092943","MORO","MARLENE","UNIVERSITE MONTPELLIER STAPS","MONTPELLIER",null,55.3,null,null,null,null,45,-50,50,50,null,50,55,-57.5,55,105,"",{"$error":"#REF!"},{"$f":"IF(J11=\"\",\"\",IF(#REF!=\"H\",IF(OR(I11=\"SEN\",I11<1995),VLOOKUP(J11,[1]Feuil1!$A$11:$G$29,6),IF(AND(I11>1994,I11<1998),VLOOKUP(J11,[1]Feuil1!$A$11:$G$29,5),IF(AND(I11>1997,I11<2000),VLOOKUP(J11,[1]Feuil1!$A$11:$G$29,4),IF(AND(I11>1999,I11<2002),VLOOKUP(J11,[1]Feuil1!$A$11:$G$29,3),VLOOKUP(J11,[1]Feuil1!$A$11:$G$29,2))))),IF(OR(I11=\"SEN\",I11<1995),VLOOKUP(J11,[1]Feuil1!$G$11:$L$25,6),IF(AND(I11>1994,I11<1998),VLOOKUP(J11,[1]Feuil1!$G$11:$L$25,5),IF(AND(I11>1997,I11<2000),VLOOKUP(J11,[1]Feuil1!$G$11:$L$25,4),IF(AND(I11>1999,I11<2002),VLOOKUP(J11,[1]Feuil1!$G$11:$L$25,3),VLOOKUP(J11,[1]Feuil1!$G$11:$L$25,2)))))))","v":{"$error":"#REF!"}},{"$f":"IF(J11=\"\",\"\",IF(#REF!=\"H\",10^(0.794358141*LOG(J11/174.393)^2)*S11,IF(#REF!=\"F\",10^(0.89726074*LOG(J11/148.026)^2)*S11,\"\")))","v":{"$error":"#REF!"}},null," ",{"$f":"S11-HLOOKUP(AA11,[1]Feuil1!$C$1:$BL$10,2,FALSE)","v":{"$error":"#REF!"}},{"$f":"S11-HLOOKUP(AA11,[1]Feuil1!$C$1:$BL$10,3,FALSE)","v":{"$error":"#REF!"}},{"$f":"S11-HLOOKUP(AA11,[1]Feuil1!$C$1:$BL$10,4,FALSE)","v":{"$error":"#REF!"}},{"$f":"S11-HLOOKUP(AA11,[1]Feuil1!$C$1:$BL$10,5,FALSE)","v":{"$error":"#REF!"}},{"$f":"S11-HLOOKUP(AA11,[1]Feuil1!$C$1:$BL$10,6,FALSE)","v":{"$error":"#REF!"}},{"$f":"S11-HLOOKUP(AA11,[1]Feuil1!$C$1:$BL$10,7,FALSE)","v":{"$error":"#REF!"}},{"$f":"S11-HLOOKUP(AA11,[1]Feuil1!$C$1:$BL$10,8,FALSE)","v":{"$error":"#REF!"}},{"$f":"S11-HLOOKUP(AA11,[1]Feuil1!$C$1:$BL$10,9,FALSE)","v":{"$error":"#REF!"}},{"$f":"S11-HLOOKUP(AA11,[1]Feuil1!$C$1:$BL$10,10,FALSE)","v":{"$error":"#REF!"}},null,null,null,null,null,null,{"$error":"#REF!"}]
["63 kg",1,null,"S600032478","FUGIER","NOEMIE","UPMC","PARIS",null,62.9,35,-40,40,{"$f":"IF(J12=\"\",\"\",IF(MAXA(K12:M12)<=0,0,MAXA(K12:M12)))","v":40},58,60,-62,60,{"$f":"IF(J12=\"\",\"\",IF(OR(N12=0,R12=0),0,N12+R12))","v":100},-42.5,-42.5,-42.5,0,0,"",{"$error":"#REF!"},{"$f":"IF(J12=\"\",\"\",IF(#REF!=\"H\",IF(OR(I12=\"SEN\",I12<1995),VLOOKUP(J12,[1]Feuil1!$A$11:$G$29,6),IF(AND(I12>1994,I12<1998),VLOOKUP(J12,[1]Feuil1!$A$11:$G$29,5),IF(AND(I12>1997,I12<2000),VLOOKUP(J12,[1]Feuil1!$A$11:$G$29,4),IF(AND(I12>1999,I12<2002),VLOOKUP(J12,[1]Feuil1!$A$11:$G$29,3),VLOOKUP(J12,[1]Feuil1!$A$11:$G$29,2))))),IF(OR(I12=\"SEN\",I12<1995),VLOOKUP(J12,[1]Feuil1!$G$11:$L$25,6),IF(AND(I12>1994,I12<1998),VLOOKUP(J12,[1]Feuil1!$G$11:$L$25,5),IF(AND(I12>1997,I12<2000),VLOOKUP(J12,[1]Feuil1!$G$11:$L$25,4),IF(AND(I12>1999,I12<2002),VLOOKUP(J12,[1]Feuil1!$G$11:$L$25,3),VLOOKUP(J12,[1]Feuil1!$G$11:$L$25,2)))))))","v":{"$error":"#REF!"}},{"$f":"IF(J12=\"\",\"\",IF(#REF!=\"H\",10^(0.794358141*LOG(J12/174.393)^2)*S12,IF(#REF!=\"F\",10^(0.89726074*LOG(J12/148.026)^2)*S12,\"\")))","v":{"$error":"#REF!"}},null," ",{"$f":"S12-HLOOKUP(AA12,[1]Feuil1!$C$1:$BL$10,2,FALSE)","v":{"$error":"#REF!"}},{"$f":"S12-HLOOKUP(AA12,[1]Feuil1!$C$1:$BL$10,3,FALSE)","v":{"$error":"#REF!"}},{"$f":"S12-HLOOKUP(AA12,[1]Feuil1!$C$1:$BL$10,4,FALSE)","v":{"$error":"#REF!"}},{"$f":"S12-HLOOKUP(AA12,[1]Feuil1!$C$1:$BL$10,5,FALSE)","v":{"$error":"#REF!"}},{"$f":"S12-HLOOKUP(AA12,[1]Feuil1!$C$1:$BL$10,6,FALSE)","v":{"$error":"#REF!"}},{"$f":"S12-HLOOKUP(AA12,[1]Feuil1!$C$1:$BL$10,7,FALSE)","v":{"$error":"#REF!"}},{"$f":"S12-HLOOKUP(AA12,[1]Feuil1!$C$1:$BL$10,8,FALSE)","v":{"$error":"#REF!"}},{"$f":"S12-HLOOKUP(AA12,[1]Feuil1!$C$1:$BL$10,9,FALSE)","v":{"$error":"#REF!"}},{"$f":"S12-HLOOKUP(AA12,[1]Feuil1!$C$1:$BL$10,10,FALSE)","v":{"$error":"#REF!"}},null,null,null,null,null,null,{"$error":"#REF!"}]
[null,null,2,"NN11092926","GRAS","LISA","UNIVERSITE MONTPELLIER STAPS","MONTPELLIER",null,62.8,null,null,null,{"$f":"IF(I13=\"\",\"\",IF(MAXA(K13:M13)<=0,0,MAXA(K13:M13)))","v":""},45,-50,-50,45,{"$f":"IF(I13=\"\",\"\",IF(OR(N13=0,R13=0),0,N13+R13))","v":""},50,-52.5,-52.5,50,95,"",{"$error":"#VALUE!"},{"$f":"IF(J13=\"\",\"\",IF(#REF!=\"H\",IF(OR(I13=\"SEN\",I13<1995),VLOOKUP(J13,[1]Feuil1!$A$11:$G$29,6),IF(AND(I13>1994,I13<1998),VLOOKUP(J13,[1]Feuil1!$A$11:$G$29,5),IF(AND(I13>1997,I13<2000),VLOOKUP(J13,[1]Feuil1!$A$11:$G$29,4),IF(AND(I13>1999,I13<2002),VLOOKUP(J13,[1]Feuil1!$A$11:$G$29,3),VLOOKUP(J13,[1]Feuil1!$A$11:$G$29,2))))),IF(OR(I13=\"SEN\",I13<1995),VLOOKUP(J13,[1]Feuil1!$G$11:$L$25,6),IF(AND(I13>1994,I13<1998),VLOOKUP(J13,[1]Feuil1!$G$11:$L$25,5),IF(AND(I13>1997,I13<2000),VLOOKUP(J13,[1]Feuil1!$G$11:$L$25,4),IF(AND(I13>1999,I13<2002),VLOOKUP(J13,[1]Feuil1!$G$11:$L$25,3),VLOOKUP(J13,[1]Feuil1!$G$11:$L$25,2)))))))","v":{"$error":"#REF!"}},{"$f":"IF(J13=\"\",\"\",IF(#REF!=\"H\",10^(0.794358141*LOG(J13/174.393)^2)*S13,IF(#REF!=\"F\",10^(0.89726074*LOG(J13/148.026)^2)*S13,\"\")))","v":{"$error":"#REF!"}},null," ",{"$f":"S13-HLOOKUP(AA13,[1]Feuil1!$C$1:$BL$10,2,FALSE)","v":{"$error":"#VALUE!"}},{"$f":"S13-HLOOKUP(AA13,[1]Feuil1!$C$1:$BL$10,3,FALSE)","v":{"$error":"#VALUE!"}},{"$f":"S13-HLOOKUP(AA13,[1]Feuil1!$C$1:$BL$10,4,FALSE)","v":{"$error":"#VALUE!"}},{"$f":"S13-HLOOKUP(AA13,[1]Feuil1!$C$1:$BL$10,5,FALSE)","v":{"$error":"#VALUE!"}},{"$f":"S13-HLOOKUP(AA13,[1]Feuil1!$C$1:$BL$10,6,FALSE)","v":{"$error":"#VALUE!"}},{"$f":"S13-HLOOKUP(AA13,[1]Feuil1!$C$1:$BL$10,7,FALSE)","v":{"$error":"#VALUE!"}},{"$f":"S13-HLOOKUP(AA13,[1]Feuil1!$C$1:$BL$10,8,FALSE)","v":{"$error":"#VALUE!"}},{"$f":"S13-HLOOKUP(AA13,[1]Feuil1!$C$1:$BL$10,9,FALSE)","v":{"$error":"#VALUE!"}},{"$f":"S13-HLOOKUP(AA13,[1]Feuil1!$C$1:$BL$10,10,FALSE)","v":{"$error":"#VALUE!"}},null,null,null,null,null,null,{"$error":"#VALUE!"}]
[null,null,1,"B101001277","JOURNO","DELPHINE","Université de Picardie","AMIENS",null,59.4,null,null,null,{"$f":"IF(I14=\"\",\"\",IF(MAXA(K14:M14)<=0,0,MAXA(K14:M14)))","v":""},43,45,50,50,{"$f":"IF(I14=\"\",\"\",IF(OR(N14=0,R14=0),0,N14+R14))","v":""},50,-52.5,-52.5,50,100,"",{"$error":"#VALUE!"},{"$f":"IF(J14=\"\",\"\",IF(#REF!=\"H\",IF(OR(I14=\"SEN\",I14<1995),VLOOKUP(J14,[1]Feuil1!$A$11:$G$29,6),IF(AND(I14>1994,I14<1998),VLOOKUP(J14,[1]Feuil1!$A$11:$G$29,5),IF(AND(I14>1997,I14<2000),VLOOKUP(J14,[1]Feuil1!$A$11:$G$29,4),IF(AND(I14>1999,I14<2002),VLOOKUP(J14,[1]Feuil1!$A$11:$G$29,3),VLOOKUP(J14,[1]Feuil1!$A$11:$G$29,2))))),IF(OR(I14=\"SEN\",I14<1995),VLOOKUP(J14,[1]Feuil1!$G$11:$L$25,6),IF(AND(I14>1994,I14<1998),VLOOKUP(J14,[1]Feuil1!$G$11:$L$25,5),IF(AND(I14>1997,I14<2000),VLOOKUP(J14,[1]Feuil1!$G$11:$L$25,4),IF(AND(I14>1999,I14<2002),VLOOKUP(J14,[1]Feuil1!$G$11:$L$25,3),VLOOKUP(J14,[1]Feuil1!$G$11:$L$25,2)))))))","v":{"$error":"#REF!"}},{"$f":"IF(J14=\"\",\"\",IF(#REF!=\"H\",10^(0.794358141*LOG(J14/174.393)^2)*S14,IF(#REF!=\"F\",10^(0.89726074*LOG(J14/148.026)^2)*S14,\"\")))","v":{"$error":"#REF!"}},null," ",{"$f":"S14-HLOOKUP(AA14,[1]Feuil1!$C$1:$BL$10,2,FALSE)","v":{"$error":"#VALUE!"}},{"$f":"S14-HLOOKUP(AA14,[1]Feuil1!$C$1:$BL$10,3,FALSE)","v":{"$error":"#VALUE!"}},{"$f":"S14-HLOOKUP(AA14,[1]Feuil1!$C$1:$BL$10,4,FALSE)","v":{"$error":"#VALUE!"}},{"$f":"S14-HLOOKUP(AA14,[1]Feuil1!$C$1:$BL$10,5,FALSE)","v":{"$error":"#VALUE!"}},{"$f":"S14-HLOOKUP(AA14,[1]Feuil1!$C$1:$BL$10,6,FALSE)","v":{"$error":"#VALUE!"}},{"$f":"S14-HLOOKUP(AA14,[1]Feuil1!$C$1:$BL$10,7,FALSE)","v":{"$error":"#VALUE!"}},{"$f":"S14-HLOOKUP(AA14,[1]Feuil1!$C$1:$BL$10,8,FALSE)","v":{"$error":"#VALUE!"}},{"$f":"S14-HLOOKUP(AA14,[1]Feuil1!$C$1:$BL$10,9,FALSE)","v":{"$error":"#VALUE!"}},{"$f":"S14-HLOOKUP(AA14,[1]Feuil1!$C$1:$BL$10,10,FALSE)","v":{"$error":"#VALUE!"}},null,null,null,null,null,null,{"$error":"#VALUE!"}]
["+63kg",null,1,"NN11093059","REGNIER","CLAIRE","UNIVERSITE MONTPELLIER STAPS","MONTPELLIER",null,63.9,null,null,null,{"$f":"IF(I15=\"\",\"\",IF(MAXA(K15:M15)<=0,0,MAXA(K15:M15)))","v":""},52,55,-58,55,{"$f":"IF(I15=\"\",\"\",IF(OR(N15=0,R15=0),0,N15+R15))","v":""},62.5,-65,null,62.5,117.5,"",{"$error":"#VALUE!"},{"$f":"IF(J15=\"\",\"\",IF(#REF!=\"H\",IF(OR(I15=\"SEN\",I15<1995),VLOOKUP(J15,[1]Feuil1!$A$11:$G$29,6),IF(AND(I15>1994,I15<1998),VLOOKUP(J15,[1]Feuil1!$A$11:$G$29,5),IF(AND(I15>1997,I15<2000),VLOOKUP(J15,[1]Feuil1!$A$11:$G$29,4),IF(AND(I15>1999,I15<2002),VLOOKUP(J15,[1]Feuil1!$A$11:$G$29,3),VLOOKUP(J15,[1]Feuil1!$A$11:$G$29,2))))),IF(OR(I15=\"SEN\",I15<1995),VLOOKUP(J15,[1]Feuil1!$G$11:$L$25,6),IF(AND(I15>1994,I15<1998),VLOOKUP(J15,[1]Feuil1!$G$11:$L$25,5),IF(AND(I15>1997,I15<2000),VLOOKUP(J15,[1]Feuil1!$G$11:$L$25,4),IF(AND(I15>1999,I15<2002),VLOOKUP(J15,[1]Feuil1!$G$11:$L$25,3),VLOOKUP(J15,[1]Feuil1!$G$11:$L$25,2)))))))","v":{"$error":"#REF!"}},{"$f":"IF(J15=\"\",\"\",IF(#REF!=\"H\",10^(0.794358141*LOG(J15/174.393)^2)*S15,IF(#REF!=\"F\",10^(0.89726074*LOG(J15/148.026)^2)*S15,\"\")))","v":{"$error":"#REF!"}},null," ",{"$f":"S15-HLOOKUP(AA15,[1]Feuil1!$C$1:$BL$10,2,FALSE)","v":{"$error":"#VALUE!"}},{"$f":"S15-HLOOKUP(AA15,[1]Feuil1!$C$1:$BL$10,3,FALSE)","v":{"$error":"#VALUE!"}},{"$f":"S15-HLOOKUP(AA15,[1]Feuil1!$C$1:$BL$10,4,FALSE)","v":{"$error":"#VALUE!"}},{"$f":"S15-HLOOKUP(AA15,[1]Feuil1!$C$1:$BL$10,5,FALSE)","v":{"$error":"#VALUE!"}},{"$f":"S15-HLOOKUP(AA15,[1]Feuil1!$C$1:$BL$10,6,FALSE)","v":{"$error":"#VALUE!"}},{"$f":"S15-HLOOKUP(AA15,[1]Feuil1!$C$1:$BL$10,7,FALSE)","v":{"$error":"#VALUE!"}},{"$f":"S15-HLOOKUP(AA15,[1]Feuil1!$C$1:$BL$10,8,FALSE)","v":{"$error":"#VALUE!"}},{"$f":"S15-HLOOKUP(AA15,[1]Feuil1!$C$1:$BL$10,9,FALSE)","v":{"$error":"#VALUE!"}},{"$f":"S15-HLOOKUP(AA15,[1]Feuil1!$C$1:$BL$10,10,FALSE)","v":{"$error":"#VALUE!"}},null,null,null,null,null,null,{"$error":"#VALUE!"}]
[]
[]
[]
[]
[]
[]
[]
[]
[]
[]
[]
[]
[]
[]
[]
[]
[]
[]
[]
[]
[]
[]
[]
[]
[]
[]
[]
[]
[]
[]
[]
[]
[]
[]
[]
[]
[]
[]
[]
[]
[]
[]
[]
[]
[]
[]
[]
[]
[]
[]
[]
[]
[]
[]
[]
[]
[]
[]
[]
[]
[]
[]
[]
[]
[]
[]
[]
[]
[]
[]
[]
[]
[]
[]
[]
[]
[]
[]
[]
[]
[]
[]
[]
[]
[]
[]
[]
[]
[]
[]
[]
[]
[]
[]
[]
[]
[]
[]
[]
[]
[]
[]
[]
[]
[]
[]
[]
[]
[]
[]
[]
[]
[]
[]
[]
[]
[]
[]
[]
[]
[]
[]
[]
[]
[]
[]
[]
[]
[]
[]
[]
[]
[]
[]
[]
[]
[]
[]
[]
[]
[]
[]
[]
[]
[]
[]
[]
[]
[]
[]
[]
[]
[]
[]
[]
[]
[]
[]
[]
[]
[]
[]
[]
[]
[]
[]
[]
[]
[]
[]
[]
[]
[]
[]
[]
[]
[]
[]
[]
[]
[]
[]
[]
[]
[]
[]
[]
[]
[]
[]
[]
[]
[]
[]
[]
[]
[]
[]
[]
[]
[]
[]
[]
[]
[]
[]
[]
[]
[]
[]
[]
[]
[]
[]
[]
[]
[]
[]
[]
[]
[]
[]
[]
[]
[]
[]
[]
[]
[]
[]
[]
[]
[]
[]
[]
[]
[]
[]
[]
[]
[]
[]
[]
[]
[]
[]
[]
[]
[]
[]
[]
[]
[]
[]
[]
[]
[]
[]
[]
[]
[]
[]
[]
[]
[]
[]
[]
[]
[]
[]
[]
[]
[]
[]
[]
[]
[]
[]
[]
[]
[]
[]
[]
[]
[]
[]
[]
[]
[]
[]
[]
[]
[]
[]
[]
[]
[]
[]
[]
[]
[]
[]
[]
[]
[]
[]
[]
[]
[]
[]
[]
[]
[]
[]
[]
[]
[]
[]
[]
[]
[]
[]
[]
[]
[]
[]
[]
[]
[]
[]
[]
[]
[]
[]
[]
[]
[]
[]
[]
[]
[]
[]
[]
[]
[]
[]
[]
[]
[]
[]
[]
[]
[]
[]
[]
[]
[]
[]
[]
[]
[]
[]
[]
[]
[]
[]
[]
[]
[]
[]
[]
[]
[]
[]
[]
[]
[]
[]
[]
[]
[]
[]
[]
[]
[]
[]
[]
[]
[]
[]
[]
[]
[]
[]
[]
[]
[]
[]
[]
[]
[]
[]
[]
[]
[]
[]
[]
[]
[]
[]
[]
[]
[]
[]
[]
[]
[]
[]
[]
[]
[]
[]
[]
[]
[]
[]
[]
[]
[]
[]
[]
[]
[]
[]
[]
[]
[]
[]
[]
[]
[]
[]
[]
[]
[]
[]
[]
[]
[]
[]
[]
[]
[]
[]
[]
[]
[]
[]
[]
[]
[]
[]
[]
[]
[]
[]
[]
[]
[]
[]
[]
[]
[]
[]
[]
[]
[]
[]
[]
[]
[]
[]
[]
[]
[]
[]
[]
[]
[]
[]
[]
[]
[]
[null,null,null,null,null,null,null,null,null,null,null,null,null,null,null,null,null,null,null,null,null,null,null,null,null,null,null,null,null,null,"J77","J85","J94","J105","J+105",null,"J56","J62","J69","J77","J85","J94","J105","J+105",null,"S56","S62","S69","S77","S85","S94","S105","S+105"]
[null,null,null,null,null,null,null,null,null,null,null,null,null,null,null,null,null,null,null,null,null,null,null,null,null,null,null,null,null,null,145,160,170,180,190,null,100,115,130,145,160,170,180,190,null,115,135,150,165,180,190,200,210]
[null,null,null,null,null,null,null,null,null,null,null,null,null,null,null,null,null,null,null,null,null,null,null,null,null,null,null,null,null,null,165,180,190,200,210,null,115,135,150,165,180,190,200,210,null,130,150,165,185,200,210,220,230]
[null,null,null,null,null,null,null,null,null,null,null,null,null,null,null,null,null,null,null,null,null,null,null,null,null,null,null,null,null,null,185,200,210,220,230,null,130,150,165,185,200,210,220,230,null,145,165,180,200,220,230,240,250]
[null,null,null,null,null,null,null,null,null,null,null,null,null,null,null,null,null,null,null,null,null,null,null,null,null,null,null,null,null,null,200,220,230,240,250,null,145,165,180,200,220,230,240,250,null,175,195,215,235,250,260,275,280]
[null,null,null,null,null,null,null,null,null,null,null,null,null,null,null,null,null,null,null,null,null,null,null,null,null,null,null,null,null,null,235,250,260,275,280,null,175,195,215,235,250,260,275,280,null,210,230,250,270,290,300,310,325]
[null,null,null,null,null,null,null,null,null,null,null,null,null,null,null,null,null,null,null,null,null,null,null,null,null,null,null,null,null,null,270,290,300,310,325,null,210,230,250,270,290,300,310,325,null,230,255,275,300,315,335,345,355]
[null,null,null,null,null,null,null,null,null,null,null,null,null,null,null,null,null,null,null,null,null,null,null,null,null,null,null,null,null,null,320,335,355,370,380,null,245,270,295,320,335,355,370,380,null,245,270,295,320,335,355,370,380]

{"sheet":"HA-FA Garçons","index":2,"n_rows":532,"n_cols":49,"rows_kept":532,"cut":false,"hidden":false,"merged":[[1,13,1,16],[1,17,1,18],[0,17,0,19],[0,3,0,4],[1,3,1,4],[18,0,20,0],[21,0,26,0],[13,0,17,0],[1,5,1,9],[1,10,1,12],[4,0,5,0],[7,0,12,0]]}
[null,null,null,"EPREUVE :",null,"HALTEROPHILIE",null,null,null,"HALTERO/FORCE",null,null,null,null,null,null,"DATE :","2015-05-12"]
[null,null,null,"LIEU :",null,"CLERMONT L'HERAULT",null,null,null,null,"CFU 2015",null,null,null,null,null,null,"ZONE :",null,"SUD"]
[]
["CAT.POIDS","CL.HA","CL.FA","LICENCE","NOMS","Prénoms","AS","Académie","AN","POIDS",1,2,3,"ARR",1,2,3,"EP-J","Total HA",1,2,3,"DC","Total FA",null," ","DEB ","DEP +","REG +","IRG +","FED +","NAT +","INTB +","INTA +","OLY +"]
["62kg",1,1,"B101093380","DOLE","ANDY","Université de Picardie","AMIENS",null,61.4,60,-65,65,{"$f":"IF(J5=\"\",\"\",IF(MAXA(K5:M5)<=0,0,MAXA(K5:M5)))","v":65},-78,-78,78,{"$f":"IF(J5=\"\",\"\",IF(MAXA(O5:Q5)<=0,0,MAXA(O5:Q5)))","v":78},{"$f":"IF(J5=\"\",\"\",IF(OR(N5=0,R5=0),0,N5+R5))","v":143},90,-95,-95,{"$f":"IF(J5=\"\",\"\",IF(MAXA(T5:V5)<=0,0,MAXA(T5:V5)))","v":90},{"$f":"IF(J5=\"\",\"\",IF(OR(R5=0,W5=0),0,R5+W5))","v":168},null," ",{"$f":"S5-HLOOKUP(#REF!,Feuil1!$C$1:$BL$10,2,FALSE)","v":{"$error":"#REF!"}},{"$f":"S5-HLOOKUP(#REF!,Feuil1!$C$1:$BL$10,3,FALSE)","v":{"$error":"#REF!"}},{"$f":"S5-HLOOKUP(#REF!,Feuil1!$C$1:$BL$10,4,FALSE)","v":{"$error":"#REF!"}},{"$f":"S5-HLOOKUP(#REF!,Feuil1!$C$1:$BL$10,5,FALSE)","v":{"$error":"#REF!"}},{"$f":"S5-HLOOKUP(#REF!,Feuil1!$C$1:$BL$10,6,FALSE)","v":{"$error":"#REF!"}},{"$f":"S5-HLOOKUP(#REF!,Feuil1!$C$1:$BL$10,7,FALSE)","v":{"$error":"#REF!"}},{"$f":"S5-HLOOKUP(#REF!,Feuil1!$C$1:$BL$10,8,FALSE)","v":{"$error":"#REF!"}},{"$f":"S5-HLOOKUP(#REF!,Feuil1!$C$1:$BL$10,9,FALSE)","v":{"$error":"#REF!"}},{"$f":"S5-HLOOKUP(#REF!,Feuil1!$C$1:$BL$10,10,FALSE)","v":{"$error":"#REF!"}},null,null,null,null,null,null,{"$f":"IF(AI5>=0,$AI$4,IF(AH5>=0,$AH$4,IF(AG5>=0,$AG$4,IF(AF5>=0,$AF$4,IF(AE5>=0,$AE$4,IF(AD5>=0,$AD$4,IF(AC5>=0,$AC$4,IF(AB5>=0,$AB$4,$AA$4))))))))","v":{"$error":"#REF!"}}]
[null,null,null,"NN11093058","RAI ELBALHAA","GREGORY","UNIVERSITE MONTPELLIER STAPS","MONTPELLIER",null,54.95,null,null,null,null,70,73,-75,{"$f":"IF(J6=\"\",\"\",IF(MAXA(O6:Q6)<=0,0,MAXA(O6:Q6)))","v":73},null,-87.5,-87.5,-87.5,{"$f":"IF(J6=\"\",\"\",IF(MAXA(T6:V6)<=0,0,MAXA(T6:V6)))","v":0},{"$f":"IF(J6=\"\",\"\",IF(OR(R6=0,W6=0),0,R6+W6))","v":0},null," ",{"$f":"S6-HLOOKUP(#REF!,Feuil1!$C$1:$BL$10,2,FALSE)","v":{"$error":"#REF!"}},{"$f":"S6-HLOOKUP(#REF!,Feuil1!$C$1:$BL$10,3,FALSE)","v":{"$error":"#REF!"}},{"$f":"S6-HLOOKUP(#REF!,Feuil1!$C$1:$BL$10,4,FALSE)","v":{"$error":"#REF!"}},{"$f":"S6-HLOOKUP(#REF!,Feuil1!$C$1:$BL$10,5,FALSE)","v":{"$error":"#REF!"}},{"$f":"S6-HLOOKUP(#REF!,Feuil1!$C$1:$BL$10,6,FALSE)","v":{"$error":"#REF!"}},{"$f":"S6-HLOOKUP(#REF!,Feuil1!$C$1:$BL$10,7,FALSE)","v":{"$error":"#REF!"}},{"$f":"S6-HLOOKUP(#REF!,Feuil1!$C$1:$BL$10,8,FALSE)","v":{"$error":"#REF!"}},{"$f":"S6-HLOOKUP(#REF!,Feuil1!$C$1:$BL$10,9,FALSE)","v":{"$error":"#REF!"}},{"$f":"S6-HLOOKUP(#REF!,Feuil1!$C$1:$BL$10,10,FALSE)","v":{"$error":"#REF!"}},null,null,null,null,null,null,{"$f":"IF(AI6>=0,$AI$4,IF(AH6>=0,$AH$4,IF(AG6>=0,$AG$4,IF(AF6>=0,$AF$4,IF(AE6>=0,$AE$4,IF(AD6>=0,$AD$4,IF(AC6>=0,$AC$4,IF(AB6>=0,$AB$4,$AA$4))))))))","v":{"$error":"#REF!"}}]
[null,null,2,"S600049615","BOWEN","Maximilien","UPMC","PARIS",null,68.650000000000006,null,null,null,null,95,-100,-100,95,null,-107.5,107.5,-115,{"$f":"IF(J7=\"\",\"\",IF(MAXA(T7:V7)<=0,0,MAXA(T7:V7)))","v":107.5},202.5]
["69kg",null,5,"B101011691","LOORIUS","JULIEN","Université de Picardie","AMIENS",null,67.150000000000006,null,null,null,null,70,-75,-75,70,null,110,115,-117.5,{"$f":"IF(J8=\"\",\"\",IF(MAXA(T8:V8)<=0,0,MAXA(T8:V8)))","v":115},185,null," ",{"$f":"S8-HLOOKUP(#REF!,Feuil1!$C$1:$BL$10,2,FALSE)","v":{"$error":"#REF!"}},{"$f":"S8-HLOOKUP(#REF!,Feuil1!$C$1:$BL$10,3,FALSE)","v":{"$error":"#REF!"}},{"$f":"S8-HLOOKUP(#REF!,Feuil1!$C$1:$BL$10,4,FALSE)","v":{"$error":"#REF!"}},{"$f":"S8-HLOOKUP(#REF!,Feuil1!$C$1:$BL$10,5,FALSE)","v":{"$error":"#REF!"}},{"$f":"S8-HLOOKUP(#REF!,Feuil1!$C$1:$BL$10,6,FALSE)","v":{"$error":"#REF!"}},{"$f":"S8-HLOOKUP(#REF!,Feuil1!$C$1:$BL$10,7,FALSE)","v":{"$error":"#REF!"}},{"$f":"S8-HLOOKUP(#REF!,Feuil1!$C$1:$BL$10,8,FALSE)","v":{"$error":"#REF!"}},{"$f":"S8-HLOOKUP(#REF!,Feuil1!$C$1:$BL$10,9,FALSE)","v":{"$error":"#REF!"}},{"$f":"S8-HLOOKUP(#REF!,Feuil1!$C$1:$BL$10,10,FALSE)","v":{"$error":"#REF!"}},null,null,null,null,null,null,{"$f":"IF(AI8>=0,$AI$4,IF(AH8>=0,$AH$4,IF(AG8>=0,$AG$4,IF(AF8>=0,$AF$4,IF(AE8>=0,$AE$4,IF(AD8>=0,$AD$4,IF(AC8>=0,$AC$4,IF(AB8>=0,$AB$4,$AA$4))))))))","v":{"$error":"#REF!"}}]
[null,3,3,"B101090461","DUPUIS","SIMON","Université de Picardie","AMIENS",null,65.05,-70,70,-75,{"$f":"IF(J9=\"\",\"\",IF(MAXA(K9:M9)<=0,0,MAXA(K9:M9)))","v":70},95,-100,100,100,{"$f":"IF(J9=\"\",\"\",IF(OR(N9=0,R9=0),0,N9+R9))","v":170},85,90,-95,90,190,null," ",{"$f":"S9-HLOOKUP(#REF!,Feuil1!$C$1:$BL$10,2,FALSE)","v":{"$error":"#REF!"}},{"$f":"S9-HLOOKUP(#REF!,Feuil1!$C$1:$BL$10,3,FALSE)","v":{"$error":"#REF!"}},{"$f":"S9-HLOOKUP(#REF!,Feuil1!$C$1:$BL$10,4,FALSE)","v":{"$error":"#REF!"}},{"$f":"S9-HLOOKUP(#REF!,Feuil1!$C$1:$BL$10,5,FALSE)","v":{"$error":"#REF!"}},{"$f":"S9-HLOOKUP(#REF!,Feuil1!$C$1:$BL$10,6,FALSE)","v":{"$error":"#REF!"}},{"$f":"S9-HLOOKUP(#REF!,Feuil1!$C$1:$BL$10,7,FALSE)","v":{"$error":"#REF!"}},{"$f":"S9-HLOOKUP(#REF!,Feuil1!$C$1:$BL$10,8,FALSE)","v":{"$error":"#REF!"}},{"$f":"S9-HLOOKUP(#REF!,Feuil1!$C$1:$BL$10,9,FALSE)","v":{"$error":"#REF!"}},{"$f":"S9-HLOOKUP(#REF!,Feuil1!$C$1:$BL$10,10,FALSE)","v":{"$error":"#REF!"}},null,null,null,null,null,null,{"$error":"#REF!"}]
[null,null,4,"B101083831","HECKENBENNER","AXEL","Université de Picardie","AMIENS",null,64.099999999999994,null,null,null,null,-75,75,80,80,null,95,100,-105,100,180,null," ",{"$f":"S10-HLOOKUP(#REF!,Feuil1!$C$1:$BL$10,2,FALSE)","v":{"$error":"#REF!"}},{"$f":"S10-HLOOKUP(#REF!,Feuil1!$C$1:$BL$10,3,FALSE)","v":{"$error":"#REF!"}},{"$f":"S10-HLOOKUP(#REF!,Feuil1!$C$1:$BL$10,4,FALSE)","v":{"$error":"#REF!"}},{"$f":"S10-HLOOKUP(#REF!,Feuil1!$C$1:$BL$10,5,FALSE)","v":{"$error":"#REF!"}},{"$f":"S10-HLOOKUP(#REF!,Feuil1!$C$1:$BL$10,6,FALSE)","v":{"$error":"#REF!"}},{"$f":"S10-HLOOKUP(#REF!,Feuil1!$C$1:$BL$10,7,FALSE)","v":{"$error":"#REF!"}},{"$f":"S10-HLOOKUP(#REF!,Feuil1!$C$1:$BL$10,8,FALSE)","v":{"$error":"#REF!"}},{"$f":"S10-HLOOKUP(#REF!,Feuil1!$C$1:$BL$10,9,FALSE)","v":{"$error":"#REF!"}},{"$f":"S10-HLOOKUP(#REF!,Feuil1!$C$1:$BL$10,10,FALSE)","v":{"$error":"#REF!"}},null,null,null,null,null,null,{"$error":"#REF!"}]
[null,2,1,"B101082692","OBEL","ALEXANDRE","Université de Picardie","AMIENS",null,67.8,73,78,-82,78,100,105,110,110,188,110,120,-122.5,120,230,null," ",{"$f":"S11-HLOOKUP(#REF!,Feuil1!$C$1:$BL$10,2,FALSE)","v":{"$error":"#REF!"}},{"$f":"S11-HLOOKUP(#REF!,Feuil1!$C$1:$BL$10,3,FALSE)","v":{"$error":"#REF!"}},{"$f":"S11-HLOOKUP(#REF!,Feuil1!$C$1:$BL$10,4,FALSE)","v":{"$error":"#REF!"}},{"$f":"S11-HLOOKUP(#REF!,Feuil1!$C$1:$BL$10,5,FALSE)","v":{"$error":"#REF!"}},{"$f":"S11-HLOOKUP(#REF!,Feuil1!$C$1:$BL$10,6,FALSE)","v":{"$error":"#REF!"}},{"$f":"S11-HLOOKUP(#REF!,Feuil1!$C$1:$BL$10,7,FALSE)","v":{"$error":"#REF!"}},{"$f":"S11-HLOOKUP(#REF!,Feuil1!$C$1:$BL$10,8,FALSE)","v":{"$error":"#REF!"}},{"$f":"S11-HLOOKUP(#REF!,Feuil1!$C$1:$BL$10,9,FALSE)","v":{"$error":"#REF!"}},{"$f":"S11-HLOOKUP(#REF!,Feuil1!$C$1:$BL$10,10,FALSE)","v":{"$error":"#REF!"}},null,null,null,null,null,null,{"$error":"#REF!"}]
[null,null,null,"NN11096456","GREZ","RODOLPHE","UNIVERSITE MONTPELLIER STAPS","MONTPELLIER",null,68.2,-75,-75,-80,0,null,null,null,0,null,null,null,null,null,null,null," ",{"$f":"S12-HLOOKUP(#REF!,Feuil1!$C$1:$BL$10,2,FALSE)","v":{"$error":"#REF!"}},{"$f":"S12-HLOOKUP(#REF!,Feuil1!$C$1:$BL$10,3,FALSE)","v":{"$error":"#REF!"}},{"$f":"S12-HLOOKUP(#REF!,Feuil1!$C$1:$BL$10,4,FALSE)","v":{"$error":"#REF!"}},{"$f":"S12-HLOOKUP(#REF!,Feuil1!$C$1:$BL$10,5,FALSE)","v":{"$error":"#REF!"}},{"$f":"S12-HLOOKUP(#REF!,Feuil1!$C$1:$BL$10,6,FALSE)","v":{"$error":"#REF!"}},{"$f":"S12-HLOOKUP(#REF!,Feuil1!$C$1:$BL$10,7,FALSE)","v":{"$error":"#REF!"}},{"$f":"S12-HLOOKUP(#REF!,Feuil1!$C$1:$BL$10,8,FALSE)","v":{"$error":"#REF!"}},{"$f":"S12-HLOOKUP(#REF!,Feuil1!$C$1:$BL$10,9,FALSE)","v":{"$error":"#REF!"}},{"$f":"S12-HLOOKUP(#REF!,Feuil1!$C$1:$BL$10,10,FALSE)","v":{"$error":"#REF!"}},null,null,null,null,null,null,{"$error":"#REF!"}]
[null,1,null,"B101029082","JEROME","KEVIN","Université de Picardie","AMIENS",null,69,90,95,-100,95,110,115,120,120,215,-90,-90,-90,0,null,null," ",{"$f":"S13-HLOOKUP(#REF!,Feuil1!$C$1:$BL$10,2,FALSE)","v":{"$error":"#REF!"}},{"$f":"S13-HLOOKUP(#REF!,Feuil1!$C$1:$BL$10,3,FALSE)","v":{"$error":"#REF!"}},{"$f":"S13-HLOOKUP(#REF!,Feuil1!$C$1:$BL$10,4,FALSE)","v":{"$error":"#REF!"}},{"$f":"S13-HLOOKUP(#REF!,Feuil1!$C$1:$BL$10,5,FALSE)","v":{"$error":"#REF!"}},{"$f":"S13-HLOOKUP(#REF!,Feuil1!$C$1:$BL$10,6,FALSE)","v":{"$error":"#REF!"}},{"$f":"S13-HLOOKUP(#REF!,Feuil1!$C$1:$BL$10,7,FALSE)","v":{"$error":"#REF!"}},{"$f":"S13-HLOOKUP(#REF!,Feuil1!$C$1:$BL$10,8,FALSE)","v":{"$error":"#REF!"}},{"$f":"S13-HLOOKUP(#REF!,Feuil1!$C$1:$BL$10,9,FALSE)","v":{"$error":"#REF!"}},{"$f":"S13-HLOOKUP(#REF!,Feuil1!$C$1:$BL$10,10,FALSE)","v":{"$error":"#REF!"}},null,null,null,null,null,null,{"$error":"#REF!"}]
["77kg",2,1,"B101009187","PECQUEUX","MAXENCE","Université de Picardie","AMIENS",null,76.900000000000006,100,105,109,109,135,140,-145,140,249,115,120,-125,{"$f":"IF(J14=\"\",\"\",IF(MAXA(T14:V14)<=0,0,MAXA(T14:V14)))","v":120},260,null," ",{"$f":"S14-HLOOKUP(#REF!,Feuil1!$C$1:$BL$10,2,FALSE)","v":{"$error":"#REF!"}},{"$f":"S14-HLOOKUP(#REF!,Feuil1!$C$1:$BL$10,3,FALSE)","v":{"$error":"#REF!"}},{"$f":"S14-HLOOKUP(#REF!,Feuil1!$C$1:$BL$10,4,FALSE)","v":{"$error":"#REF!"}},{"$f":"S14-HLOOKUP(#REF!,Feuil1!$C$1:$BL$10,5,FALSE)","v":{"$error":"#REF!"}},{"$f":"S14-HLOOKUP(#REF!,Feuil1!$C$1:$BL$10,6,FALSE)","v":{"$error":"#REF!"}},{"$f":"S14-HLOOKUP(#REF!,Feuil1!$C$1:$BL$10,7,FALSE)","v":{"$error":"#REF!"}},{"$f":"S14-HLOOKUP(#REF!,Feuil1!$C$1:$BL$10,8,FALSE)","v":{"$error":"#REF!"}},{"$f":"S14-HLOOKUP(#REF!,Feuil1!$C$1:$BL$10,9,FALSE)","v":{"$error":"#REF!"}},{"$f":"S14-HLOOKUP(#REF!,Feuil1!$C$1:$BL$10,10,FALSE)","v":{"$error":"#REF!"}},null,null,null,null,null,null,{"$error":"#REF!"}]
[null,null,2,"B101095451","ZIG","WESLEY","Université de Picardie","AMIENS",null,77,null,null,null,null,70,75,-80,75,null,115,120,125,125,200,null," ",{"$f":"S15-HLOOKUP(#REF!,Feuil1!$C$1:$BL$10,2,FALSE)","v":{"$error":"#REF!"}},{"$f":"S15-HLOOKUP(#REF!,Feuil1!$C$1:$BL$10,3,FALSE)","v":{"$error":"#REF!"}},{"$f":"S15-HLOOKUP(#REF!,Feuil1!$C$1:$BL$10,4,FALSE)","v":{"$error":"#REF!"}},{"$f":"S15-HLOOKUP(#REF!,Feuil1!$C$1:$BL$10,5,FALSE)","v":{"$error":"#REF!"}},{"$f":"S15-HLOOKUP(#REF!,Feuil1!$C$1:$BL$10,6,FALSE)","v":{"$error":"#REF!"}},{"$f":"S15-HLOOKUP(#REF!,Feuil1!$C$1:$BL$10,7,FALSE)","v":{"$error":"#REF!"}},{"$f":"S15-HLOOKUP(#REF!,Feuil1!$C$1:$BL$10,8,FALSE)","v":{"$error":"#REF!"}},{"$f":"S15-HLOOKUP(#REF!,Feuil1!$C$1:$BL$10,9,FALSE)","v":{"$error":"#REF!"}},{"$f":"S15-HLOOKUP(#REF!,Feuil1!$C$1:$BL$10,10,FALSE)","v":{"$error":"#REF!"}},null,null,null,null,null,null,{"$error":"#REF!"}]
[null,3,null,"NN11092096","SCHIPPER","AUBRY-JAN","UNIVERSITE MONTPELLIER STAPS","MONTPELLIER",null,75.8,103,108,110,110,-132,132,-138,132,242,null,null,null,{"$f":"IF(I16=\"\",\"\",IF(MAXA(T16:V16)<=0,0,MAXA(T16:V16)))","v":""},null,null," ",{"$f":"S16-HLOOKUP(#REF!,Feuil1!$C$1:$BL$10,2,FALSE)","v":{"$error":"#REF!"}},{"$f":"S16-HLOOKUP(#REF!,Feuil1!$C$1:$BL$10,3,FALSE)","v":{"$error":"#REF!"}},{"$f":"S16-HLOOKUP(#REF!,Feuil1!$C$1:$BL$10,4,FALSE)","v":{"$error":"#REF!"}},{"$f":"S16-HLOOKUP(#REF!,Feuil1!$C$1:$BL$10,5,FALSE)","v":{"$error":"#REF!"}},{"$f":"S16-HLOOKUP(#REF!,Feuil1!$C$1:$BL$10,6,FALSE)","v":{"$error":"#REF!"}},{"$f":"S16-HLOOKUP(#REF!,Feuil1!$C$1:$BL$10,7,FALSE)","v":{"$error":"#REF!"}},{"$f":"S16-HLOOKUP(#REF!,Feuil1!$C$1:$BL$10,8,FALSE)","v":{"$error":"#REF!"}},{"$f":"S16-HLOOKUP(#REF!,Feuil1!$C$1:$BL$10,9,FALSE)","v":{"$error":"#REF!"}},{"$f":"S16-HLOOKUP(#REF!,Feuil1!$C$1:$BL$10,10,FALSE)","v":{"$error":"#REF!"}},null,null,null,null,null,null,{"$error":"#REF!"}]
[null,4,null,"B101067535","MONSIGNA","JOSS","Université de Picardie","AMIENS",null,70.8,80,-86,86,86,95,100,-105,100,186,null,null,null,"",null,null," ",{"$f":"S17-HLOOKUP(#REF!,Feuil1!$C$1:$BL$10,2,FALSE)","v":{"$error":"#REF!"}},{"$f":"S17-HLOOKUP(#REF!,Feuil1!$C$1:$BL$10,3,FALSE)","v":{"$error":"#REF!"}},{"$f":"S17-HLOOKUP(#REF!,Feuil1!$C$1:$BL$10,4,FALSE)","v":{"$error":"#REF!"}},{"$f":"S17-HLOOKUP(#REF!,Feuil1!$C$1:$BL$10,5,FALSE)","v":{"$error":"#REF!"}},{"$f":"S17-HLOOKUP(#REF!,Feuil1!$C$1:$BL$10,6,FALSE)","v":{"$error":"#REF!"}},{"$f":"S17-HLOOKUP(#REF!,Feuil1!$C$1:$BL$10,7,FALSE)","v":{"$error":"#REF!"}},{"$f":"S17-HLOOKUP(#REF!,Feuil1!$C$1:$BL$10,8,FALSE)","v":{"$error":"#REF!"}},{"$f":"S17-HLOOKUP(#REF!,Feuil1!$C$1:$BL$10,9,FALSE)","v":{"$error":"#REF!"}},{"$f":"S17-HLOOKUP(#REF!,Feuil1!$C$1:$BL$10,10,FALSE)","v":{"$error":"#REF!"}},null,null,null,null,null,null,{"$error":"#REF!"}]
[null,1,null,"NN11093081","AUCOUTURIER","Yann","UNIVERSITE MONTPELLIER STAPS","MONTPELLIER",null,72.650000000000006,120,null,null,120,150,160,null,160,280,null,null,null,"",null,null," ",{"$f":"S18-HLOOKUP(#REF!,Feuil1!$C$1:$BL$10,2,FALSE)","v":{"$error":"#REF!"}},{"$f":"S18-HLOOKUP(#REF!,Feuil1!$C$1:$BL$10,3,FALSE)","v":{"$error":"#REF!"}},{"$f":"S18-HLOOKUP(#REF!,Feuil1!$C$1:$BL$10,4,FALSE)","v":{"$error":"#REF!"}},{"$f":"S18-HLOOKUP(#REF!,Feuil1!$C$1:$BL$10,5,FALSE)","v":{"$error":"#REF!"}},{"$f":"S18-HLOOKUP(#REF!,Feuil1!$C$1:$BL$10,6,FALSE)","v":{"$error":"#REF!"}},{"$f":"S18-HLOOKUP(#REF!,Feuil1!$C$1:$BL$10,7,FALSE)","v":{"$error":"#REF!"}},{"$f":"S18-HLOOKUP(#REF!,Feuil1!$C$1:$BL$10,8,FALSE)","v":{"$error":"#REF!"}},{"$f":"S18-HLOOKUP(#REF!,Feuil1!$C$1:$BL$10,9,FALSE)","v":{"$error":"#REF!"}},{"$f":"S18-HLOOKUP(#REF!,Feuil1!$C$1:$BL$10,10,FALSE)","v":{"$error":"#REF!"}},null,null,null,null,null,null,{"$error":"#REF!"}]
["85kg",null,1,"B101090682","ROBIN","THOMAS","Université de Picardie","AMIENS",null,84.5,null,null,null,null,106,111,116,{"$f":"IF(J19=\"\",\"\",IF(MAXA(O19:Q19)<=0,0,MAXA(O19:Q19)))","v":116},null,122.5,127.5,-132.5,{"$f":"IF(J19=\"\",\"\",IF(MAXA(T19:V19)<=0,0,MAXA(T19:V19)))","v":127.5},243.5,null," ",{"$f":"S19-HLOOKUP(#REF!,Feuil1!$C$1:$BL$10,2,FALSE)","v":{"$error":"#REF!"}},{"$f":"S19-HLOOKUP(#REF!,Feuil1!$C$1:$BL$10,3,FALSE)","v":{"$error":"#REF!"}},{"$f":"S19-HLOOKUP(#REF!,Feuil1!$C$1:$BL$10,4,FALSE)","v":{"$error":"#REF!"}},{"$f":"S19-HLOOKUP(#REF!,Feuil1!$C$1:$BL$10,5,FALSE)","v":{"$error":"#REF!"}},{"$f":"S19-HLOOKUP(#REF!,Feuil1!$C$1:$BL$10,6,FALSE)","v":{"$error":"#REF!"}},{"$f":"S19-HLOOKUP(#REF!,Feuil1!$C$1:$BL$10,7,FALSE)","v":{"$error":"#REF!"}},{"$f":"S19-HLOOKUP(#REF!,Feuil1!$C$1:$BL$10,8,FALSE)","v":{"$error":"#REF!"}},{"$f":"S19-HLOOKUP(#REF!,Feuil1!$C$1:$BL$10,9,FALSE)","v":{"$error":"#REF!"}},{"$f":"S19-HLOOKUP(#REF!,Feuil1!$C$1:$BL$10,10,FALSE)","v":{"$error":"#REF!"}},null,null,null,null,null,null,{"$error":"#REF!"}]
[null,1,null,"N330093492","BIJJI","SAMI","UPV MONTPELLIER","MONTPELLIER",null,81.900000000000006,-115,115,-122,{"$f":"IF(J20=\"\",\"\",IF(MAXA(K20:M20)<=0,0,MAXA(K20:M20)))","v":115},140,null,null,{"$f":"IF(J20=\"\",\"\",IF(MAXA(O20:Q20)<=0,0,MAXA(O20:Q20)))","v":140},{"$f":"IF(J20=\"\",\"\",IF(OR(N20=0,R20=0),0,N20+R20))","v":255},null,null,null,{"$f":"IF(I20=\"\",\"\",IF(MAXA(T20:V20)<=0,0,MAXA(T20:V20)))","v":""},null,null," ",{"$f":"S20-HLOOKUP(#REF!,Feuil1!$C$1:$BL$10,2,FALSE)","v":{"$error":"#REF!"}},{"$f":"S20-HLOOKUP(#REF!,Feuil1!$C$1:$BL$10,3,FALSE)","v":{"$error":"#REF!"}},{"$f":"S20-HLOOKUP(#REF!,Feuil1!$C$1:$BL$10,4,FALSE)","v":{"$error":"#REF!"}},{"$f":"S20-HLOOKUP(#REF!,Feuil1!$C$1:$BL$10,5,FALSE)","v":{"$error":"#REF!"}},{"$f":"S20-HLOOKUP(#REF!,Feuil1!$C$1:$BL$10,6,FALSE)","v":{"$error":"#REF!"}},{"$f":"S20-HLOOKUP(#REF!,Feuil1!$C$1:$BL$10,7,FALSE)","v":{"$error":"#REF!"}},{"$f":"S20-HLOOKUP(#REF!,Feuil1!$C$1:$BL$10,8,FALSE)","v":{"$error":"#REF!"}},{"$f":"S20-HLOOKUP(#REF!,Feuil1!$C$1:$BL$10,9,FALSE)","v":{"$error":"#REF!"}},{"$f":"S20-HLOOKUP(#REF!,Feuil1!$C$1:$BL$10,10,FALSE)","v":{"$error":"#REF!"}},null,null,null,null,null,null,{"$error":"#REF!"}]
[null,null,2,"F121098240","MANRY","ADRIEN","PRE CLERMONT STAPS","CLERMONT FD",null,83.65,null,null,null,null,98,-102,102,102,null,112.5,115,-120,{"$f":"IF(J21=\"\",\"\",IF(MAXA(T21:V21)<=0,0,MAXA(T21:V21)))","v":115},217,null," ",{"$f":"S21-HLOOKUP(#REF!,Feuil1!$C$1:$BL$10,2,FALSE)","v":{"$error":"#REF!"}},{"$f":"S21-HLOOKUP(#REF!,Feuil1!$C$1:$BL$10,3,FALSE)","v":{"$error":"#REF!"}},{"$f":"S21-HLOOKUP(#REF!,Feuil1!$C$1:$BL$10,4,FALSE)","v":{"$error":"#REF!"}},{"$f":"S21-HLOOKUP(#REF!,Feuil1!$C$1:$BL$10,5,FALSE)","v":{"$error":"#REF!"}},{"$f":"S21-HLOOKUP(#REF!,Feuil1!$C$1:$BL$10,6,FALSE)","v":{"$error":"#REF!"}},{"$f":"S21-HLOOKUP(#REF!,Feuil1!$C$1:$BL$10,7,FALSE)","v":{"$error":"#REF!"}},{"$f":"S21-HLOOKUP(#REF!,Feuil1!$C$1:$BL$10,8,FALSE)","v":{"$error":"#REF!"}},{"$f":"S21-HLOOKUP(#REF!,Feuil1!$C$1:$BL$10,9,FALSE)","v":{"$error":"#REF!"}},{"$f":"S21-HLOOKUP(#REF!,Feuil1!$C$1:$BL$10,10,FALSE)","v":{"$error":"#REF!"}},null,null,null,null,null,null,{"$error":"#REF!"}]
["94kg",4,2,"B101094964","VALLEE","SYLVAIN","Université de Picardie","AMIENS",null,92.95,85,90,95,{"$f":"IF(J22=\"\",\"\",IF(MAXA(K22:M22)<=0,0,MAXA(K22:M22)))","v":95},120,-125,-125,120,{"$f":"IF(J22=\"\",\"\",IF(OR(N22=0,R22=0),0,N22+R22))","v":215},135,142.5,-150,{"$f":"IF(J22=\"\",\"\",IF(MAXA(T22:V22)<=0,0,MAXA(T22:V22)))","v":142.5},262.5,null," ",{"$f":"S22-HLOOKUP(#REF!,Feuil1!$C$1:$BL$10,2,FALSE)","v":{"$error":"#REF!"}},{"$f":"S22-HLOOKUP(#REF!,Feuil1!$C$1:$BL$10,3,FALSE)","v":{"$error":"#REF!"}},{"$f":"S22-HLOOKUP(#REF!,Feuil1!$C$1:$BL$10,4,FALSE)","v":{"$error":"#REF!"}},{"$f":"S22-HLOOKUP(#REF!,Feuil1!$C$1:$BL$10,5,FALSE)","v":{"$error":"#REF!"}},{"$f":"S22-HLOOKUP(#REF!,Feuil1!$C$1:$BL$10,6,FALSE)","v":{"$error":"#REF!"}},{"$f":"S22-HLOOKUP(#REF!,Feuil1!$C$1:$BL$10,7,FALSE)","v":{"$error":"#REF!"}},{"$f":"S22-HLOOKUP(#REF!,Feuil1!$C$1:$BL$10,8,FALSE)","v":{"$error":"#REF!"}},{"$f":"S22-HLOOKUP(#REF!,Feuil1!$C$1:$BL$10,9,FALSE)","v":{"$error":"#REF!"}},{"$f":"S22-HLOOKUP(#REF!,Feuil1!$C$1:$BL$10,10,FALSE)","v":{"$error":"#REF!"}},null,null,null,null,null,null,{"$error":"#REF!"}]
[null,3,5,"B101076665","RICHARD","ALEXANDRE","Université de Picardie","AMIENS",null,86.95,93,-98,98,98,123,128,-131,128,226,105,110,-117.5,{"$f":"IF(J23=\"\",\"\",IF(MAXA(T23:V23)<=0,0,MAXA(T23:V23)))","v":110},238,null," ",{"$f":"S23-HLOOKUP(#REF!,Feuil1!$C$1:$BL$10,2,FALSE)","v":{"$error":"#REF!"}},{"$f":"S23-HLOOKUP(#REF!,Feuil1!$C$1:$BL$10,3,FALSE)","v":{"$error":"#REF!"}},{"$f":"S23-HLOOKUP(#REF!,Feuil1!$C$1:$BL$10,4,FALSE)","v":{"$error":"#REF!"}},{"$f":"S23-HLOOKUP(#REF!,Feuil1!$C$1:$BL$10,5,FALSE)","v":{"$error":"#REF!"}},{"$f":"S23-HLOOKUP(#REF!,Feuil1!$C$1:$BL$10,6,FALSE)","v":{"$error":"#REF!"}},{"$f":"S23-HLOOKUP(#REF!,Feuil1!$C$1:$BL$10,7,FALSE)","v":{"$error":"#REF!"}},{"$f":"S23-HLOOKUP(#REF!,Feuil1!$C$1:$BL$10,8,FALSE)","v":{"$error":"#REF!"}},{"$f":"S23-HLOOKUP(#REF!,Feuil1!$C$1:$BL$10,9,FALSE)","v":{"$error":"#REF!"}},{"$f":"S23-HLOOKUP(#REF!,Feuil1!$C$1:$BL$10,10,FALSE)","v":{"$error":"#REF!"}},null,null,null,null,null,null,{"$error":"#REF!"}]
[null,null,3,"NN11093540","DUCLOS","BENJAMIN","UNIVERSITE MONTPELLIER STAPS","MONTPELLIER",null,91.7,null,null,null,0,100,105,-110,105,null,140,147.5,-152.5,147.5,252.5,null," ",{"$f":"S24-HLOOKUP(#REF!,Feuil1!$C$1:$BL$10,2,FALSE)","v":{"$error":"#REF!"}},{"$f":"S24-HLOOKUP(#REF!,Feuil1!$C$1:$BL$10,3,FALSE)","v":{"$error":"#REF!"}},{"$f":"S24-HLOOKUP(#REF!,Feuil1!$C$1:$BL$10,4,FALSE)","v":{"$error":"#REF!"}},{"$f":"S24-HLOOKUP(#REF!,Feuil1!$C$1:$BL$10,5,FALSE)","v":{"$error":"#REF!"}},{"$f":"S24-HLOOKUP(#REF!,Feuil1!$C$1:$BL$10,6,FALSE)","v":{"$error":"#REF!"}},{"$f":"S24-HLOOKUP(#REF!,Feuil1!$C$1:$BL$10,7,FALSE)","v":{"$error":"#REF!"}},{"$f":"S24-HLOOKUP(#REF!,Feuil1!$C$1:$BL$10,8,FALSE)","v":{"$error":"#REF!"}},{"$f":"S24-HLOOKUP(#REF!,Feuil1!$C$1:$BL$10,9,FALSE)","v":{"$error":"#REF!"}},{"$f":"S24-HLOOKUP(#REF!,Feuil1!$C$1:$BL$10,10,FALSE)","v":{"$error":"#REF!"}},null,null,null,null,null,null,{"$error":"#REF!"}]
[null,1,null,"H000098721","BARDIS","JEAN-BAPTISTE","CR Sport U Créteil","CRETEIL",null,87.1,140,145,150,150,160,null,null,160,310,null,null,null,"",null,null," ",{"$f":"S25-HLOOKUP(#REF!,Feuil1!$C$1:$BL$10,2,FALSE)","v":{"$error":"#REF!"}},{"$f":"S25-HLOOKUP(#REF!,Feuil1!$C$1:$BL$10,3,FALSE)","v":{"$error":"#REF!"}},{"$f":"S25-HLOOKUP(#REF!,Feuil1!$C$1:$BL$10,4,FALSE)","v":{"$error":"#REF!"}},{"$f":"S25-HLOOKUP(#REF!,Feuil1!$C$1:$BL$10,5,FALSE)","v":{"$error":"#REF!"}},{"$f":"S25-HLOOKUP(#REF!,Feuil1!$C$1:$BL$10,6,FALSE)","v":{"$error":"#REF!"}},{"$f":"S25-HLOOKUP(#REF!,Feuil1!$C$1:$BL$10,7,FALSE)","v":{"$error":"#REF!"}},{"$f":"S25-HLOOKUP(#REF!,Feuil1!$C$1:$BL$10,8,FALSE)","v":{"$error":"#REF!"}},{"$f":"S25-HLOOKUP(#REF!,Feuil1!$C$1:$BL$10,9,FALSE)","v":{"$error":"#REF!"}},{"$f":"S25-HLOOKUP(#REF!,Feuil1!$C$1:$BL$10,10,FALSE)","v":{"$error":"#REF!"}},null,null,null,null,null,null,{"$error":"#REF!"}]
[null,2,1,"LA0L093160","GOUDIN","CLEMENT","Faculte des Lettres et S.","LIMOGES",null,93.75,98,104,-110,104,125,130,-140,130,234,150,157.5,162.5,162.5,292.5,null," ",{"$f":"S26-HLOOKUP(#REF!,Feuil1!$C$1:$BL$10,2,FALSE)","v":{"$error":"#REF!"}},{"$f":"S26-HLOOKUP(#REF!,Feuil1!$C$1:$BL$10,3,FALSE)","v":{"$error":"#REF!"}},{"$f":"S26-HLOOKUP(#REF!,Feuil1!$C$1:$BL$10,4,FALSE)","v":{"$error":"#REF!"}},{"$f":"S26-HLOOKUP(#REF!,Feuil1!$C$1:$BL$10,5,FALSE)","v":{"$error":"#REF!"}},{"$f":"S26-HLOOKUP(#REF!,Feuil1!$C$1:$BL$10,6,FALSE)","v":{"$error":"#REF!"}},{"$f":"S26-HLOOKUP(#REF!,Feuil1!$C$1:$BL$10,7,FALSE)","v":{"$error":"#REF!"}},{"$f":"S26-HLOOKUP(#REF!,Feuil1!$C$1:$BL$10,8,FALSE)","v":{"$error":"#REF!"}},{"$f":"S26-HLOOKUP(#REF!,Feuil1!$C$1:$BL$10,9,FALSE)","v":{"$error":"#REF!"}},{"$f":"S26-HLOOKUP(#REF!,Feuil1!$C$1:$BL$10,10,FALSE)","v":{"$error":"#REF!"}},null,null,null,null,null,null,{"$error":"#REF!"}]
[null,null,4,"S500080317","BERDI","MIKAIL","UNIVERSITE PARIS DESCARTES","PARIS",null,90.1,null,null,null,null,85,90,-95,90,null,160,-165,-165,160,250,null," ",{"$f":"S27-HLOOKUP(#REF!,Feuil1!$C$1:$BL$10,2,FALSE)","v":{"$error":"#REF!"}},{"$f":"S27-HLOOKUP(#REF!,Feuil1!$C$1:$BL$10,3,FALSE)","v":{"$error":"#REF!"}},{"$f":"S27-HLOOKUP(#REF!,Feuil1!$C$1:$BL$10,4,FALSE)","v":{"$error":"#REF!"}},{"$f":"S27-HLOOKUP(#REF!,Feuil1!$C$1:$BL$10,5,FALSE)","v":{"$error":"#REF!"}},{"$f":"S27-HLOOKUP(#REF!,Feuil1!$C$1:$BL$10,6,FALSE)","v":{"$error":"#REF!"}},{"$f":"S27-HLOOKUP(#REF!,Feuil1!$C$1:$BL$10,7,FALSE)","v":{"$error":"#REF!"}},{"$f":"S27-HLOOKUP(#REF!,Feuil1!$C$1:$BL$10,8,FALSE)","v":{"$error":"#REF!"}},{"$f":"S27-HLOOKUP(#REF!,Feuil1!$C$1:$BL$10,9,FALSE)","v":{"$error":"#REF!"}},{"$f":"S27-HLOOKUP(#REF!,Feuil1!$C$1:$BL$10,10,FALSE)","v":{"$error":"#REF!"}},null,null,null,null,null,null,{"$error":"#REF!"}]
["+94kg",1,1,"B101001206","DUPONCHEL","ANTOINE","Université de Picardie","AMIENS",null,108.65,100,105,110,110,120,127,135,135,245,140,150,160,160,295,null," ",{"$f":"S28-HLOOKUP(#REF!,Feuil1!$C$1:$BL$10,2,FALSE)","v":{"$error":"#REF!"}},{"$f":"S28-HLOOKUP(#REF!,Feuil1!$C$1:$BL$10,3,FALSE)","v":{"$error":"#REF!"}},{"$f":"S28-HLOOKUP(#REF!,Feuil1!$C$1:$BL$10,4,FALSE)","v":{"$error":"#REF!"}},{"$f":"S28-HLOOKUP(#REF!,Feuil1!$C$1:$BL$10,5,FALSE)","v":{"$error":"#REF!"}},{"$f":"S28-HLOOKUP(#REF!,Feuil1!$C$1:$BL$10,6,FALSE)","v":{"$error":"#REF!"}},{"$f":"S28-HLOOKUP(#REF!,Feuil1!$C$1:$BL$10,7,FALSE)","v":{"$error":"#REF!"}},{"$f":"S28-HLOOKUP(#REF!,Feuil1!$C$1:$BL$10,8,FALSE)","v":{"$error":"#REF!"}},{"$f":"S28-HLOOKUP(#REF!,Feuil1!$C$1:$BL$10,9,FALSE)","v":{"$error":"#REF!"}},{"$f":"S28-HLOOKUP(#REF!,Feuil1!$C$1:$BL$10,10,FALSE)","v":{"$error":"#REF!"}},null,null,null,null,null,null,{"$error":"#REF!"}]
[null,null,2,"ZE00086131","EID","PETER","POLE UNIVERSITAIRE L.VINCI","VERSAILLES",null,101.5,null,null,null,null,90,-100,-100,90,null,160,-165,165,165,255,null," ",{"$f":"S29-HLOOKUP(#REF!,Feuil1!$C$1:$BL$10,2,FALSE)","v":{"$error":"#REF!"}},{"$f":"S29-HLOOKUP(#REF!,Feuil1!$C$1:$BL$10,3,FALSE)","v":{"$error":"#REF!"}},{"$f":"S29-HLOOKUP(#REF!,Feuil1!$C$1:$BL$10,4,FALSE)","v":{"$error":"#REF!"}},{"$f":"S29-HLOOKUP(#REF!,Feuil1!$C$1:$BL$10,5,FALSE)","v":{"$error":"#REF!"}},{"$f":"S29-HLOOKUP(#REF!,Feuil1!$C$1:$BL$10,6,FALSE)","v":{"$error":"#REF!"}},{"$f":"S29-HLOOKUP(#REF!,Feuil1!$C$1:$BL$10,7,FALSE)","v":{"$error":"#REF!"}},{"$f":"S29-HLOOKUP(#REF!,Feuil1!$C$1:$BL$10,8,FALSE)","v":{"$error":"#REF!"}},{"$f":"S29-HLOOKUP(#REF!,Feuil1!$C$1:$BL$10,9,FALSE)","v":{"$error":"#REF!"}},{"$f":"S29-HLOOKUP(#REF!,Feuil1!$C$1:$BL$10,10,FALSE)","v":{"$error":"#REF!"}},null,null,null,null,null,null,{"$error":"#REF!"}]
[]
[]
[]
[]
[]
[]
[]
[]
[]
[]
[]
[]
[]
[]
[]
[]
[]
[]
[]
[]
[]
[]
[]
[]
[]
[]
[]
[]
[]
[]
[]
[]
[]
[]
[]
[]
[]
[]
[]
[]
[]
[]
[]
[]
[]
[]
[]
[]
[]
[]
[]
[]
[]
[]
[]
[]
[]
[]
[]
[]
[]
[]
[]
[]
[]
[]
[]
[]
[]
[]
[]
[]
[]
[]
[]
[]
[]
[]
[]
[]
[]
[]
[]
[]
[]
[]
[]
[]
[]
[]
[]
[]
[]
[]
[]
[]
[]
[]
[]
[]
[]
[]
[]
[]
[]
[]
[]
[]
[]
[]
[]
[]
[]
[]
[]
[]
[]
[]
[]
[]
[]
[]
[]
[]
[]
[]
[]
[]
[]
[]
[]
[]
[]
[]
[]
[]
[]
[]
[]
[]
[]
[]
[]
[]
[]
[]
[]
[]
[]
[]
[]
[]
[]
[]
[]
[]
[]
[]
[]
[]
[]
[]
[]
[]
[]
[]
[]
[]
[]
[]
[]
[]
[]
[]
[]
[]
[]
[]
[]
[]
[]
[]
[]
[]
[]
[]
[]
[]
[]
[]
[]
[]
[]
[]
[]
[]
[]
[]
[]
[]
[]
[]
[]
[]
[]
[]
[]
[]
[]
[]
[]
[]
[]
[]
[]
[]
[]
[]
[]
[]
[]
[]
[]
[]
[]
[]
[]
[]
[]
[]
[]
[]
[]
[]
[]
[]
[]
[]
[]
[]
[]
[]
[]
[]
[]
[]
[]
[]
[]
[]
[]
[]
[]
[]
[]
[]
[]
[]
[]
[]
[]
[]
[]
[]
[]
[]
[]
[]
[]
[]
[]
[]
[]
[]
[]
[]
[]
[]
[]
[]
[]
[]
[]
[]
[]
[]
[]
[]
[]
[]
[]
[]
[]
[]
[]
[]
[]
[]
[]
[]
[]
[]
[]
[]
[]
[]
[]
[]
[]
[]
[]
[]
[]
[]
[]
[]
[]
[]
[]
[]
[]
[]
[]
[]
[]
[]
[]
[]
[]
[]
[]
[]
[]
[]
[]
[]
[]
[]
[]
[]
[]
[]
[]
[]
[]
[]
[]
[]
[]
[]
[]
[]
[]
[]
[]
[]
[]
[]
[]
[]
[]
[]
[]
[]
[]
[]
[]
[]
[]
[]
[]
[]
[]
[]
[]
[]
[]
[]
[]
[]
[]
[]
[]
[]
[]
[]
[]
[]
[]
[]
[]
[]
[]
[]
[]
[]
[]
[]
[]
[]
[]
[]
[]
[]
[]
[]
[]
[]
[]
[]
[]
[]
[]
[]
[]
[]
[]
[]
[]
[]
[]
[]
[]
[]
[]
[]
[]
[]
[]
[]
[]
[]
[]
[]
[]
[]
[]
[]
[]
[]
[]
[]
[]
[]
[]
[]
[]
[]
[]
[]
[]
[]
[]
[]
[]
[]
[]
[]
[]
[]
[]
[]
[]
[]
[]
[]
[]
[]
[]
[]
[]
[]
[]
[]
[]
[]
[]
[]
[]
[]
[]
[]
[]
[]
[]
[]
[]
[]
[]
[]
[]
[]
[]
[]
[]
[null,null,null,null,null,null,null,null,null,null,null,null,null,null,null,null,null,null,null,null,null,null,null,null,null,null,"J77","J85","J94","J105","J+105",null,"J56","J62","J69","J77","J85","J94","J105","J+105",null,"S56","S62","S69","S77","S85","S94","S105","S+105"]
[null,null,null,null,null,null,null,null,null,null,null,null,null,null,null,null,null,null,null,null,null,null,null,null,null,null,145,160,170,180,190,null,100,115,130,145,160,170,180,190,null,115,135,150,165,180,190,200,210]
[null,null,null,null,null,null,null,null,null,null,null,null,null,null,null,null,null,null,null,null,null,null,null,null,null,null,165,180,190,200,210,null,115,135,150,165,180,190,200,210,null,130,150,165,185,200,210,220,230]
[null,null,null,null,null,null,null,null,null,null,null,null,null,null,null,null,null,null,null,null,null,null,null,null,null,null,185,200,210,220,230,null,130,150,165,185,200,210,220,230,null,145,165,180,200,220,230,240,250]
[null,null,null,null,null,null,null,null,null,null,null,null,null,null,null,null,null,null,null,null,null,null,null,null,null,null,200,220,230,240,250,null,145,165,180,200,220,230,240,250,null,175,195,215,235,250,260,275,280]
[null,null,null,null,null,null,null,null,null,null,null,null,null,null,null,null,null,null,null,null,null,null,null,null,null,null,235,250,260,275,280,null,175,195,215,235,250,260,275,280,null,210,230,250,270,290,300,310,325]
[null,null,null,null,null,null,null,null,null,null,null,null,null,null,null,null,null,null,null,null,null,null,null,null,null,null,270,290,300,310,325,null,210,230,250,270,290,300,310,325,null,230,255,275,300,315,335,345,355]
[null,null,null,null,null,null,null,null,null,null,null,null,null,null,null,null,null,null,null,null,null,null,null,null,null,null,320,335,355,370,380,null,245,270,295,320,335,355,370,380,null,245,270,295,320,335,355,370,380]

{"sheet":"DC EQUIPE","index":3,"n_rows":55,"n_cols":18,"rows_kept":55,"cut":false,"hidden":false,"merged":[[49,0,54,0],[49,5,54,5],[49,6,54,6],[49,17,54,17],[37,2,42,2],[43,2,48,2],[49,2,54,2],[37,5,42,5],[37,6,42,6],[37,17,42,17],[43,0,48,0],[43,5,48,5],[43,6,48,6],[43,17,48,17],[25,2,30,2],[25,5,30,5],[25,6,30,6],[25,17,30,17],[31,0,36,0],[31,2,36,2],[31,5,36,5],[31,6,36,6],[31,17,36,17],[4,0,9,0],[10,0,15,0],[25,0,30,0],[37,0,42,0],[16,0,21,0],[16,17,21,17],[16,5,21,5],[16,6,21,6],[16,2,21,2],[0,10,0,14],[3,15,3,16],[0,3,0,6],[1,7,1,8],[4,5,9,5],[4,6,9,6],[4,17,9,17],[10,17,15,17],[4,2,9,2],[10,5,15,5],[10,6,15,6],[10,2,15,2]]}
[null,null,"EPREUVE :","DC PAR EQUIPE -CFU 2015",null,null,null,null,"DATE :",null,"2015-05-13"]
[null,null,"LIEU :",null,null,"CLERMONT L'HERAULT",null,"ZONE :",null,null,null,"SUD"]
[]
[null,"SEXE","Class.","NOM","PRENOM","AS","Académie","N°","POIDS DE CORPS","BR",2,3,4,"PERF.","POINTS IND.","CATEGORIE",null,"POINTS EQUIPE"]
["EQUIPE 1","F",1,"MORO","MARLENE","Université Montpellier STAPS","MONTPELLIER",1,55.2,null,52.5,55,-57.5,{"$f":"IF(H5=\"\",\"\",IF(MAXA(J5:M5)<=0,0,MAXA(J5:M5)))","v":55},{"$f":"IF(N5=\"\",0,N5-(I5/2))","v":27.4},{"$f":"IF(I5=\"\",\"\",IF(B5=\"H\",IF(OR(H5=\"SEN\",H5<1995),VLOOKUP(I5,[2]Feuil1!$A$11:$G$29,6),IF(AND(H5>1994,H5<1998),VLOOKUP(I5,[2]Feuil1!$A$11:$G$29,5),IF(AND(H5>1997,H5<2000),VLOOKUP(I5,[2]Feuil1!$A$11:$G$29,4),IF(AND(H5>1999,H5<2002),VLOOKUP(I5,[2]Feuil1!$A$11:$G$29,3),VLOOKUP(I5,[2]Feuil1!$A$11:$G$29,2))))),IF(OR(H5=\"SEN\",H5<1995),VLOOKUP(I5,[2]Feuil1!$G$11:$L$25,6),IF(AND(H5>1994,H5<1998),VLOOKUP(I5,[2]Feuil1!$G$11:$L$25,5),IF(AND(H5>1997,H5<2000),VLOOKUP(I5,[2]Feuil1!$G$11:$L$25,4),IF(AND(H5>1999,H5<2002),VLOOKUP(I5,[2]Feuil1!$G$11:$L$25,3),VLOOKUP(I5,[2]Feuil1!$G$11:$L$25,2)))))))","v":"FS58"},null,{"$f":"SUM(O5:O10)","v":253}]
[null,"F",null,"REGNIER","CLAIRE",null,null,2,64,55,60,62.5,65,65,{"$f":"IF(N6=\"\",0,N6-(I6/2))","v":33},{"$f":"IF(I6=\"\",\"\",IF(B6=\"H\",IF(OR(H6=\"SEN\",H6<1995),VLOOKUP(I6,[2]Feuil1!$A$11:$G$29,6),IF(AND(H6>1994,H6<1998),VLOOKUP(I6,[2]Feuil1!$A$11:$G$29,5),IF(AND(H6>1997,H6<2000),VLOOKUP(I6,[2]Feuil1!$A$11:$G$29,4),IF(AND(H6>1999,H6<2002),VLOOKUP(I6,[2]Feuil1!$A$11:$G$29,3),VLOOKUP(I6,[2]Feuil1!$A$11:$G$29,2))))),IF(OR(H6=\"SEN\",H6<1995),VLOOKUP(I6,[2]Feuil1!$G$11:$L$25,6),IF(AND(H6>1994,H6<1998),VLOOKUP(I6,[2]Feuil1!$G$11:$L$25,5),IF(AND(H6>1997,H6<2000),VLOOKUP(I6,[2]Feuil1!$G$11:$L$25,4),IF(AND(H6>1999,H6<2002),VLOOKUP(I6,[2]Feuil1!$G$11:$L$25,3),VLOOKUP(I6,[2]Feuil1!$G$11:$L$25,2)))))))","v":"FS69"}]
[null,"H",null,"VILLEBRUN","FLORENT",null,null,3,77.599999999999994,65,-110,110,-115,110,{"$f":"IF(N7=\"\",0,N7-(I7/1))","v":32.400000000000006},{"$f":"IF(I7=\"\",\"\",IF(B7=\"H\",IF(OR(H7=\"SEN\",H7<1995),VLOOKUP(I7,[2]Feuil1!$A$11:$G$29,6),IF(AND(H7>1994,H7<1998),VLOOKUP(I7,[2]Feuil1!$A$11:$G$29,5),IF(AND(H7>1997,H7<2000),VLOOKUP(I7,[2]Feuil1!$A$11:$G$29,4),IF(AND(H7>1999,H7<2002),VLOOKUP(I7,[2]Feuil1!$A$11:$G$29,3),VLOOKUP(I7,[2]Feuil1!$A$11:$G$29,2))))),IF(OR(H7=\"SEN\",H7<1995),VLOOKUP(I7,[2]Feuil1!$G$11:$L$25,6),IF(AND(H7>1994,H7<1998),VLOOKUP(I7,[2]Feuil1!$G$11:$L$25,5),IF(AND(H7>1997,H7<2000),VLOOKUP(I7,[2]Feuil1!$G$11:$L$25,4),IF(AND(H7>1999,H7<2002),VLOOKUP(I7,[2]Feuil1!$G$11:$L$25,3),VLOOKUP(I7,[2]Feuil1!$G$11:$L$25,2)))))))","v":"S85"}]
[null,"H",null,"CHANTI","NIDAL",null,null,4,77.5,110,120,125,-130,125,{"$f":"IF(N8=\"\",0,N8-(I8/1))","v":47.5},{"$f":"IF(I8=\"\",\"\",IF(B8=\"H\",IF(OR(H8=\"SEN\",H8<1995),VLOOKUP(I8,[2]Feuil1!$A$11:$G$29,6),IF(AND(H8>1994,H8<1998),VLOOKUP(I8,[2]Feuil1!$A$11:$G$29,5),IF(AND(H8>1997,H8<2000),VLOOKUP(I8,[2]Feuil1!$A$11:$G$29,4),IF(AND(H8>1999,H8<2002),VLOOKUP(I8,[2]Feuil1!$A$11:$G$29,3),VLOOKUP(I8,[2]Feuil1!$A$11:$G$29,2))))),IF(OR(H8=\"SEN\",H8<1995),VLOOKUP(I8,[2]Feuil1!$G$11:$L$25,6),IF(AND(H8>1994,H8<1998),VLOOKUP(I8,[2]Feuil1!$G$11:$L$25,5),IF(AND(H8>1997,H8<2000),VLOOKUP(I8,[2]Feuil1!$G$11:$L$25,4),IF(AND(H8>1999,H8<2002),VLOOKUP(I8,[2]Feuil1!$G$11:$L$25,3),VLOOKUP(I8,[2]Feuil1!$G$11:$L$25,2)))))))","v":"S85"}]
[null,"H",null,"SONETTI","RUDY",null,null,5,88.15,125,135,140,145,145,{"$f":"IF(N9=\"\",0,N9-(I9/1))","v":56.849999999999994},{"$f":"IF(I9=\"\",\"\",IF(B9=\"H\",IF(OR(H9=\"SEN\",H9<1995),VLOOKUP(I9,[2]Feuil1!$A$11:$G$29,6),IF(AND(H9>1994,H9<1998),VLOOKUP(I9,[2]Feuil1!$A$11:$G$29,5),IF(AND(H9>1997,H9<2000),VLOOKUP(I9,[2]Feuil1!$A$11:$G$29,4),IF(AND(H9>1999,H9<2002),VLOOKUP(I9,[2]Feuil1!$A$11:$G$29,3),VLOOKUP(I9,[2]Feuil1!$A$11:$G$29,2))))),IF(OR(H9=\"SEN\",H9<1995),VLOOKUP(I9,[2]Feuil1!$G$11:$L$25,6),IF(AND(H9>1994,H9<1998),VLOOKUP(I9,[2]Feuil1!$G$11:$L$25,5),IF(AND(H9>1997,H9<2000),VLOOKUP(I9,[2]Feuil1!$G$11:$L$25,4),IF(AND(H9>1999,H9<2002),VLOOKUP(I9,[2]Feuil1!$G$11:$L$25,3),VLOOKUP(I9,[2]Feuil1!$G$11:$L$25,2)))))))","v":"S94"}]
[null,"H",null,"DUCLOS","BENJAMIN",null,null,6,91.65,145,147.5,-150,-150,147.5,{"$f":"IF(N10=\"\",0,N10-(I10/1))","v":55.849999999999994},{"$f":"IF(I10=\"\",\"\",IF(B10=\"H\",IF(OR(H10=\"SEN\",H10<1995),VLOOKUP(I10,[2]Feuil1!$A$11:$G$29,6),IF(AND(H10>1994,H10<1998),VLOOKUP(I10,[2]Feuil1!$A$11:$G$29,5),IF(AND(H10>1997,H10<2000),VLOOKUP(I10,[2]Feuil1!$A$11:$G$29,4),IF(AND(H10>1999,H10<2002),VLOOKUP(I10,[2]Feuil1!$A$11:$G$29,3),VLOOKUP(I10,[2]Feuil1!$A$11:$G$29,2))))),IF(OR(H10=\"SEN\",H10<1995),VLOOKUP(I10,[2]Feuil1!$G$11:$L$25,6),IF(AND(H10>1994,H10<1998),VLOOKUP(I10,[2]Feuil1!$G$11:$L$25,5),IF(AND(H10>1997,H10<2000),VLOOKUP(I10,[2]Feuil1!$G$11:$L$25,4),IF(AND(H10>1999,H10<2002),VLOOKUP(I10,[2]Feuil1!$G$11:$L$25,3),VLOOKUP(I10,[2]Feuil1!$G$11:$L$25,2)))))))","v":"S94"}]
["EQUIPE 2","F",6,"TRAORE","MADOUSS","UNIVERSITE PARIS 13","CRETEIL",1,55.9,null,45,50,-55,{"$f":"IF(H11=\"\",\"\",IF(MAXA(J11:M11)<=0,0,MAXA(J11:M11)))","v":50},{"$f":"IF(N11=\"\",0,N11-(I11/2))","v":22.05},{"$f":"IF(I11=\"\",\"\",IF(B11=\"H\",IF(OR(H11=\"SEN\",H11<1995),VLOOKUP(I11,[2]Feuil1!$A$11:$G$29,6),IF(AND(H11>1994,H11<1998),VLOOKUP(I11,[2]Feuil1!$A$11:$G$29,5),IF(AND(H11>1997,H11<2000),VLOOKUP(I11,[2]Feuil1!$A$11:$G$29,4),IF(AND(H11>1999,H11<2002),VLOOKUP(I11,[2]Feuil1!$A$11:$G$29,3),VLOOKUP(I11,[2]Feuil1!$A$11:$G$29,2))))),IF(OR(H11=\"SEN\",H11<1995),VLOOKUP(I11,[2]Feuil1!$G$11:$L$25,6),IF(AND(H11>1994,H11<1998),VLOOKUP(I11,[2]Feuil1!$G$11:$L$25,5),IF(AND(H11>1997,H11<2000),VLOOKUP(I11,[2]Feuil1!$G$11:$L$25,4),IF(AND(H11>1999,H11<2002),VLOOKUP(I11,[2]Feuil1!$G$11:$L$25,3),VLOOKUP(I11,[2]Feuil1!$G$11:$L$25,2)))))))","v":"FS58"},null,{"$f":"SUM(O11:O16)","v":134}]
[null,"F",null,"N'WEDECK","JEANNETTE","UNIVERSITE PARIS 13","CRETEIL",2,73.3,50,55,-57.5,-57.5,55,{"$f":"IF(N12=\"\",0,N12-(I12/2))","v":18.350000000000001},{"$f":"IF(I12=\"\",\"\",IF(B12=\"H\",IF(OR(H12=\"SEN\",H12<1995),VLOOKUP(I12,[2]Feuil1!$A$11:$G$29,6),IF(AND(H12>1994,H12<1998),VLOOKUP(I12,[2]Feuil1!$A$11:$G$29,5),IF(AND(H12>1997,H12<2000),VLOOKUP(I12,[2]Feuil1!$A$11:$G$29,4),IF(AND(H12>1999,H12<2002),VLOOKUP(I12,[2]Feuil1!$A$11:$G$29,3),VLOOKUP(I12,[2]Feuil1!$A$11:$G$29,2))))),IF(OR(H12=\"SEN\",H12<1995),VLOOKUP(I12,[2]Feuil1!$G$11:$L$25,6),IF(AND(H12>1994,H12<1998),VLOOKUP(I12,[2]Feuil1!$G$11:$L$25,5),IF(AND(H12>1997,H12<2000),VLOOKUP(I12,[2]Feuil1!$G$11:$L$25,4),IF(AND(H12>1999,H12<2002),VLOOKUP(I12,[2]Feuil1!$G$11:$L$25,3),VLOOKUP(I12,[2]Feuil1!$G$11:$L$25,2)))))))","v":"FS75"}]
[null,"H",null,"ARULENTHY","ETHAN","UNIVERSITE PARIS 13","CRETEIL",3,65.400000000000006,55,-70,75,-77.5,75,{"$f":"IF(N13=\"\",0,N13-(I13/1))","v":9.5999999999999943},{"$f":"IF(I13=\"\",\"\",IF(B13=\"H\",IF(OR(H13=\"SEN\",H13<1995),VLOOKUP(I13,[2]Feuil1!$A$11:$G$29,6),IF(AND(H13>1994,H13<1998),VLOOKUP(I13,[2]Feuil1!$A$11:$G$29,5),IF(AND(H13>1997,H13<2000),VLOOKUP(I13,[2]Feuil1!$A$11:$G$29,4),IF(AND(H13>1999,H13<2002),VLOOKUP(I13,[2]Feuil1!$A$11:$G$29,3),VLOOKUP(I13,[2]Feuil1!$A$11:$G$29,2))))),IF(OR(H13=\"SEN\",H13<1995),VLOOKUP(I13,[2]Feuil1!$G$11:$L$25,6),IF(AND(H13>1994,H13<1998),VLOOKUP(I13,[2]Feuil1!$G$11:$L$25,5),IF(AND(H13>1997,H13<2000),VLOOKUP(I13,[2]Feuil1!$G$11:$L$25,4),IF(AND(H13>1999,H13<2002),VLOOKUP(I13,[2]Feuil1!$G$11:$L$25,3),VLOOKUP(I13,[2]Feuil1!$G$11:$L$25,2)))))))","v":"S69"}]
[null,"H",null,"PIES","KEVIN","UNIVERSITE PARIS 13","CRETEIL",4,82.85,75,85,87.5,92.5,92.5,{"$f":"IF(N14=\"\",0,N14-(I14/1))","v":9.6500000000000057},{"$f":"IF(I14=\"\",\"\",IF(B14=\"H\",IF(OR(H14=\"SEN\",H14<1995),VLOOKUP(I14,[2]Feuil1!$A$11:$G$29,6),IF(AND(H14>1994,H14<1998),VLOOKUP(I14,[2]Feuil1!$A$11:$G$29,5),IF(AND(H14>1997,H14<2000),VLOOKUP(I14,[2]Feuil1!$A$11:$G$29,4),IF(AND(H14>1999,H14<2002),VLOOKUP(I14,[2]Feuil1!$A$11:$G$29,3),VLOOKUP(I14,[2]Feuil1!$A$11:$G$29,2))))),IF(OR(H14=\"SEN\",H14<1995),VLOOKUP(I14,[2]Feuil1!$G$11:$L$25,6),IF(AND(H14>1994,H14<1998),VLOOKUP(I14,[2]Feuil1!$G$11:$L$25,5),IF(AND(H14>1997,H14<2000),VLOOKUP(I14,[2]Feuil1!$G$11:$L$25,4),IF(AND(H14>1999,H14<2002),VLOOKUP(I14,[2]Feuil1!$G$11:$L$25,3),VLOOKUP(I14,[2]Feuil1!$G$11:$L$25,2)))))))","v":"S85"}]
[null,"H",null,"MAHASSINE","ADBDURAHMAN","UNIVERSITE PARIS 13","CRETEIL",5,81.2,92.5,110,-115,115,115,33.799999999999997,{"$f":"IF(I15=\"\",\"\",IF(B15=\"H\",IF(OR(H15=\"SEN\",H15<1995),VLOOKUP(I15,[2]Feuil1!$A$11:$G$29,6),IF(AND(H15>1994,H15<1998),VLOOKUP(I15,[2]Feuil1!$A$11:$G$29,5),IF(AND(H15>1997,H15<2000),VLOOKUP(I15,[2]Feuil1!$A$11:$G$29,4),IF(AND(H15>1999,H15<2002),VLOOKUP(I15,[2]Feuil1!$A$11:$G$29,3),VLOOKUP(I15,[2]Feuil1!$A$11:$G$29,2))))),IF(OR(H15=\"SEN\",H15<1995),VLOOKUP(I15,[2]Feuil1!$G$11:$L$25,6),IF(AND(H15>1994,H15<1998),VLOOKUP(I15,[2]Feuil1!$G$11:$L$25,5),IF(AND(H15>1997,H15<2000),VLOOKUP(I15,[2]Feuil1!$G$11:$L$25,4),IF(AND(H15>1999,H15<2002),VLOOKUP(I15,[2]Feuil1!$G$11:$L$25,3),VLOOKUP(I15,[2]Feuil1!$G$11:$L$25,2)))))))","v":"S85"}]
[null,"H",null,"FADIGA","ABDOUL AZIZ","UNIVERSITE PARIS 13","CRETEIL",6,79.45,115,120,-125,-125,120,40.549999999999997,{"$f":"IF(I16=\"\",\"\",IF(B16=\"H\",IF(OR(H16=\"SEN\",H16<1995),VLOOKUP(I16,[2]Feuil1!$A$11:$G$29,6),IF(AND(H16>1994,H16<1998),VLOOKUP(I16,[2]Feuil1!$A$11:$G$29,5),IF(AND(H16>1997,H16<2000),VLOOKUP(I16,[2]Feuil1!$A$11:$G$29,4),IF(AND(H16>1999,H16<2002),VLOOKUP(I16,[2]Feuil1!$A$11:$G$29,3),VLOOKUP(I16,[2]Feuil1!$A$11:$G$29,2))))),IF(OR(H16=\"SEN\",H16<1995),VLOOKUP(I16,[2]Feuil1!$G$11:$L$25,6),IF(AND(H16>1994,H16<1998),VLOOKUP(I16,[2]Feuil1!$G$11:$L$25,5),IF(AND(H16>1997,H16<2000),VLOOKUP(I16,[2]Feuil1!$G$11:$L$25,4),IF(AND(H16>1999,H16<2002),VLOOKUP(I16,[2]Feuil1!$G$11:$L$25,3),VLOOKUP(I16,[2]Feuil1!$G$11:$L$25,2)))))))","v":"S85"}]
["EQUIPE 3","F",3,"RIMBERT","VANESSA","Université de Picardie","AMIENS",1,55.4,null,42.5,-45,-45,{"$f":"IF(H17=\"\",\"\",IF(MAXA(J17:M17)<=0,0,MAXA(J17:M17)))","v":42.5},{"$f":"IF(N17=\"\",0,N17-(I17/2))","v":14.8},{"$f":"IF(I17=\"\",\"\",IF(B17=\"H\",IF(OR(H17=\"SEN\",H17<1995),VLOOKUP(I17,[2]Feuil1!$A$11:$G$29,6),IF(AND(H17>1994,H17<1998),VLOOKUP(I17,[2]Feuil1!$A$11:$G$29,5),IF(AND(H17>1997,H17<2000),VLOOKUP(I17,[2]Feuil1!$A$11:$G$29,4),IF(AND(H17>1999,H17<2002),VLOOKUP(I17,[2]Feuil1!$A$11:$G$29,3),VLOOKUP(I17,[2]Feuil1!$A$11:$G$29,2))))),IF(OR(H17=\"SEN\",H17<1995),VLOOKUP(I17,[2]Feuil1!$G$11:$L$25,6),IF(AND(H17>1994,H17<1998),VLOOKUP(I17,[2]Feuil1!$G$11:$L$25,5),IF(AND(H17>1997,H17<2000),VLOOKUP(I17,[2]Feuil1!$G$11:$L$25,4),IF(AND(H17>1999,H17<2002),VLOOKUP(I17,[2]Feuil1!$G$11:$L$25,3),VLOOKUP(I17,[2]Feuil1!$G$11:$L$25,2)))))))","v":"FS58"},null,{"$f":"SUM(O17:O22)","v":238.3}]
[null,"F",null,"JOURNO","DELPHINE",null,null,2,59.6,42.5,50,-52.5,-52.5,50,{"$f":"IF(N18=\"\",0,N18-(I18/2))","v":20.2},{"$f":"IF(I18=\"\",\"\",IF(B18=\"H\",IF(OR(H18=\"SEN\",H18<1995),VLOOKUP(I18,[2]Feuil1!$A$11:$G$29,6),IF(AND(H18>1994,H18<1998),VLOOKUP(I18,[2]Feuil1!$A$11:$G$29,5),IF(AND(H18>1997,H18<2000),VLOOKUP(I18,[2]Feuil1!$A$11:$G$29,4),IF(AND(H18>1999,H18<2002),VLOOKUP(I18,[2]Feuil1!$A$11:$G$29,3),VLOOKUP(I18,[2]Feuil1!$A$11:$G$29,2))))),IF(OR(H18=\"SEN\",H18<1995),VLOOKUP(I18,[2]Feuil1!$G$11:$L$25,6),IF(AND(H18>1994,H18<1998),VLOOKUP(I18,[2]Feuil1!$G$11:$L$25,5),IF(AND(H18>1997,H18<2000),VLOOKUP(I18,[2]Feuil1!$G$11:$L$25,4),IF(AND(H18>1999,H18<2002),VLOOKUP(I18,[2]Feuil1!$G$11:$L$25,3),VLOOKUP(I18,[2]Feuil1!$G$11:$L$25,2)))))))","v":"FS63"}]
[null,"H",null,"OBEL","ALEXANDRE",null,null,3,69,50,110,115,120,{"$f":"IF(H19=\"\",\"\",IF(MAXA(J19:M19)<=0,0,MAXA(J19:M19)))","v":120},{"$f":"IF(N19=\"\",0,N19-(I19/1))","v":51},{"$f":"IF(I19=\"\",\"\",IF(B19=\"H\",IF(OR(H19=\"SEN\",H19<1995),VLOOKUP(I19,[2]Feuil1!$A$11:$G$29,6),IF(AND(H19>1994,H19<1998),VLOOKUP(I19,[2]Feuil1!$A$11:$G$29,5),IF(AND(H19>1997,H19<2000),VLOOKUP(I19,[2]Feuil1!$A$11:$G$29,4),IF(AND(H19>1999,H19<2002),VLOOKUP(I19,[2]Feuil1!$A$11:$G$29,3),VLOOKUP(I19,[2]Feuil1!$A$11:$G$29,2))))),IF(OR(H19=\"SEN\",H19<1995),VLOOKUP(I19,[2]Feuil1!$G$11:$L$25,6),IF(AND(H19>1994,H19<1998),VLOOKUP(I19,[2]Feuil1!$G$11:$L$25,5),IF(AND(H19>1997,H19<2000),VLOOKUP(I19,[2]Feuil1!$G$11:$L$25,4),IF(AND(H19>1999,H19<2002),VLOOKUP(I19,[2]Feuil1!$G$11:$L$25,3),VLOOKUP(I19,[2]Feuil1!$G$11:$L$25,2)))))))","v":"S69"}]
[null,"H",null,"ZIG","WESLEY",null,null,4,77.7,120,125,127.5,-130,{"$f":"IF(H20=\"\",\"\",IF(MAXA(J20:M20)<=0,0,MAXA(J20:M20)))","v":127.5},49.8,{"$f":"IF(I20=\"\",\"\",IF(B20=\"H\",IF(OR(H20=\"SEN\",H20<1995),VLOOKUP(I20,[2]Feuil1!$A$11:$G$29,6),IF(AND(H20>1994,H20<1998),VLOOKUP(I20,[2]Feuil1!$A$11:$G$29,5),IF(AND(H20>1997,H20<2000),VLOOKUP(I20,[2]Feuil1!$A$11:$G$29,4),IF(AND(H20>1999,H20<2002),VLOOKUP(I20,[2]Feuil1!$A$11:$G$29,3),VLOOKUP(I20,[2]Feuil1!$A$11:$G$29,2))))),IF(OR(H20=\"SEN\",H20<1995),VLOOKUP(I20,[2]Feuil1!$G$11:$L$25,6),IF(AND(H20>1994,H20<1998),VLOOKUP(I20,[2]Feuil1!$G$11:$L$25,5),IF(AND(H20>1997,H20<2000),VLOOKUP(I20,[2]Feuil1!$G$11:$L$25,4),IF(AND(H20>1999,H20<2002),VLOOKUP(I20,[2]Feuil1!$G$11:$L$25,3),VLOOKUP(I20,[2]Feuil1!$G$11:$L$25,2)))))))","v":"S85"}]
[null,"H",null,"VALLEE","SYLVAIN",null,null,5,94.75,127.5,135,140,145,{"$f":"IF(H21=\"\",\"\",IF(MAXA(J21:M21)<=0,0,MAXA(J21:M21)))","v":145},50.25,{"$f":"IF(I21=\"\",\"\",IF(B21=\"H\",IF(OR(H21=\"SEN\",H21<1995),VLOOKUP(I21,[2]Feuil1!$A$11:$G$29,6),IF(AND(H21>1994,H21<1998),VLOOKUP(I21,[2]Feuil1!$A$11:$G$29,5),IF(AND(H21>1997,H21<2000),VLOOKUP(I21,[2]Feuil1!$A$11:$G$29,4),IF(AND(H21>1999,H21<2002),VLOOKUP(I21,[2]Feuil1!$A$11:$G$29,3),VLOOKUP(I21,[2]Feuil1!$A$11:$G$29,2))))),IF(OR(H21=\"SEN\",H21<1995),VLOOKUP(I21,[2]Feuil1!$G$11:$L$25,6),IF(AND(H21>1994,H21<1998),VLOOKUP(I21,[2]Feuil1!$G$11:$L$25,5),IF(AND(H21>1997,H21<2000),VLOOKUP(I21,[2]Feuil1!$G$11:$L$25,4),IF(AND(H21>1999,H21<2002),VLOOKUP(I21,[2]Feuil1!$G$11:$L$25,3),VLOOKUP(I21,[2]Feuil1!$G$11:$L$25,2)))))))","v":"S105"}]
[null,"H",null,"DUPONCHEL","Antoine",null,null,6,107.75,145,160,-165,-165,{"$f":"IF(H22=\"\",\"\",IF(MAXA(J22:M22)<=0,0,MAXA(J22:M22)))","v":160},52.25,{"$f":"IF(I22=\"\",\"\",IF(B22=\"H\",IF(OR(H22=\"SEN\",H22<1995),VLOOKUP(I22,[2]Feuil1!$A$11:$G$29,6),IF(AND(H22>1994,H22<1998),VLOOKUP(I22,[2]Feuil1!$A$11:$G$29,5),IF(AND(H22>1997,H22<2000),VLOOKUP(I22,[2]Feuil1!$A$11:$G$29,4),IF(AND(H22>1999,H22<2002),VLOOKUP(I22,[2]Feuil1!$A$11:$G$29,3),VLOOKUP(I22,[2]Feuil1!$A$11:$G$29,2))))),IF(OR(H22=\"SEN\",H22<1995),VLOOKUP(I22,[2]Feuil1!$G$11:$L$25,6),IF(AND(H22>1994,H22<1998),VLOOKUP(I22,[2]Feuil1!$G$11:$L$25,5),IF(AND(H22>1997,H22<2000),VLOOKUP(I22,[2]Feuil1!$G$11:$L$25,4),IF(AND(H22>1999,H22<2002),VLOOKUP(I22,[2]Feuil1!$G$11:$L$25,3),VLOOKUP(I22,[2]Feuil1!$G$11:$L$25,2)))))))","v":"S+105"}]
["EQUIPE 4","H",null,"CHANTI","NIDAL","POLE UNIVERSITAIRE L.VINCI","VERSAILLES",4,77.5,"*120",null,null,null,{"$f":"IF(H23=\"\",\"\",IF(MAXA(J23:M23)<=0,0,MAXA(J23:M23)))","v":0},-77.5,{"$f":"IF(I23=\"\",\"\",IF(B23=\"H\",IF(OR(H23=\"SEN\",H23<1995),VLOOKUP(I23,[2]Feuil1!$A$11:$G$29,6),IF(AND(H23>1994,H23<1998),VLOOKUP(I23,[2]Feuil1!$A$11:$G$29,5),IF(AND(H23>1997,H23<2000),VLOOKUP(I23,[2]Feuil1!$A$11:$G$29,4),IF(AND(H23>1999,H23<2002),VLOOKUP(I23,[2]Feuil1!$A$11:$G$29,3),VLOOKUP(I23,[2]Feuil1!$A$11:$G$29,2))))),IF(OR(H23=\"SEN\",H23<1995),VLOOKUP(I23,[2]Feuil1!$G$11:$L$25,6),IF(AND(H23>1994,H23<1998),VLOOKUP(I23,[2]Feuil1!$G$11:$L$25,5),IF(AND(H23>1997,H23<2000),VLOOKUP(I23,[2]Feuil1!$G$11:$L$25,4),IF(AND(H23>1999,H23<2002),VLOOKUP(I23,[2]Feuil1!$G$11:$L$25,3),VLOOKUP(I23,[2]Feuil1!$G$11:$L$25,2)))))))","v":"S85"},null,{"$f":"SUM(O23:O28)","v":-387.29999999999995}]
[null,"H",null,"SONETTI","RUDY",null,null,5,88.15,"*127,5",null,null,null,0,-88.15,{"$f":"IF(I24=\"\",\"\",IF(B24=\"H\",IF(OR(H24=\"SEN\",H24<1995),VLOOKUP(I24,[2]Feuil1!$A$11:$G$29,6),IF(AND(H24>1994,H24<1998),VLOOKUP(I24,[2]Feuil1!$A$11:$G$29,5),IF(AND(H24>1997,H24<2000),VLOOKUP(I24,[2]Feuil1!$A$11:$G$29,4),IF(AND(H24>1999,H24<2002),VLOOKUP(I24,[2]Feuil1!$A$11:$G$29,3),VLOOKUP(I24,[2]Feuil1!$A$11:$G$29,2))))),IF(OR(H24=\"SEN\",H24<1995),VLOOKUP(I24,[2]Feuil1!$G$11:$L$25,6),IF(AND(H24>1994,H24<1998),VLOOKUP(I24,[2]Feuil1!$G$11:$L$25,5),IF(AND(H24>1997,H24<2000),VLOOKUP(I24,[2]Feuil1!$G$11:$L$25,4),IF(AND(H24>1999,H24<2002),VLOOKUP(I24,[2]Feuil1!$G$11:$L$25,3),VLOOKUP(I24,[2]Feuil1!$G$11:$L$25,2)))))))","v":"S94"}]
[null,"H",null,"DUCLOS","BENJAMIN",null,null,6,91.65,"*145",null,null,null,0,-91.65,{"$f":"IF(I25=\"\",\"\",IF(B25=\"H\",IF(OR(H25=\"SEN\",H25<1995),VLOOKUP(I25,[2]Feuil1!$A$11:$G$29,6),IF(AND(H25>1994,H25<1998),VLOOKUP(I25,[2]Feuil1!$A$11:$G$29,5),IF(AND(H25>1997,H25<2000),VLOOKUP(I25,[2]Feuil1!$A$11:$G$29,4),IF(AND(H25>1999,H25<2002),VLOOKUP(I25,[2]Feuil1!$A$11:$G$29,3),VLOOKUP(I25,[2]Feuil1!$A$11:$G$29,2))))),IF(OR(H25=\"SEN\",H25<1995),VLOOKUP(I25,[2]Feuil1!$G$11:$L$25,6),IF(AND(H25>1994,H25<1998),VLOOKUP(I25,[2]Feuil1!$G$11:$L$25,5),IF(AND(H25>1997,H25<2000),VLOOKUP(I25,[2]Feuil1!$G$11:$L$25,4),IF(AND(H25>1999,H25<2002),VLOOKUP(I25,[2]Feuil1!$G$11:$L$25,3),VLOOKUP(I25,[2]Feuil1!$G$11:$L$25,2)))))))","v":"S94"}]
["EQUIPE 2","F",null,"TRAORE","MADOUSS","UNIVERSITE PARIS 13","CRETEIL",1,55.9,null,"*45",null,null,0,{"$f":"IF(N26=\"\",0,N26-(I26/2))","v":-27.95},{"$f":"IF(I26=\"\",\"\",IF(B26=\"H\",IF(OR(H26=\"SEN\",H26<1995),VLOOKUP(I26,[2]Feuil1!$A$11:$G$29,6),IF(AND(H26>1994,H26<1998),VLOOKUP(I26,[2]Feuil1!$A$11:$G$29,5),IF(AND(H26>1997,H26<2000),VLOOKUP(I26,[2]Feuil1!$A$11:$G$29,4),IF(AND(H26>1999,H26<2002),VLOOKUP(I26,[2]Feuil1!$A$11:$G$29,3),VLOOKUP(I26,[2]Feuil1!$A$11:$G$29,2))))),IF(OR(H26=\"SEN\",H26<1995),VLOOKUP(I26,[2]Feuil1!$G$11:$L$25,6),IF(AND(H26>1994,H26<1998),VLOOKUP(I26,[2]Feuil1!$G$11:$L$25,5),IF(AND(H26>1997,H26<2000),VLOOKUP(I26,[2]Feuil1!$G$11:$L$25,4),IF(AND(H26>1999,H26<2002),VLOOKUP(I26,[2]Feuil1!$G$11:$L$25,3),VLOOKUP(I26,[2]Feuil1!$G$11:$L$25,2)))))))","v":"FS58"},null,{"$f":"SUM(O26:O31)","v":-373.5}]
[null,"F",null,"DECIMUS","ALMANESE","UNIVERSITE PARIS 13","CRETEIL",2,73.3,"*55",null,null,null,0,{"$f":"IF(N27=\"\",0,N27-(I27/2))","v":-36.65},{"$f":"IF(I27=\"\",\"\",IF(B27=\"H\",IF(OR(H27=\"SEN\",H27<1995),VLOOKUP(I27,[2]Feuil1!$A$11:$G$29,6),IF(AND(H27>1994,H27<1998),VLOOKUP(I27,[2]Feuil1!$A$11:$G$29,5),IF(AND(H27>1997,H27<2000),VLOOKUP(I27,[2]Feuil1!$A$11:$G$29,4),IF(AND(H27>1999,H27<2002),VLOOKUP(I27,[2]Feuil1!$A$11:$G$29,3),VLOOKUP(I27,[2]Feuil1!$A$11:$G$29,2))))),IF(OR(H27=\"SEN\",H27<1995),VLOOKUP(I27,[2]Feuil1!$G$11:$L$25,6),IF(AND(H27>1994,H27<1998),VLOOKUP(I27,[2]Feuil1!$G$11:$L$25,5),IF(AND(H27>1997,H27<2000),VLOOKUP(I27,[2]Feuil1!$G$11:$L$25,4),IF(AND(H27>1999,H27<2002),VLOOKUP(I27,[2]Feuil1!$G$11:$L$25,3),VLOOKUP(I27,[2]Feuil1!$G$11:$L$25,2)))))))","v":"FS75"}]
[null,"H",null,"ARULENTHY","ETHAN","UNIVERSITE PARIS 13","CRETEIL",3,65.400000000000006,"*75",null,null,null,0,{"$f":"IF(N28=\"\",0,N28-(I28/1))","v":-65.400000000000006},{"$f":"IF(I28=\"\",\"\",IF(B28=\"H\",IF(OR(H28=\"SEN\",H28<1995),VLOOKUP(I28,[2]Feuil1!$A$11:$G$29,6),IF(AND(H28>1994,H28<1998),VLOOKUP(I28,[2]Feuil1!$A$11:$G$29,5),IF(AND(H28>1997,H28<2000),VLOOKUP(I28,[2]Feuil1!$A$11:$G$29,4),IF(AND(H28>1999,H28<2002),VLOOKUP(I28,[2]Feuil1!$A$11:$G$29,3),VLOOKUP(I28,[2]Feuil1!$A$11:$G$29,2))))),IF(OR(H28=\"SEN\",H28<1995),VLOOKUP(I28,[2]Feuil1!$G$11:$L$25,6),IF(AND(H28>1994,H28<1998),VLOOKUP(I28,[2]Feuil1!$G$11:$L$25,5),IF(AND(H28>1997,H28<2000),VLOOKUP(I28,[2]Feuil1!$G$11:$L$25,4),IF(AND(H28>1999,H28<2002),VLOOKUP(I28,[2]Feuil1!$G$11:$L$25,3),VLOOKUP(I28,[2]Feuil1!$G$11:$L$25,2)))))))","v":"S69"}]
[null,"H",null,"PIES","KEVIN","UNIVERSITE PARIS 13","CRETEIL",4,82.85,"*85",null,null,null,0,{"$f":"IF(N29=\"\",0,N29-(I29/1))","v":-82.85},{"$f":"IF(I29=\"\",\"\",IF(B29=\"H\",IF(OR(H29=\"SEN\",H29<1995),VLOOKUP(I29,[2]Feuil1!$A$11:$G$29,6),IF(AND(H29>1994,H29<1998),VLOOKUP(I29,[2]Feuil1!$A$11:$G$29,5),IF(AND(H29>1997,H29<2000),VLOOKUP(I29,[2]Feuil1!$A$11:$G$29,4),IF(AND(H29>1999,H29<2002),VLOOKUP(I29,[2]Feuil1!$A$11:$G$29,3),VLOOKUP(I29,[2]Feuil1!$A$11:$G$29,2))))),IF(OR(H29=\"SEN\",H29<1995),VLOOKUP(I29,[2]Feuil1!$G$11:$L$25,6),IF(AND(H29>1994,H29<1998),VLOOKUP(I29,[2]Feuil1!$G$11:$L$25,5),IF(AND(H29>1997,H29<2000),VLOOKUP(I29,[2]Feuil1!$G$11:$L$25,4),IF(AND(H29>1999,H29<2002),VLOOKUP(I29,[2]Feuil1!$G$11:$L$25,3),VLOOKUP(I29,[2]Feuil1!$G$11:$L$25,2)))))))","v":"S85"}]
[null,"H",null,"MAHASSINE","ADBDURAHMAN","UNIVERSITE PARIS 13","CRETEIL",5,81.2,"*110",null,null,null,0,-81.2,{"$f":"IF(I30=\"\",\"\",IF(B30=\"H\",IF(OR(H30=\"SEN\",H30<1995),VLOOKUP(I30,[2]Feuil1!$A$11:$G$29,6),IF(AND(H30>1994,H30<1998),VLOOKUP(I30,[2]Feuil1!$A$11:$G$29,5),IF(AND(H30>1997,H30<2000),VLOOKUP(I30,[2]Feuil1!$A$11:$G$29,4),IF(AND(H30>1999,H30<2002),VLOOKUP(I30,[2]Feuil1!$A$11:$G$29,3),VLOOKUP(I30,[2]Feuil1!$A$11:$G$29,2))))),IF(OR(H30=\"SEN\",H30<1995),VLOOKUP(I30,[2]Feuil1!$G$11:$L$25,6),IF(AND(H30>1994,H30<1998),VLOOKUP(I30,[2]Feuil1!$G$11:$L$25,5),IF(AND(H30>1997,H30<2000),VLOOKUP(I30,[2]Feuil1!$G$11:$L$25,4),IF(AND(H30>1999,H30<2002),VLOOKUP(I30,[2]Feuil1!$G$11:$L$25,3),VLOOKUP(I30,[2]Feuil1!$G$11:$L$25,2)))))))","v":"S85"}]
[null,"H",null,"FADIGA","ABDOUL AZIZ","UNIVERSITE PARIS 13","CRETEIL",6,79.45,"*115",null,null,null,0,-79.45,{"$f":"IF(I31=\"\",\"\",IF(B31=\"H\",IF(OR(H31=\"SEN\",H31<1995),VLOOKUP(I31,[2]Feuil1!$A$11:$G$29,6),IF(AND(H31>1994,H31<1998),VLOOKUP(I31,[2]Feuil1!$A$11:$G$29,5),IF(AND(H31>1997,H31<2000),VLOOKUP(I31,[2]Feuil1!$A$11:$G$29,4),IF(AND(H31>1999,H31<2002),VLOOKUP(I31,[2]Feuil1!$A$11:$G$29,3),VLOOKUP(I31,[2]Feuil1!$A$11:$G$29,2))))),IF(OR(H31=\"SEN\",H31<1995),VLOOKUP(I31,[2]Feuil1!$G$11:$L$25,6),IF(AND(H31>1994,H31<1998),VLOOKUP(I31,[2]Feuil1!$G$11:$L$25,5),IF(AND(H31>1997,H31<2000),VLOOKUP(I31,[2]Feuil1!$G$11:$L$25,4),IF(AND(H31>1999,H31<2002),VLOOKUP(I31,[2]Feuil1!$G$11:$L$25,3),VLOOKUP(I31,[2]Feuil1!$G$11:$L$25,2)))))))","v":"S85"}]
["EQUIPE 3","F",null,"RIMBERT","VANESSA","Université de Picardie","AMIENS",1,55.4,null,"*42,5",null,null,0,{"$f":"IF(N32=\"\",0,N32-(I32/2))","v":-27.7},{"$f":"IF(I32=\"\",\"\",IF(B32=\"H\",IF(OR(H32=\"SEN\",H32<1995),VLOOKUP(I32,[2]Feuil1!$A$11:$G$29,6),IF(AND(H32>1994,H32<1998),VLOOKUP(I32,[2]Feuil1!$A$11:$G$29,5),IF(AND(H32>1997,H32<2000),VLOOKUP(I32,[2]Feuil1!$A$11:$G$29,4),IF(AND(H32>1999,H32<2002),VLOOKUP(I32,[2]Feuil1!$A$11:$G$29,3),VLOOKUP(I32,[2]Feuil1!$A$11:$G$29,2))))),IF(OR(H32=\"SEN\",H32<1995),VLOOKUP(I32,[2]Feuil1!$G$11:$L$25,6),IF(AND(H32>1994,H32<1998),VLOOKUP(I32,[2]Feuil1!$G$11:$L$25,5),IF(AND(H32>1997,H32<2000),VLOOKUP(I32,[2]Feuil1!$G$11:$L$25,4),IF(AND(H32>1999,H32<2002),VLOOKUP(I32,[2]Feuil1!$G$11:$L$25,3),VLOOKUP(I32,[2]Feuil1!$G$11:$L$25,2)))))))","v":"FS58"},null,{"$f":"SUM(O32:O37)","v":-406.7}]
[null,"F",null,"JOURNO","DELPHINE",null,null,2,59.6,"*50",null,null,null,0,{"$f":"IF(N33=\"\",0,N33-(I33/2))","v":-29.8},{"$f":"IF(I33=\"\",\"\",IF(B33=\"H\",IF(OR(H33=\"SEN\",H33<1995),VLOOKUP(I33,[2]Feuil1!$A$11:$G$29,6),IF(AND(H33>1994,H33<1998),VLOOKUP(I33,[2]Feuil1!$A$11:$G$29,5),IF(AND(H33>1997,H33<2000),VLOOKUP(I33,[2]Feuil1!$A$11:$G$29,4),IF(AND(H33>1999,H33<2002),VLOOKUP(I33,[2]Feuil1!$A$11:$G$29,3),VLOOKUP(I33,[2]Feuil1!$A$11:$G$29,2))))),IF(OR(H33=\"SEN\",H33<1995),VLOOKUP(I33,[2]Feuil1!$G$11:$L$25,6),IF(AND(H33>1994,H33<1998),VLOOKUP(I33,[2]Feuil1!$G$11:$L$25,5),IF(AND(H33>1997,H33<2000),VLOOKUP(I33,[2]Feuil1!$G$11:$L$25,4),IF(AND(H33>1999,H33<2002),VLOOKUP(I33,[2]Feuil1!$G$11:$L$25,3),VLOOKUP(I33,[2]Feuil1!$G$11:$L$25,2)))))))","v":"FS63"}]
[null,"H",null,"OBEL","ALEXANDRE",null,null,3,69,"*110",null,null,null,{"$f":"IF(H34=\"\",\"\",IF(MAXA(J34:M34)<=0,0,MAXA(J34:M34)))","v":0},{"$f":"IF(N34=\"\",0,N34-(I34/1))","v":-69},{"$f":"IF(I34=\"\",\"\",IF(B34=\"H\",IF(OR(H34=\"SEN\",H34<1995),VLOOKUP(I34,[2]Feuil1!$A$11:$G$29,6),IF(AND(H34>1994,H34<1998),VLOOKUP(I34,[2]Feuil1!$A$11:$G$29,5),IF(AND(H34>1997,H34<2000),VLOOKUP(I34,[2]Feuil1!$A$11:$G$29,4),IF(AND(H34>1999,H34<2002),VLOOKUP(I34,[2]Feuil1!$A$11:$G$29,3),VLOOKUP(I34,[2]Feuil1!$A$11:$G$29,2))))),IF(OR(H34=\"SEN\",H34<1995),VLOOKUP(I34,[2]Feuil1!$G$11:$L$25,6),IF(AND(H34>1994,H34<1998),VLOOKUP(I34,[2]Feuil1!$G$11:$L$25,5),IF(AND(H34>1997,H34<2000),VLOOKUP(I34,[2]Feuil1!$G$11:$L$25,4),IF(AND(H34>1999,H34<2002),VLOOKUP(I34,[2]Feuil1!$G$11:$L$25,3),VLOOKUP(I34,[2]Feuil1!$G$11:$L$25,2)))))))","v":"S69"}]
[null,"H",null,"ZIG","WESLEY",null,null,4,77.7,"*115",null,null,null,{"$f":"IF(H35=\"\",\"\",IF(MAXA(J35:M35)<=0,0,MAXA(J35:M35)))","v":0},{"$f":"IF(N35=\"\",0,N35-(I35/1))","v":-77.7},{"$f":"IF(I35=\"\",\"\",IF(B35=\"H\",IF(OR(H35=\"SEN\",H35<1995),VLOOKUP(I35,[2]Feuil1!$A$11:$G$29,6),IF(AND(H35>1994,H35<1998),VLOOKUP(I35,[2]Feuil1!$A$11:$G$29,5),IF(AND(H35>1997,H35<2000),VLOOKUP(I35,[2]Feuil1!$A$11:$G$29,4),IF(AND(H35>1999,H35<2002),VLOOKUP(I35,[2]Feuil1!$A$11:$G$29,3),VLOOKUP(I35,[2]Feuil1!$A$11:$G$29,2))))),IF(OR(H35=\"SEN\",H35<1995),VLOOKUP(I35,[2]Feuil1!$G$11:$L$25,6),IF(AND(H35>1994,H35<1998),VLOOKUP(I35,[2]Feuil1!$G$11:$L$25,5),IF(AND(H35>1997,H35<2000),VLOOKUP(I35,[2]Feuil1!$G$11:$L$25,4),IF(AND(H35>1999,H35<2002),VLOOKUP(I35,[2]Feuil1!$G$11:$L$25,3),VLOOKUP(I35,[2]Feuil1!$G$11:$L$25,2)))))))","v":"S85"}]
[null,"H",null,"VALLEE","SYLVAIN",null,null,5,94.75,"*135",null,null,null,{"$f":"IF(H36=\"\",\"\",IF(MAXA(J36:M36)<=0,0,MAXA(J36:M36)))","v":0},{"$f":"IF(N36=\"\",0,N36-(I36/1))","v":-94.75},{"$f":"IF(I36=\"\",\"\",IF(B36=\"H\",IF(OR(H36=\"SEN\",H36<1995),VLOOKUP(I36,[2]Feuil1!$A$11:$G$29,6),IF(AND(H36>1994,H36<1998),VLOOKUP(I36,[2]Feuil1!$A$11:$G$29,5),IF(AND(H36>1997,H36<2000),VLOOKUP(I36,[2]Feuil1!$A$11:$G$29,4),IF(AND(H36>1999,H36<2002),VLOOKUP(I36,[2]Feuil1!$A$11:$G$29,3),VLOOKUP(I36,[2]Feuil1!$A$11:$G$29,2))))),IF(OR(H36=\"SEN\",H36<1995),VLOOKUP(I36,[2]Feuil1!$G$11:$L$25,6),IF(AND(H36>1994,H36<1998),VLOOKUP(I36,[2]Feuil1!$G$11:$L$25,5),IF(AND(H36>1997,H36<2000),VLOOKUP(I36,[2]Feuil1!$G$11:$L$25,4),IF(AND(H36>1999,H36<2002),VLOOKUP(I36,[2]Feuil1!$G$11:$L$25,3),VLOOKUP(I36,[2]Feuil1!$G$11:$L$25,2)))))))","v":"S105"}]
[null,"H",null,"DUPONCHEL","Antoine",null,null,6,107.75,"*140",null,null,null,{"$f":"IF(H37=\"\",\"\",IF(MAXA(J37:M37)<=0,0,MAXA(J37:M37)))","v":0},{"$f":"IF(N37=\"\",0,N37-(I37/1))","v":-107.75},{"$f":"IF(I37=\"\",\"\",IF(B37=\"H\",IF(OR(H37=\"SEN\",H37<1995),VLOOKUP(I37,[2]Feuil1!$A$11:$G$29,6),IF(AND(H37>1994,H37<1998),VLOOKUP(I37,[2]Feuil1!$A$11:$G$29,5),IF(AND(H37>1997,H37<2000),VLOOKUP(I37,[2]Feuil1!$A$11:$G$29,4),IF(AND(H37>1999,H37<2002),VLOOKUP(I37,[2]Feuil1!$A$11:$G$29,3),VLOOKUP(I37,[2]Feuil1!$A$11:$G$29,2))))),IF(OR(H37=\"SEN\",H37<1995),VLOOKUP(I37,[2]Feuil1!$G$11:$L$25,6),IF(AND(H37>1994,H37<1998),VLOOKUP(I37,[2]Feuil1!$G$11:$L$25,5),IF(AND(H37>1997,H37<2000),VLOOKUP(I37,[2]Feuil1!$G$11:$L$25,4),IF(AND(H37>1999,H37<2002),VLOOKUP(I37,[2]Feuil1!$G$11:$L$25,3),VLOOKUP(I37,[2]Feuil1!$G$11:$L$25,2)))))))","v":"S+105"}]
["EQUIPE 4","F",2,"APPERT","MARIE","POLE UNIVERSITAIRE L.VINCI","VERSAILLES",1,61.9,null,37.5,-40,40,{"$f":"IF(H38=\"\",\"\",IF(MAXA(J38:M38)<=0,0,MAXA(J38:M38)))","v":40},{"$f":"IF(N38=\"\",0,N38-(I38/2))","v":9.0500000000000007},{"$f":"IF(I38=\"\",\"\",IF(B38=\"H\",IF(OR(H38=\"SEN\",H38<1995),VLOOKUP(I38,[2]Feuil1!$A$11:$G$29,6),IF(AND(H38>1994,H38<1998),VLOOKUP(I38,[2]Feuil1!$A$11:$G$29,5),IF(AND(H38>1997,H38<2000),VLOOKUP(I38,[2]Feuil1!$A$11:$G$29,4),IF(AND(H38>1999,H38<2002),VLOOKUP(I38,[2]Feuil1!$A$11:$G$29,3),VLOOKUP(I38,[2]Feuil1!$A$11:$G$29,2))))),IF(OR(H38=\"SEN\",H38<1995),VLOOKUP(I38,[2]Feuil1!$G$11:$L$25,6),IF(AND(H38>1994,H38<1998),VLOOKUP(I38,[2]Feuil1!$G$11:$L$25,5),IF(AND(H38>1997,H38<2000),VLOOKUP(I38,[2]Feuil1!$G$11:$L$25,4),IF(AND(H38>1999,H38<2002),VLOOKUP(I38,[2]Feuil1!$G$11:$L$25,3),VLOOKUP(I38,[2]Feuil1!$G$11:$L$25,2)))))))","v":"FS63"},null,{"$f":"SUM(O38:O43)","v":240.3}]
[null,"F",null,"DENZY","SAMBA",null,null,2,63.2,40,42.5,-45,-45,42.5,{"$f":"IF(N39=\"\",0,N39-(I39/2))","v":10.899999999999999},{"$f":"IF(I39=\"\",\"\",IF(B39=\"H\",IF(OR(H39=\"SEN\",H39<1995),VLOOKUP(I39,[2]Feuil1!$A$11:$G$29,6),IF(AND(H39>1994,H39<1998),VLOOKUP(I39,[2]Feuil1!$A$11:$G$29,5),IF(AND(H39>1997,H39<2000),VLOOKUP(I39,[2]Feuil1!$A$11:$G$29,4),IF(AND(H39>1999,H39<2002),VLOOKUP(I39,[2]Feuil1!$A$11:$G$29,3),VLOOKUP(I39,[2]Feuil1!$A$11:$G$29,2))))),IF(OR(H39=\"SEN\",H39<1995),VLOOKUP(I39,[2]Feuil1!$G$11:$L$25,6),IF(AND(H39>1994,H39<1998),VLOOKUP(I39,[2]Feuil1!$G$11:$L$25,5),IF(AND(H39>1997,H39<2000),VLOOKUP(I39,[2]Feuil1!$G$11:$L$25,4),IF(AND(H39>1999,H39<2002),VLOOKUP(I39,[2]Feuil1!$G$11:$L$25,3),VLOOKUP(I39,[2]Feuil1!$G$11:$L$25,2)))))))","v":"FS69"}]
[null,"H",null,"KORICHE","ADIB",null,null,3,67.95,42.5,110,112.5,-115,{"$f":"IF(H40=\"\",\"\",IF(MAXA(J40:M40)<=0,0,MAXA(J40:M40)))","v":112.5},{"$f":"IF(N40=\"\",0,N40-(I40/1))","v":44.55},{"$f":"IF(I40=\"\",\"\",IF(B40=\"H\",IF(OR(H40=\"SEN\",H40<1995),VLOOKUP(I40,[2]Feuil1!$A$11:$G$29,6),IF(AND(H40>1994,H40<1998),VLOOKUP(I40,[2]Feuil1!$A$11:$G$29,5),IF(AND(H40>1997,H40<2000),VLOOKUP(I40,[2]Feuil1!$A$11:$G$29,4),IF(AND(H40>1999,H40<2002),VLOOKUP(I40,[2]Feuil1!$A$11:$G$29,3),VLOOKUP(I40,[2]Feuil1!$A$11:$G$29,2))))),IF(OR(H40=\"SEN\",H40<1995),VLOOKUP(I40,[2]Feuil1!$G$11:$L$25,6),IF(AND(H40>1994,H40<1998),VLOOKUP(I40,[2]Feuil1!$G$11:$L$25,5),IF(AND(H40>1997,H40<2000),VLOOKUP(I40,[2]Feuil1!$G$11:$L$25,4),IF(AND(H40>1999,H40<2002),VLOOKUP(I40,[2]Feuil1!$G$11:$L$25,3),VLOOKUP(I40,[2]Feuil1!$G$11:$L$25,2)))))))","v":"S69"}]
[null,"H",null,"REY","CEDRIC",null,null,4,71.7,112.5,117.5,122.5,-125,{"$f":"IF(H41=\"\",\"\",IF(MAXA(J41:M41)<=0,0,MAXA(J41:M41)))","v":122.5},{"$f":"IF(N41=\"\",0,N41-(I41/1))","v":50.8},{"$f":"IF(I41=\"\",\"\",IF(B41=\"H\",IF(OR(H41=\"SEN\",H41<1995),VLOOKUP(I41,[2]Feuil1!$A$11:$G$29,6),IF(AND(H41>1994,H41<1998),VLOOKUP(I41,[2]Feuil1!$A$11:$G$29,5),IF(AND(H41>1997,H41<2000),VLOOKUP(I41,[2]Feuil1!$A$11:$G$29,4),IF(AND(H41>1999,H41<2002),VLOOKUP(I41,[2]Feuil1!$A$11:$G$29,3),VLOOKUP(I41,[2]Feuil1!$A$11:$G$29,2))))),IF(OR(H41=\"SEN\",H41<1995),VLOOKUP(I41,[2]Feuil1!$G$11:$L$25,6),IF(AND(H41>1994,H41<1998),VLOOKUP(I41,[2]Feuil1!$G$11:$L$25,5),IF(AND(H41>1997,H41<2000),VLOOKUP(I41,[2]Feuil1!$G$11:$L$25,4),IF(AND(H41>1999,H41<2002),VLOOKUP(I41,[2]Feuil1!$G$11:$L$25,3),VLOOKUP(I41,[2]Feuil1!$G$11:$L$25,2)))))))","v":"S77"}]
[null,"H",null,"DOMINGUES","MAXIME",null,null,5,74.2,122.5,130,135,140,{"$f":"IF(H42=\"\",\"\",IF(MAXA(J42:M42)<=0,0,MAXA(J42:M42)))","v":140},{"$f":"IF(N42=\"\",0,N42-(I42/1))","v":65.8},{"$f":"IF(I42=\"\",\"\",IF(B42=\"H\",IF(OR(H42=\"SEN\",H42<1995),VLOOKUP(I42,[2]Feuil1!$A$11:$G$29,6),IF(AND(H42>1994,H42<1998),VLOOKUP(I42,[2]Feuil1!$A$11:$G$29,5),IF(AND(H42>1997,H42<2000),VLOOKUP(I42,[2]Feuil1!$A$11:$G$29,4),IF(AND(H42>1999,H42<2002),VLOOKUP(I42,[2]Feuil1!$A$11:$G$29,3),VLOOKUP(I42,[2]Feuil1!$A$11:$G$29,2))))),IF(OR(H42=\"SEN\",H42<1995),VLOOKUP(I42,[2]Feuil1!$G$11:$L$25,6),IF(AND(H42>1994,H42<1998),VLOOKUP(I42,[2]Feuil1!$G$11:$L$25,5),IF(AND(H42>1997,H42<2000),VLOOKUP(I42,[2]Feuil1!$G$11:$L$25,4),IF(AND(H42>1999,H42<2002),VLOOKUP(I42,[2]Feuil1!$G$11:$L$25,3),VLOOKUP(I42,[2]Feuil1!$G$11:$L$25,2)))))))","v":"S77"}]
[null,"H",null,"EID","PETER",null,null,6,100.8,140,160,-167.5,-167.5,{"$f":"IF(H43=\"\",\"\",IF(MAXA(J43:M43)<=0,0,MAXA(J43:M43)))","v":160},{"$f":"IF(N43=\"\",0,N43-(I43/1))","v":59.2},{"$f":"IF(I43=\"\",\"\",IF(B43=\"H\",IF(OR(H43=\"SEN\",H43<1995),VLOOKUP(I43,[2]Feuil1!$A$11:$G$29,6),IF(AND(H43>1994,H43<1998),VLOOKUP(I43,[2]Feuil1!$A$11:$G$29,5),IF(AND(H43>1997,H43<2000),VLOOKUP(I43,[2]Feuil1!$A$11:$G$29,4),IF(AND(H43>1999,H43<2002),VLOOKUP(I43,[2]Feuil1!$A$11:$G$29,3),VLOOKUP(I43,[2]Feuil1!$A$11:$G$29,2))))),IF(OR(H43=\"SEN\",H43<1995),VLOOKUP(I43,[2]Feuil1!$G$11:$L$25,6),IF(AND(H43>1994,H43<1998),VLOOKUP(I43,[2]Feuil1!$G$11:$L$25,5),IF(AND(H43>1997,H43<2000),VLOOKUP(I43,[2]Feuil1!$G$11:$L$25,4),IF(AND(H43>1999,H43<2002),VLOOKUP(I43,[2]Feuil1!$G$11:$L$25,3),VLOOKUP(I43,[2]Feuil1!$G$11:$L$25,2)))))))","v":"S105"}]
["EQUIPE 5","F",4,"CARON","AMELIE","Université de Picardie","AMIENS",1,53.5,null,25,27.5,30,{"$f":"IF(H44=\"\",\"\",IF(MAXA(J44:M44)<=0,0,MAXA(J44:M44)))","v":30},{"$f":"IF(N44=\"\",0,N44-(I44/2))","v":3.25},{"$f":"IF(I44=\"\",\"\",IF(B44=\"H\",IF(OR(H44=\"SEN\",H44<1995),VLOOKUP(I44,[2]Feuil1!$A$11:$G$29,6),IF(AND(H44>1994,H44<1998),VLOOKUP(I44,[2]Feuil1!$A$11:$G$29,5),IF(AND(H44>1997,H44<2000),VLOOKUP(I44,[2]Feuil1!$A$11:$G$29,4),IF(AND(H44>1999,H44<2002),VLOOKUP(I44,[2]Feuil1!$A$11:$G$29,3),VLOOKUP(I44,[2]Feuil1!$A$11:$G$29,2))))),IF(OR(H44=\"SEN\",H44<1995),VLOOKUP(I44,[2]Feuil1!$G$11:$L$25,6),IF(AND(H44>1994,H44<1998),VLOOKUP(I44,[2]Feuil1!$G$11:$L$25,5),IF(AND(H44>1997,H44<2000),VLOOKUP(I44,[2]Feuil1!$G$11:$L$25,4),IF(AND(H44>1999,H44<2002),VLOOKUP(I44,[2]Feuil1!$G$11:$L$25,3),VLOOKUP(I44,[2]Feuil1!$G$11:$L$25,2)))))))","v":"FS58"},null,{"$f":"SUM(O44:O49)","v":182.5}]
[null,"F",null,"SEIGNEUR","MANON",null,null,2,53.4,30,35,37.5,-40,37.5,{"$f":"IF(N45=\"\",0,N45-(I45/2))","v":10.8},{"$f":"IF(I45=\"\",\"\",IF(B45=\"H\",IF(OR(H45=\"SEN\",H45<1995),VLOOKUP(I45,[2]Feuil1!$A$11:$G$29,6),IF(AND(H45>1994,H45<1998),VLOOKUP(I45,[2]Feuil1!$A$11:$G$29,5),IF(AND(H45>1997,H45<2000),VLOOKUP(I45,[2]Feuil1!$A$11:$G$29,4),IF(AND(H45>1999,H45<2002),VLOOKUP(I45,[2]Feuil1!$A$11:$G$29,3),VLOOKUP(I45,[2]Feuil1!$A$11:$G$29,2))))),IF(OR(H45=\"SEN\",H45<1995),VLOOKUP(I45,[2]Feuil1!$G$11:$L$25,6),IF(AND(H45>1994,H45<1998),VLOOKUP(I45,[2]Feuil1!$G$11:$L$25,5),IF(AND(H45>1997,H45<2000),VLOOKUP(I45,[2]Feuil1!$G$11:$L$25,4),IF(AND(H45>1999,H45<2002),VLOOKUP(I45,[2]Feuil1!$G$11:$L$25,3),VLOOKUP(I45,[2]Feuil1!$G$11:$L$25,2)))))))","v":"FS58"}]
[null,"H",null,"HECKENBENNER","AXEL",null,null,3,64.2,37.5,95,-100,-100,{"$f":"IF(H46=\"\",\"\",IF(MAXA(J46:M46)<=0,0,MAXA(J46:M46)))","v":95},{"$f":"IF(N46=\"\",0,N46-(I46/1))","v":30.799999999999997},{"$f":"IF(I46=\"\",\"\",IF(B46=\"H\",IF(OR(H46=\"SEN\",H46<1995),VLOOKUP(I46,[2]Feuil1!$A$11:$G$29,6),IF(AND(H46>1994,H46<1998),VLOOKUP(I46,[2]Feuil1!$A$11:$G$29,5),IF(AND(H46>1997,H46<2000),VLOOKUP(I46,[2]Feuil1!$A$11:$G$29,4),IF(AND(H46>1999,H46<2002),VLOOKUP(I46,[2]Feuil1!$A$11:$G$29,3),VLOOKUP(I46,[2]Feuil1!$A$11:$G$29,2))))),IF(OR(H46=\"SEN\",H46<1995),VLOOKUP(I46,[2]Feuil1!$G$11:$L$25,6),IF(AND(H46>1994,H46<1998),VLOOKUP(I46,[2]Feuil1!$G$11:$L$25,5),IF(AND(H46>1997,H46<2000),VLOOKUP(I46,[2]Feuil1!$G$11:$L$25,4),IF(AND(H46>1999,H46<2002),VLOOKUP(I46,[2]Feuil1!$G$11:$L$25,3),VLOOKUP(I46,[2]Feuil1!$G$11:$L$25,2)))))))","v":"S69"}]
[null,"H",null,"LOORIUS","JULIEN",null,null,4,67.650000000000006,95,110,-115,-115,{"$f":"IF(H47=\"\",\"\",IF(MAXA(J47:M47)<=0,0,MAXA(J47:M47)))","v":110},{"$f":"IF(N47=\"\",0,N47-(I47/1))","v":42.349999999999994},{"$f":"IF(I47=\"\",\"\",IF(B47=\"H\",IF(OR(H47=\"SEN\",H47<1995),VLOOKUP(I47,[2]Feuil1!$A$11:$G$29,6),IF(AND(H47>1994,H47<1998),VLOOKUP(I47,[2]Feuil1!$A$11:$G$29,5),IF(AND(H47>1997,H47<2000),VLOOKUP(I47,[2]Feuil1!$A$11:$G$29,4),IF(AND(H47>1999,H47<2002),VLOOKUP(I47,[2]Feuil1!$A$11:$G$29,3),VLOOKUP(I47,[2]Feuil1!$A$11:$G$29,2))))),IF(OR(H47=\"SEN\",H47<1995),VLOOKUP(I47,[2]Feuil1!$G$11:$L$25,6),IF(AND(H47>1994,H47<1998),VLOOKUP(I47,[2]Feuil1!$G$11:$L$25,5),IF(AND(H47>1997,H47<2000),VLOOKUP(I47,[2]Feuil1!$G$11:$L$25,4),IF(AND(H47>1999,H47<2002),VLOOKUP(I47,[2]Feuil1!$G$11:$L$25,3),VLOOKUP(I47,[2]Feuil1!$G$11:$L$25,2)))))))","v":"S69"}]
[null,"H",null,"PECQUEUX","MAXENCE",null,null,5,77.099999999999994,110,117.5,122.5,125,{"$f":"IF(H48=\"\",\"\",IF(MAXA(J48:M48)<=0,0,MAXA(J48:M48)))","v":125},{"$f":"IF(N48=\"\",0,N48-(I48/1))","v":47.900000000000006},{"$f":"IF(I48=\"\",\"\",IF(B48=\"H\",IF(OR(H48=\"SEN\",H48<1995),VLOOKUP(I48,[2]Feuil1!$A$11:$G$29,6),IF(AND(H48>1994,H48<1998),VLOOKUP(I48,[2]Feuil1!$A$11:$G$29,5),IF(AND(H48>1997,H48<2000),VLOOKUP(I48,[2]Feuil1!$A$11:$G$29,4),IF(AND(H48>1999,H48<2002),VLOOKUP(I48,[2]Feuil1!$A$11:$G$29,3),VLOOKUP(I48,[2]Feuil1!$A$11:$G$29,2))))),IF(OR(H48=\"SEN\",H48<1995),VLOOKUP(I48,[2]Feuil1!$G$11:$L$25,6),IF(AND(H48>1994,H48<1998),VLOOKUP(I48,[2]Feuil1!$G$11:$L$25,5),IF(AND(H48>1997,H48<2000),VLOOKUP(I48,[2]Feuil1!$G$11:$L$25,4),IF(AND(H48>1999,H48<2002),VLOOKUP(I48,[2]Feuil1!$G$11:$L$25,3),VLOOKUP(I48,[2]Feuil1!$G$11:$L$25,2)))))))","v":"S85"}]
[null,"H",null,"ROBIN","THOMAS",null,null,6,85.1,125,127.5,130,132.5,{"$f":"IF(H49=\"\",\"\",IF(MAXA(J49:M49)<=0,0,MAXA(J49:M49)))","v":132.5},{"$f":"IF(N49=\"\",0,N49-(I49/1))","v":47.400000000000006},{"$f":"IF(I49=\"\",\"\",IF(B49=\"H\",IF(OR(H49=\"SEN\",H49<1995),VLOOKUP(I49,[2]Feuil1!$A$11:$G$29,6),IF(AND(H49>1994,H49<1998),VLOOKUP(I49,[2]Feuil1!$A$11:$G$29,5),IF(AND(H49>1997,H49<2000),VLOOKUP(I49,[2]Feuil1!$A$11:$G$29,4),IF(AND(H49>1999,H49<2002),VLOOKUP(I49,[2]Feuil1!$A$11:$G$29,3),VLOOKUP(I49,[2]Feuil1!$A$11:$G$29,2))))),IF(OR(H49=\"SEN\",H49<1995),VLOOKUP(I49,[2]Feuil1!$G$11:$L$25,6),IF(AND(H49>1994,H49<1998),VLOOKUP(I49,[2]Feuil1!$G$11:$L$25,5),IF(AND(H49>1997,H49<2000),VLOOKUP(I49,[2]Feuil1!$G$11:$L$25,4),IF(AND(H49>1999,H49<2002),VLOOKUP(I49,[2]Feuil1!$G$11:$L$25,3),VLOOKUP(I49,[2]Feuil1!$G$11:$L$25,2)))))))","v":"S94"}]
["EQUIPE 6","F",5,"CANET","Chloé","AS UBO","Rennes",1,67.5,null,55,60,-62.5,{"$f":"IF(H50=\"\",\"\",IF(MAXA(J50:M50)<=0,0,MAXA(J50:M50)))","v":60},{"$f":"IF(N50=\"\",0,N50-(I50/2))","v":26.25},{"$f":"IF(I50=\"\",\"\",IF(B50=\"H\",IF(OR(H50=\"SEN\",H50<1995),VLOOKUP(I50,[2]Feuil1!$A$11:$G$29,6),IF(AND(H50>1994,H50<1998),VLOOKUP(I50,[2]Feuil1!$A$11:$G$29,5),IF(AND(H50>1997,H50<2000),VLOOKUP(I50,[2]Feuil1!$A$11:$G$29,4),IF(AND(H50>1999,H50<2002),VLOOKUP(I50,[2]Feuil1!$A$11:$G$29,3),VLOOKUP(I50,[2]Feuil1!$A$11:$G$29,2))))),IF(OR(H50=\"SEN\",H50<1995),VLOOKUP(I50,[2]Feuil1!$G$11:$L$25,6),IF(AND(H50>1994,H50<1998),VLOOKUP(I50,[2]Feuil1!$G$11:$L$25,5),IF(AND(H50>1997,H50<2000),VLOOKUP(I50,[2]Feuil1!$G$11:$L$25,4),IF(AND(H50>1999,H50<2002),VLOOKUP(I50,[2]Feuil1!$G$11:$L$25,3),VLOOKUP(I50,[2]Feuil1!$G$11:$L$25,2)))))))","v":"FS69"},null,{"$f":"SUM(O50:O55)","v":144.10000000000002}]
[null,"F",null,"LE BAIL ","Léna ",null,null,2,81.2,60,77.5,82.5,"_",82.5,{"$f":"IF(N51=\"\",0,N51-(I51/2))","v":41.9},{"$f":"IF(I51=\"\",\"\",IF(B51=\"H\",IF(OR(H51=\"SEN\",H51<1995),VLOOKUP(I51,[2]Feuil1!$A$11:$G$29,6),IF(AND(H51>1994,H51<1998),VLOOKUP(I51,[2]Feuil1!$A$11:$G$29,5),IF(AND(H51>1997,H51<2000),VLOOKUP(I51,[2]Feuil1!$A$11:$G$29,4),IF(AND(H51>1999,H51<2002),VLOOKUP(I51,[2]Feuil1!$A$11:$G$29,3),VLOOKUP(I51,[2]Feuil1!$A$11:$G$29,2))))),IF(OR(H51=\"SEN\",H51<1995),VLOOKUP(I51,[2]Feuil1!$G$11:$L$25,6),IF(AND(H51>1994,H51<1998),VLOOKUP(I51,[2]Feuil1!$G$11:$L$25,5),IF(AND(H51>1997,H51<2000),VLOOKUP(I51,[2]Feuil1!$G$11:$L$25,4),IF(AND(H51>1999,H51<2002),VLOOKUP(I51,[2]Feuil1!$G$11:$L$25,3),VLOOKUP(I51,[2]Feuil1!$G$11:$L$25,2)))))))","v":"FS+75"}]
[null,"H",null,"GUYOMAR","Thomas",null,null,3,71.05,82.5,-85,-85,"_",{"$f":"IF(H52=\"\",\"\",IF(MAXA(J52:M52)<=0,0,MAXA(J52:M52)))","v":82.5},{"$f":"IF(N52=\"\",0,N52-(I52/1))","v":11.450000000000003},{"$f":"IF(I52=\"\",\"\",IF(B52=\"H\",IF(OR(H52=\"SEN\",H52<1995),VLOOKUP(I52,[2]Feuil1!$A$11:$G$29,6),IF(AND(H52>1994,H52<1998),VLOOKUP(I52,[2]Feuil1!$A$11:$G$29,5),IF(AND(H52>1997,H52<2000),VLOOKUP(I52,[2]Feuil1!$A$11:$G$29,4),IF(AND(H52>1999,H52<2002),VLOOKUP(I52,[2]Feuil1!$A$11:$G$29,3),VLOOKUP(I52,[2]Feuil1!$A$11:$G$29,2))))),IF(OR(H52=\"SEN\",H52<1995),VLOOKUP(I52,[2]Feuil1!$G$11:$L$25,6),IF(AND(H52>1994,H52<1998),VLOOKUP(I52,[2]Feuil1!$G$11:$L$25,5),IF(AND(H52>1997,H52<2000),VLOOKUP(I52,[2]Feuil1!$G$11:$L$25,4),IF(AND(H52>1999,H52<2002),VLOOKUP(I52,[2]Feuil1!$G$11:$L$25,3),VLOOKUP(I52,[2]Feuil1!$G$11:$L$25,2)))))))","v":"S77"}]
[null,"H",null,"GIRARD","Maxime",null,null,4,76.55,82.5,87.5,92.5,-95,{"$f":"IF(H53=\"\",\"\",IF(MAXA(J53:M53)<=0,0,MAXA(J53:M53)))","v":92.5},{"$f":"IF(N53=\"\",0,N53-(I53/1))","v":15.950000000000003},{"$f":"IF(I53=\"\",\"\",IF(B53=\"H\",IF(OR(H53=\"SEN\",H53<1995),VLOOKUP(I53,[2]Feuil1!$A$11:$G$29,6),IF(AND(H53>1994,H53<1998),VLOOKUP(I53,[2]Feuil1!$A$11:$G$29,5),IF(AND(H53>1997,H53<2000),VLOOKUP(I53,[2]Feuil1!$A$11:$G$29,4),IF(AND(H53>1999,H53<2002),VLOOKUP(I53,[2]Feuil1!$A$11:$G$29,3),VLOOKUP(I53,[2]Feuil1!$A$11:$G$29,2))))),IF(OR(H53=\"SEN\",H53<1995),VLOOKUP(I53,[2]Feuil1!$G$11:$L$25,6),IF(AND(H53>1994,H53<1998),VLOOKUP(I53,[2]Feuil1!$G$11:$L$25,5),IF(AND(H53>1997,H53<2000),VLOOKUP(I53,[2]Feuil1!$G$11:$L$25,4),IF(AND(H53>1999,H53<2002),VLOOKUP(I53,[2]Feuil1!$G$11:$L$25,3),VLOOKUP(I53,[2]Feuil1!$G$11:$L$25,2)))))))","v":"S77"}]
[null,"H",null,"PITTY","Jean-baptiste",null,null,5,68.900000000000006,92.5,97.5,100,-102.5,{"$f":"IF(H54=\"\",\"\",IF(MAXA(J54:M54)<=0,0,MAXA(J54:M54)))","v":100},{"$f":"IF(N54=\"\",0,N54-(I54/1))","v":31.099999999999994},{"$f":"IF(I54=\"\",\"\",IF(B54=\"H\",IF(OR(H54=\"SEN\",H54<1995),VLOOKUP(I54,[2]Feuil1!$A$11:$G$29,6),IF(AND(H54>1994,H54<1998),VLOOKUP(I54,[2]Feuil1!$A$11:$G$29,5),IF(AND(H54>1997,H54<2000),VLOOKUP(I54,[2]Feuil1!$A$11:$G$29,4),IF(AND(H54>1999,H54<2002),VLOOKUP(I54,[2]Feuil1!$A$11:$G$29,3),VLOOKUP(I54,[2]Feuil1!$A$11:$G$29,2))))),IF(OR(H54=\"SEN\",H54<1995),VLOOKUP(I54,[2]Feuil1!$G$11:$L$25,6),IF(AND(H54>1994,H54<1998),VLOOKUP(I54,[2]Feuil1!$G$11:$L$25,5),IF(AND(H54>1997,H54<2000),VLOOKUP(I54,[2]Feuil1!$G$11:$L$25,4),IF(AND(H54>1999,H54<2002),VLOOKUP(I54,[2]Feuil1!$G$11:$L$25,3),VLOOKUP(I54,[2]Feuil1!$G$11:$L$25,2)))))))","v":"S69"}]
[null,"H",null,"VIGNAULT","Guillaume",null,null,6,92.55,100,105,-110,110,{"$f":"IF(H55=\"\",\"\",IF(MAXA(J55:M55)<=0,0,MAXA(J55:M55)))","v":110},{"$f":"IF(N55=\"\",0,N55-(I55/1))","v":17.450000000000003},{"$f":"IF(I55=\"\",\"\",IF(B55=\"H\",IF(OR(H55=\"SEN\",H55<1995),VLOOKUP(I55,[2]Feuil1!$A$11:$G$29,6),IF(AND(H55>1994,H55<1998),VLOOKUP(I55,[2]Feuil1!$A$11:$G$29,5),IF(AND(H55>1997,H55<2000),VLOOKUP(I55,[2]Feuil1!$A$11:$G$29,4),IF(AND(H55>1999,H55<2002),VLOOKUP(I55,[2]Feuil1!$A$11:$G$29,3),VLOOKUP(I55,[2]Feuil1!$A$11:$G$29,2))))),IF(OR(H55=\"SEN\",H55<1995),VLOOKUP(I55,[2]Feuil1!$G$11:$L$25,6),IF(AND(H55>1994,H55<1998),VLOOKUP(I55,[2]Feuil1!$G$11:$L$25,5),IF(AND(H55>1997,H55<2000),VLOOKUP(I55,[2]Feuil1!$G$11:$L$25,4),IF(AND(H55>1999,H55<2002),VLOOKUP(I55,[2]Feuil1!$G$11:$L$25,3),VLOOKUP(I55,[2]Feuil1!$G$11:$L$25,2)))))))","v":"S94"}]

{"sheet":"HALTERO FIT BARRE","index":4,"n_rows":39,"n_cols":26,"rows_kept":39,"cut":false,"hidden":false,"merged":[[10,17,12,17],[18,17,20,17],[34,17,36,17],[26,17,28,17],[8,9,8,12],[30,13,32,13],[34,13,36,13],[10,13,12,13],[14,13,16,13],[18,13,20,13],[22,13,24,13],[26,13,28,13],[0,0,0,5],[1,2,1,3],[2,2,2,3],[1,0,2,1],[1,4,1,5],[2,4,2,5],[7,0,7,1],[8,0,8,1],[7,2,7,3],[8,2,8,3],[7,4,7,5],[8,4,8,6],[34,0,36,0],[34,7,36,7],[22,0,24,0],[22,7,24,7],[26,0,28,0],[26,7,28,7],[30,0,32,0],[30,7,32,7],[10,0,12,0],[10,7,12,7],[14,0,16,0],[14,7,16,7],[18,0,20,0],[18,7,20,7],[6,18,6,26],[10,19,12,20],[18,24,20,25],[26,24,28,25],[34,19,36,20],[10,23,12,23],[18,20,20,20],[26,20,28,20],[34,23,36,23]]}
["Déroulement des épreuves d'Hatéro Fit Barre : 7 équipes inscrites",null,null,null,null,null,null,null,null,"Poids","Chaque côté","Charge réelle","Charge totale ",null,"vérification"]
["Mardi 12 mai : 11H30 1/4 de finale",null,"Mardi 12 mai : 15H15 1/2 finales",null,"Jeudi 13 mai : 11H Finale et Classements",null,null,null,null,66.95,{"$f":"((J2-(1.772*4))/8)","v":7.4827500000000002},8,{"$f":"(L2*8)+(1.772*4)","v":71.087999999999994},null,{"$f":"(((J2/4)-1.772))/2","v":7.4827500000000002}]
[null,null,"et 1er tour Classement",null,"définitif ",null,null,null,null,"Bleu",3,2,{"$f":"K3*L3","v":6}]
["1ère série","M1: Eq4 - Eq5","1ère série","M5 1/2 finale : 1 - 4","1ère série","M9* Clas : 5 - 6 ",null,null,null,"Rouge",2,0,{"$f":"K4*L4","v":0}]
["2ème série ","M2 : Eq3 - Eq6","2ème série ","M6 1/2 finale : 2 - 3","2ème série ","M10* Cla : 7 seul e",null,null,null,"Vert",1,null,{"$f":"K5*L5","v":0}]
["3ème série","M3: Eq2-Eq7","3ème série","M7* Clas M7 : 5 - 7","3ème série","Place 3/4 : Pd M5 - Pd M6",null,null,null,"Noire",1.25,1,{"$f":"K6*L6","v":1.25}]
["4ème série","M4: Eq1 seule","4ème série","M8* Clas : 6 seule","4ème série","Finale :  Vq M5 -Vq M6",null,null,null,"Jaune",0.5,1,{"$f":"K7*L7","v":0.5},null,null,null,null,null,"Finale"]
["A l'ssue des 1/4 de Finale, les équipes sont",null,"1/2 finales pour les équipes classées de ",null,"Finales et fin de classement ",null,null,null,null,null,null,null,{"$f":"SUM(M3:M7)","v":7.75}]
["classées de 1 à 7 en fonction du chronométrage",null,"1 à 4 et *clasement pour les 3 suivantes",null,"Le classement est déterminé pas l'addition des 2 prestations ",null,null,null,null,"Calcul Haltéro Fit Barre"]
[null,null,null,null,null,null,null,null,null,null,null,"Cla"]
["EQUIPE 1","U de Montpellier","F",null,"FIGUIN","AUDREY",2.3263888888888887E-3,{"$f":"SUM(G11:G13)","v":"00:15:32"},59.3,6.75,{"$f":"((I11-(1.772*4))/8)","v":6.5264999999999995},1,2.7199074074074074E-3,{"$f":"SUM(M11:M13)","v":"00:17:51"},1,null,2.9976851851851848E-3,{"$f":"SUM(Q11:Q13)","v":"00:19:19"},null,"UFR Staps Montpellier",null,null,2.627314814814815E-3,{"$f":"SUM(W11:W13)","v":"00:16:24"}]
[null,"U de Montpellier","H",null,"DAVER","DAMIEN",3.9120370370370368E-3,null,74.349999999999994,8.5,{"$f":"((I12-(1.772*4))/8)","v":8.4077500000000001},1,4.1203703703703706E-3,null,null,null,4.2939814814814811E-3,null,null,null,null,null,3.7731481481481483E-3,null,null,1]
[null,"U de Montpellier","H",null,"DECOURT","ARTHUR",4.5486111111111109E-3,null,73.650000000000006,8.5,{"$f":"((I13-(1.772*4))/8)","v":8.3202500000000015},1,5.5555555555555558E-3,null,null,null,6.122685185185185E-3,null,null,null,null,null,4.9884259259259265E-3]
[]
["EQUIPE 2","U de Montpellier","F",null,"REGNIER","CLAIRE",2.1180555555555553E-3,{"$f":"SUM(G15:G17)","v":"00:16:45"},63.9,7.25,{"$f":"((I15-(1.772*4))/8)","v":7.1014999999999997},6,2.2800925925925927E-3,{"$f":"SUM(M15:M17)","v":"00:19:22"},0,"F"]
[null,"U de Montpellier","H",null,"DUMAS","ADRIEN",4.5949074074074078E-3,null,66.95,7.5,{"$f":"((I16-(1.772*4))/8)","v":7.4827500000000002},6,4.7800925925925919E-3]
[null,"U de Montpellier","H",null,"DELBRAYELLE","NICOLAS",4.9189814814814816E-3,null,77.25,9,{"$f":"((I17-(1.772*4))/8)","v":8.7702500000000008},6,6.3888888888888884E-3]
[]
["EQUIPE 3","U de Montpellier","F",null,"CAILLE","PAULINE",2.3958333333333336E-3,{"$f":"SUM(G19:G21)","v":"00:19:48"},59.7,6.75,{"$f":"((I19-(1.772*4))/8)","v":6.5765000000000002},3,2.7199074074074074E-3,{"$f":"SUM(M19:M21)","v":"00:21:08"},4,null,3.0671296296296297E-3,{"$f":"SUM(Q19:Q21)","v":"00:21:06"},null,2.6041666666666665E-3,{"$f":"SUM(T19:T21)","v":"00:20:07"},null,null,null,"UFR Staps Montpellier"]
[null,"U de Montpellier","H",null,"GIACETTI","FABIEN",5.5439814814814822E-3,null,69.849999999999994,8,{"$f":"((I20-(1.772*4))/8)","v":7.8452499999999992},3,5.7986111111111112E-3,null,null,null,5.6828703703703702E-3,null,null,"00:08:04",null,null,3]
[null,"U de Montpellier","H",null,"DARRIET","NICHOLAS",5.8101851851851856E-3,null,62.4,7,{"$f":"((I21-(1.772*4))/8)","v":6.9139999999999997},3,6.1574074074074074E-3,null,null,null,5.9027777777777776E-3,null,null,5.7638888888888887E-3]
[]
["EQUIPE 4","U de Montpellier","F",null,"MARTIN","MARINE",2.5462962962962961E-3,{"$f":"SUM(G23:G25)","v":"00:20:47"},50.6,5.5,{"$f":"((I23-(1.772*4))/8)","v":5.4390000000000001},5,4.1898148148148146E-3,{"$f":"SUM(M23:M25)","v":"00:22:30"},5]
[null,"U de Montpellier","H",null,"AUBERT","CORENTIN",5.8912037037037032E-3,null,71.849999999999994,8.25,{"$f":"((I24-(1.772*4))/8)","v":8.0952500000000001},5,5.6712962962962958E-3]
[null,"U de Montpellier","H",null,"SAMY","RUUD",5.9953703703703697E-3,null,78.45,9,{"$f":"((I25-(1.772*4))/8)","v":8.9202500000000011},5,5.7638888888888887E-3]
[]
["EQUIPE 5","U de Montpellier","F",null,"GUIBAL","EMMANUELLE",2.5810185185185185E-3,{"$f":"SUM(G27:G29)","v":"00:24:20"},56.7,6.25,{"$f":"((I27-(1.772*4))/8)","v":6.2015000000000002},4,2.4537037037037036E-3,{"$f":"SUM(M27:M29)","v":"00:20:22"},3,null,2.2337962962962967E-3,{"$f":"SUM(Q27:Q29)","v":"00:22:14"},null,2.3379629629629631E-3,{"$f":"SUM(T27:T29)","v":"00:20:11"},null,null,null,"UFR Staps Montpellier"]
[null,"U de Montpellier","H",null,"DE PASQUALE","AXEL",6.8055555555555569E-3,null,64.5,7.25,{"$f":"((I28-(1.772*4))/8)","v":7.1764999999999999},4,5.4513888888888884E-3,null,null,null,5.9722222222222225E-3,null,null,5.2546296296296299E-3,null,null,4]
[null,"U de Montpellier","H",null,"BOUET","OLIVIER",7.5115740740740742E-3,null,50.7,5.5,{"$f":"((I29-(1.772*4))/8)","v":5.4515000000000002},4,6.238425925925925E-3,null,null,null,7.2337962962962963E-3,null,null,6.4236111111111117E-3]
[]
["Equipe 6","U de Picardie","F",null,"RIMBERT","VANESSA","?","?",55.9,6.25,{"$f":"((I31-(1.772*4))/8)","v":6.1014999999999997},7,2.673611111111111E-3,{"$f":"SUM(M31:M33)","v":"00:23:44"},7,"F"]
[null,"U de Picardie","H",null,"LOORIUS","JULIEN","?",null,67.150000000000006,7.75,{"$f":"((I32-(1.772*4))/8)","v":7.5077500000000006},7,6.782407407407408E-3]
[null,"U de Picardie","H",null,"MONSIGNA","JOSS","?",null,70.8,8,{"$f":"((I33-(1.772*4))/8)","v":7.9639999999999995},7,7.0254629629629634E-3]
[]
["Equipe 7","UPMC","F",null,"FUGIER","NOEMIE","?","?",62.9,7,{"$f":"((I35-(1.772*4))/8)","v":6.9764999999999997},2,2.5810185185185185E-3,{"$f":"SUM(M35:M37)","v":"00:18:47"},2,null,3.7152777777777774E-3,{"$f":"SUM(Q35:Q37)","v":"00:20:54"},null,"UPMC Paris",null,null,3.2754629629629631E-3,{"$f":"SUM(W35:W37)","v":"00:19:24"}]
[null,"UPMC","H",null,"BOWEN","MAXIMILIEN","?",null,68.650000000000006,7.75,{"$f":"((I36-(1.772*4))/8)","v":7.6952500000000006},2,5.3819444444444453E-3,null,null,null,5.4166666666666669E-3,null,null,null,null,null,4.9305555555555552E-3,null,null,2]
[null,"UPMC","H",null,"JACQUES","QUENTIN","?",null,81.95,9.5,{"$f":"((I37-(1.772*4))/8)","v":9.3577500000000011},2,5.0810185185185186E-3,null,null,null,5.3819444444444453E-3,null,null,null,null,null,5.2662037037037035E-3]
[]
["Remplaçant","U de Montpellier","F",92870,"THOMAS","ALEXANDRE",8.2523148148148148E-3,null,72.25]