{"text_format":"1","workbook":"xlsx","n_sheets":5,"sheets":["Feuil1","HA-FA Filles","HA-FA Garçons","DC EQUIPE","HALTERO FIT BARRE"],"not_rendered":{"charts":0,"images":3,"macros":1,"external_links":2,"defined_names":5,"comments":0,"pivot_tables":0},"unopened":[],"bounds":{"document_bytes":16777216,"sheet_cells":100000,"rows_first":2000,"rows_last":500,"rows_between":2000,"halvings":0,"cell_chars":16384,"cell_head_chars":4096},"cells_cut":0,"cells_raw":0,"read":"whole","date_system":"1900"}

{"sheet":"Feuil1","index":0,"n_rows":29,"n_cols":64,"rows_kept":29,"cut":false,"hidden":true,"merged":[]}
[null,null,"FC1 40","FC1 44","FC1 48","FC1 53","FC1 58","FC1 63","FC1 69","FC1 +69","FC2 44","FC2 48","FC2 53","FC2 58","FC2 63","FC2 69","FC2 +69","FJ48","FJ53","FJ58","FJ63","FJ69","FJ75","FJ+75","FS48","FS53","FS58","FS63","FS69","FS75","FS+75","C1 45","C1 50","C1 56","C1 62","C1 69","C1 77","C1 85","C1 94","C1 +94","C2 50","C2 56","C2 62","C2 69","C2 77","C2 85","C2 94","C2 +94","J56","J62","J69","J77","J85","J94","J105","J+105","S56","S62","S69","S77","S85","S94","S105","S+105"]
[null,"DEBUTANT",20,25,25,35,40,45,50,60,30,35,45,50,55,60,70,45,55,60,65,70,80,90,55,65,70,75,80,95,100,35,40,50,75,85,90,100,110,120,45,65,85,95,110,120,125,135,80,90,110,130,145,150,155,165,95,120,130,150,165,170,175,185]
[null,"DEPARTEMENTAL",25,30,35,45,50,55,60,70,40,45,55,60,65,70,80,55,65,70,75,80,95,100,65,75,80,85,90,105,110,50,55,70,95,105,110,120,130,140,65,85,105,115,130,140,145,155,100,120,130,150,165,170,175,185,115,135,150,170,185,190,195,205]
[null,"REGIONAL",35,40,45,55,60,65,70,80,50,55,65,70,75,80,95,65,75,80,85,90,105,110,75,85,90,95,105,115,125,60,65,85,105,115,130,140,145,155,80,100,120,130,150,160,165,175,115,135,150,170,185,190,195,205,130,150,170,190,205,215,220,225]
[null,"INTERREGIONAL",45,50,55,65,70,75,80,95,60,65,75,80,85,90,105,75,85,90,95,105,115,125,85,95,100,110,120,130,140,75,80,100,120,130,150,160,165,175,95,115,135,150,170,180,185,195,130,150,170,190,205,215,220,225,145,170,190,210,225,235,245,250]
[null,"FEDERAL",50,60,65,75,80,85,90,105,70,75,85,90,95,105,115,85,95,100,110,120,130,140,95,105,115,125,135,145,150,90,95,115,135,150,170,180,185,195,110,130,150,170,185,200,210,220,145,170,190,210,225,235,245,250,170,190,220,240,250,260,270,280]
[null,"NATIONAL",60,70,75,85,90,95,105,115,80,85,95,100,110,120,130,95,105,115,125,135,145,150,110,120,130,140,150,160,170,105,110,130,150,170,185,200,210,220,120,145,170,190,200,220,225,235,170,190,220,240,250,260,270,280,190,210,240,265,280,290,300,310]
[null,"INTERNATIONAL B",70,80,85,95,100,110,120,130,90,95,105,115,125,135,145,110,120,130,140,150,160,170,125,140,150,160,170,180,190,115,120,145,170,190,200,220,225,235,135,170,190,210,220,240,250,260,190,210,240,260,280,290,300,310,210,230,260,285,300,310,325,330]
{"$rows_left_out":22}
{"sheet":"HA-FA Filles","index":1,"n_rows":516,"n_cols":53,"rows_kept":516,"cut":false,"hidden":false,"merged":[[1,17,1,18],[0,17,0,19],[3,24,3,25],[0,3,0,4],[1,3,1,4],[1,13,1,16],[4,0,6,0],[7,0,10,0],[11,0,13,0],[1,5,1,9],[1,10,1,12]]}
[null,null,null,"EPREUVE :",null,"HALTEROPHILIE",null,null,null,"HALTERO/FORCE",null,null,null,null,null,null,"DATE :","2015-05-12"]
[null,null,null,"LIEU :",null,"CLERMONT L'HERAULT",null,null,null,null,"CFU 2015",null,null,null,null,null,null,"ZONE :",null,"SUD",null,null,null,null," "]
[]
["CAT.POIDS","CL.HA","CL.FA","LICENCE","NOMS","Prénoms","AS","Académie","AN","POIDS",1,2,3,"ARR",1,2,3,"EP-J","Total HA",1,2,3,"DC","Total FA","SERIE",null,"Catég","IWF",null," ","DEB ","DEP +","REG +","IRG +","FED +","NAT +","INTB +","INTA +","OLY +"]
["53 kg",2,1,"B10U090677","SEIGNEUR","MANON","Université de Picardie","AMIENS",null,52.8,48,-50,-50,{"$f":"IF(J5=\"\",\"\",IF(MAXA(K5:M5)<=0,0,MAXA(K5:M5)))","v":48},55,60,-63,{"$f":"IF(J5=\"\",\"\",IF(MAXA(O5:Q5)<=0,0,MAXA(O5:Q5)))","v":60},{"$f":"IF(J5=\"\",\"\",IF(OR(N5=0,R5=0),0,N5+R5))","v":108},30,32.5,35,{"$f":"IF(J5=\"\",\"\",IF(MAXA(T5:V5)<=0,0,MAXA(T5:V5)))","v":35},{"$f":"IF(J5=\"\",\"\",IF(OR(R5=0,W5=0),0,R5+W5))","v":95},{"$f":"IF(J5=\"\",\"\",AT5)","v":{"$error":"#REF!"}},{"$f":"IF(AM5>=0,AM5,IF(AL5>=0,AL5,IF(AK5>=0,AK5,IF(AJ5>=0,AJ5,IF(AI5>=0,AI5,IF(AH5>=0,AH5,IF(AG5>=0,AG5,IF(AF5>=0,AF5,AE5))))))))","v":{"$error":"#REF!"}},{"$f":"IF(J5=\"\",\"\",IF(#REF!=\"H\",IF(OR(I5=\"SEN\",I5<1995),VLOOKUP(J5,[1]Feuil1!$A$11:$G$29,6),IF(AND(I5>1994,I5<1998),VLOOKUP(J5,[1]Feuil1!$A$11:$G$29,5),IF(AND(I5>1997,I5<2000),VLOOKUP(J5,[1]Feuil1!$A$11:$G$29,4),IF(AND(I5>1999,I5<2002),VLOOKUP(J5,[1]Feuil1!$A$11:$G$29,3),VLOOKUP(J5,[1]Feuil1!$A$11:$G$29,2))))),IF(OR(I5=\"SEN\",I5<1995),VLOOKUP(J5,[1]Feuil1!$G$11:$L$25,6),IF(AND(I5>1994,I5<1998),VLOOKUP(J5,[1]Feuil1!$G$11:$L$25,5),IF(AND(I5>1997,I5<2000),VLOOKUP(J5,[1]Feuil1!$G$11:$L$25,4),IF(AND(I5>1999,I5<2002),VLOOKUP(J5,[1]Feuil1!$G$11:$L$25,3),VLOOKUP(J5,[1]Feuil1!$G$11:$L$25,2)))))))","v":{"$error":"#REF!"}},{"$f":"IF(J5=\"\",\"\",IF(#REF!=\"H\",10^(0.794358141*LOG(J5/174.393)^2)*S5,IF(#REF!=\"F\",10^(0.89726074*LOG(J5/148.026)^2)*S5,\"\")))","v":{"$error":"#REF!"}},null," ",{"$f":"S5-HLOOKUP(AA5,[1]Feuil1!$C$1:$BL$10,2,FALSE)","v":{"$error":"#REF!"}},{"$f":"S5-HLOOKUP(AA5,[1]Feuil1!$C$1:$BL$10,3,FALSE)","v":{"$error":"#REF!"}},{"$f":"S5-HLOOKUP(AA5,[1]Feuil1!$C$1:$BL$10,4,FALSE)","v":{"$error":"#REF!"}},{"$f":"S5-HLOOKUP(AA5,[1]Feuil1!$C$1:$BL$10,5,FALSE)","v":{"$error":"#REF!"}},{"$f":"S5-HLOOKUP(AA5,[1]Feuil1!$C$1:$BL$10,6,FALSE)","v":{"$error":"#REF!"}},{"$f":"S5-HLOOKUP(AA5,[1]Feuil1!$C$1:$BL$10,7,FALSE)","v":{"$error":"#REF!"}},{"$f":"S5-HLOOKUP(AA5,[1]Feuil1!$C$1:$BL$10,8,FALSE)","v":{"$error":"#REF!"}},{"$f":"S5-HLOOKUP(AA5,[1]Feuil1!$C$1:$BL$10,9,FALSE)","v":{"$error":"#REF!"}},{"$f":"S5-HLOOKUP(AA5,[1]Feuil1!$C$1:$BL$10,10,FALSE)","v":{"$error":"#REF!"}},null,null,null,null,null,null,{"$f":"IF(AM5>=0,$AM$4,IF(AL5>=0,$AL$4,IF(AK5>=0,$AK$4,IF(AJ5>=0,$AJ$4,IF(AI5>=0,$AI$4,IF(AH5>=0,$AH$4,IF(AG5>=0,$AG$4,IF(AF5>=0,$AF$4,$AE$4))))))))","v":{"$error":"#REF!"}}]
[null,1,null,"B101004633","CARON","AMELIE","Université de Picardie","AMIENS",null,53,50,55,58,{"$f":"IF(J6=\"\",\"\",IF(MAXA(K6:M6)<=0,0,MAXA(K6:M6)))","v":58},60,65,-68,65,{"$f":"IF(J6=\"\",\"\",IF(OR(N6=0,R6=0),0,N6+R6))","v":123},null,null,null,{"$f":"IF(I6=\"\",\"\",IF(MAXA(T6:V6)<=0,0,MAXA(T6:V6)))","v":""},{"$f":"IF(I6=\"\",\"\",IF(OR(R6=0,W6=0),0,R6+W6))","v":""},{"$f":"IF(I6=\"\",\"\",AT6)","v":""},{"$error":"#REF!"},{"$f":"IF(J6=\"\",\"\",IF(#REF!=\"H\",IF(OR(I6=\"SEN\",I6<1995),VLOOKUP(J6,[1]Feuil1!$A$11:$G$29,6),IF(AND(I6>1994,I6<1998),VLOOKUP(J6,[1]Feuil1!$A$11:$G$29,5),IF(AND(I6>1997,I6<2000),VLOOKUP(J6,[1]Feuil1!$A$11:$G$29,4),IF(AND(I6>1999,I6<2002),VLOOKUP(J6,[1]Feuil1!$A$11:$G$29,3),VLOOKUP(J6,[1]Feuil1!$A$11:$G$29,2))))),IF(OR(I6=\"SEN\",I6<1995),VLOOKUP(J6,[1]Feuil1!$G$11:$L$25,6),IF(AND(I6>1994,I6<1998),VLOOKUP(J6,[1]Feuil1!$G$11:$L$25,5),IF(AND(I6>1997,I6<2000),VLOOKUP(J6,[1]Feuil1!$G$11:$L$25,4),IF(AND(I6>1999,I6<2002),VLOOKUP(J6,[1]Feuil1!$G$11:$L$25,3),VLOOKUP(J6,[1]Feuil1!$G$11:$L$25,2)))))))","v":{"$error":"#REF!"}},{"$f":"IF(J6=\"\",\"\",IF(#REF!=\"H\",10^(0.794358141*LOG(J6/174.393)^2)*S6,IF(#REF!=\"F\",10^(0.89726074*LOG(J6/148.026)^2)*S6,\"\")))","v":{"$error":"#REF!"}},null," ",{"$f":"S6-HLOOKUP(AA6,[1]Feuil1!$C$1:$BL$10,2,FALSE)","v":{"$error":"#REF!"}},{"$f":"S6-HLOOKUP(AA6,[1]Feuil1!$C$1:$BL$10,3,FALSE)","v":{"$error":"#REF!"}},{"$f":"S6-HLOOKUP(AA6,[1]Feuil1!$C$1:$BL$10,4,FALSE)","v":{"$error":"#REF!"}},{"$f":"S6-HLOOKUP(AA6,[1]Feuil1!$C$1:$BL$10,5,FALSE)","v":{"$error":"#REF!"}},{"$f":"S6-HLOOKUP(AA6,[1]Feuil1!$C$1:$BL$10,6,FALSE)","v":{"$error":"#REF!"}},{"$f":"S6-HLOOKUP(AA6,[1]Feuil1!$C$1:$BL$10,7,FALSE)","v":{"$error":"#REF!"}},{"$f":"S6-HLOOKUP(AA6,[1]Feuil1!$C$1:$BL$10,8,FALSE)","v":{"$error":"#REF!"}},{"$f":"S6-HLOOKUP(AA6,[1]Feuil1!$C$1:$BL$10,9,FALSE)","v":{"$error":"#REF!"}},{"$f":"S6-HLOOKUP(AA6,[1]Feuil1!$C$1:$BL$10,10,FALSE)","v":{"$error":"#REF!"}},null,null,null,null,null,null,{"$error":"#REF!"}]
[null,3,null,"NN11093541","HERRING","LAUREEN","UNIVERSITE MONTPELLIER STAPS","MONTPELLIER",null,52.8,36,39,-41,{"$f":"IF(J7=\"\",\"\",IF(MAXA(K7:M7)<=0,0,MAXA(K7:M7)))","v":39},45,47,49,49,{"$f":"IF(J7=\"\",\"\",IF(OR(N7=0,R7=0),0,N7+R7))","v":88},null,null,null,{"$f":"IF(I7=\"\",\"\",IF(MAXA(T7:V7)<=0,0,MAXA(T7:V7)))","v":""},{"$f":"IF(I7=\"\",\"\",IF(OR(R7=0,W7=0),0,R7+W7))","v":""},"",{"$error":"#REF!"},{"$f":"IF(J7=\"\",\"\",IF(#REF!=\"H\",IF(OR(I7=\"SEN\",I7<1995),VLOOKUP(J7,[1]Feuil1!$A$11:$G$29,6),IF(AND(I7>1994,I7<1998),VLOOKUP(J7,[1]Feuil1!$A$11:$G$29,5),IF(AND(I7>1997,I7<2000),VLOOKUP(J7,[1]Feuil1!$A$11:$G$29,4),IF(AND(I7>1999,I7<2002),VLOOKUP(J7,[1]Feuil1!$A$11:$G$29,3),VLOOKUP(J7,[1]Feuil1!$A$11:$G$29,2))))),IF(OR(I7=\"SEN\",I7<1995),VLOOKUP(J7,[1]Feuil1!$G$11:$L$25,6),IF(AND(I7>1994,I7<1998),VLOOKUP(J7,[1]Feuil1!$G$11:$L$25,5),IF(AND(I7>1997,I7<2000),VLOOKUP(J7,[1]Feuil1!$G$11:$L$25,4),IF(AND(I7>1999,I7<2002),VLOOKUP(J7,[1]Feuil1!$G$11:$L$25,3),VLOOKUP(J7,[1]Feuil1!$G$11:$L$25,2)))))))","v":{"$error":"#REF!"}},{"$f":"IF(J7=\"\",\"\",IF(#REF!=\"H\",10^(0.794358141*LOG(J7/174.393)^2)*S7,IF(#REF!=\"F\",10^(0.89726074*LOG(J7/148.026)^2)*S7,\"\")))","v":{"$error":"#REF!"}},null," ",{"$f":"S7-HLOOKUP(AA7,[1]Feuil1!$C$1:$BL$10,2,FALSE)","v":{"$error":"#REF!"}},{"$f":"S7-HLOOKUP(AA7,[1]Feuil1!$C$1:$BL$10,3,FALSE)","v":{"$error":"#REF!"}},{"$f":"S7-HLOOKUP(AA7,[1]Feuil1!$C$1:$BL$10,4,FALSE)","v":{"$error":"#REF!"}},{"$f":"S7-HLOOKUP(AA7,[1]Feuil1!$C$1:$BL$10,5,FALSE)","v":{"$error":"#REF!"}},{"$f":"S7-HLOOKUP(AA7,[1]Feuil1!$C$1:$BL$10,6,FALSE)","v":{"$error":"#REF!"}},{"$f":"S7-HLOOKUP(AA7,[1]Feuil1!$C$1:$BL$10,7,FALSE)","v":{"$error":"#REF!"}},{"$f":"S7-HLOOKUP(AA7,[1]Feuil1!$C$1:$BL$10,8,FALSE)","v":{"$error":"#REF!"}},{"$f":"S7-HLOOKUP(AA7,[1]Feuil1!$C$1:$BL$10,9,FALSE)","v":{"$error":"#REF!"}},{"$f":"S7-HLOOKUP(AA7,[1]Feuil1!$C$1:$BL$10,10,FALSE)","v":{"$error":"#REF!"}},null,null,null,null,null,null,{"$error":"#REF!"}]
["58 kg",1,3,"B101078461","RIMBERT","VANESSA","Université de Picardie","AMIENS",null,55.9,42,-45,45,{"$f":"IF(J8=\"\",\"\",IF(MAXA(K8:M8)<=0,0,MAXA(K8:M8)))","v":45},52,55,-58,55,{"$f":"IF(J8=\"\",\"\",IF(OR(N8=0,R8=0),0,N8+R8))","v":100},45,-47.5,-47.5,{"$f":"IF(J8=\"\",\"\",IF(MAXA(T8:V8)<=0,0,MAXA(T8:V8)))","v":45},{"$f":"IF(J8=\"\",\"\",IF(OR(R8=0,W8=0),0,R8+W8))","v":100},"",{"$error":"#REF!"},{"$f":"IF(J8=\"\",\"\",IF(#REF!=\"H\",IF(OR(I8=\"SEN\",I8<1995),VLOOKUP(J8,[1]Feuil1!$A$11:$G$29,6),IF(AND(I8>1994,I8<1998),VLOOKUP(J8,[1]Feuil1!$A$11:$G$29,5),IF(AND(I8>1997,I8<2000),VLOOKUP(J8,[1]Feuil1!$A$11:$G$29,4),IF(AND(I8>1999,I8<2002),VLOOKUP(J8,[1]Feuil1!$A$11:$G$29,3),VLOOKUP(J8,[1]Feuil1!$A$11:$G$29,2))))),IF(OR(I8=\"SEN\",I8<1995),VLOOKUP(J8,[1]Feuil1!$G$11:$L$25,6),IF(AND(I8>1994,I8<1998),VLOOKUP(J8,[1]Feuil1!$G$11:$L$25,5),IF(AND(I8>1997,I8<2000),VLOOKUP(J8,[1]Feuil1!$G$11:$L$25,4),IF(AND(I8>1999,I8<2002),VLOOKUP(J8,[1]Feuil1!$G$11:$L$25,3),VLOOKUP(J8,[1]Feuil1!$G$11:$L$25,2)))))))","v":{"$error":"#REF!"}},{"$f":"IF(J8=\"\",\"\",IF(#REF!=\"H\",10^(0.794358141*LOG(J8/174.393)^2)*S8,IF(#REF!=\"F\",10^(0.89726074*LOG(J8/148.026)^2)*S8,\"\")))","v":{"$error":"#REF!"}},null," ",{"$f":"S8-HLOOKUP(AA8,[1]Feuil1!$C$1:$BL$10,2,FALSE)","v":{"$error":"#REF!"}},{"$f":"S8-HLOOKUP(AA8,[1]Feuil1!$C$1:$BL$10,3,FALSE)","v":{"$error":"#REF!"}},{"$f":"S8-HLOOKUP(AA8,[1]Feuil1!$C$1:$BL$10,4,FALSE)","v":{"$error":"#REF!"}},{"$f":"S8-HLOOKUP(AA8,[1]Feuil1!$C$1:$BL$10,5,FALSE)","v":{"$error":"#REF!"}},{"$f":"S8-HLOOKUP(AA8,[1]Feuil1!$C$1:$BL$10,6,FALSE)","v":{"$error":"#REF!"}},{"$f":"S8-HLOOKUP(AA8,[1]Feuil1!$C$1:$BL$10,7,FALSE)","v":{"$error":"#REF!"}},{"$f":"S8-HLOOKUP(AA8,[1]Feuil1!$C$1:$BL$10,8,FALSE)","v":{"$error":"#REF!"}},{"$f":"S8-HLOOKUP(AA8,[1]Feuil1!$C$1:$BL$10,9,FALSE)","v":{"$error":"#REF!"}},{"$f":"S8-HLOOKUP(AA8,[1]Feuil1!$C$1:$BL$10,10,FALSE)","v":{"$error":"#REF!"}},null,null,null,null,null,null,{"$error":"#REF!"}]
{"$rows_left_out":509}
{"sheet":"HA-FA Garçons","index":2,"n_rows":532,"n_cols":49,"rows_kept":532,"cut":false,"hidden":false,"merged":[[1,13,1,16],[1,17,1,18],[0,17,0,19],[0,3,0,4],[1,3,1,4],[18,0,20,0],[21,0,26,0],[13,0,17,0],[1,5,1,9],[1,10,1,12],[4,0,5,0],[7,0,12,0]]}
[null,null,null,"EPREUVE :",null,"HALTEROPHILIE",null,null,null,"HALTERO/FORCE",null,null,null,null,null,null,"DATE :","2015-05-12"]
[null,null,null,"LIEU :",null,"CLERMONT L'HERAULT",null,null,null,null,"CFU 2015",null,null,null,null,null,null,"ZONE :",null,"SUD"]
[]
["CAT.POIDS","CL.HA","CL.FA","LICENCE","NOMS","Prénoms","AS","Académie","AN","POIDS",1,2,3,"ARR",1,2,3,"EP-J","Total HA",1,2,3,"DC","Total FA",null," ","DEB ","DEP +","REG +","IRG +","FED +","NAT +","INTB +","INTA +","OLY +"]
["62kg",1,1,"B101093380","DOLE","ANDY","Université de Picardie","AMIENS",null,61.4,60,-65,65,{"$f":"IF(J5=\"\",\"\",IF(MAXA(K5:M5)<=0,0,MAXA(K5:M5)))","v":65},-78,-78,78,{"$f":"IF(J5=\"\",\"\",IF(MAXA(O5:Q5)<=0,0,MAXA(O5:Q5)))","v":78},{"$f":"IF(J5=\"\",\"\",IF(OR(N5=0,R5=0),0,N5+R5))","v":143},90,-95,-95,{"$f":"IF(J5=\"\",\"\",IF(MAXA(T5:V5)<=0,0,MAXA(T5:V5)))","v":90},{"$f":"IF(J5=\"\",\"\",IF(OR(R5=0,W5=0),0,R5+W5))","v":168},null," ",{"$f":"S5-HLOOKUP(#REF!,Feuil1!$C$1:$BL$10,2,FALSE)","v":{"$error":"#REF!"}},{"$f":"S5-HLOOKUP(#REF!,Feuil1!$C$1:$BL$10,3,FALSE)","v":{"$error":"#REF!"}},{"$f":"S5-HLOOKUP(#REF!,Feuil1!$C$1:$BL$10,4,FALSE)","v":{"$error":"#REF!"}},{"$f":"S5-HLOOKUP(#REF!,Feuil1!$C$1:$BL$10,5,FALSE)","v":{"$error":"#REF!"}},{"$f":"S5-HLOOKUP(#REF!,Feuil1!$C$1:$BL$10,6,FALSE)","v":{"$error":"#REF!"}},{"$f":"S5-HLOOKUP(#REF!,Feuil1!$C$1:$BL$10,7,FALSE)","v":{"$error":"#REF!"}},{"$f":"S5-HLOOKUP(#REF!,Feuil1!$C$1:$BL$10,8,FALSE)","v":{"$error":"#REF!"}},{"$f":"S5-HLOOKUP(#REF!,Feuil1!$C$1:$BL$10,9,FALSE)","v":{"$error":"#REF!"}},{"$f":"S5-HLOOKUP(#REF!,Feuil1!$C$1:$BL$10,10,FALSE)","v":{"$error":"#REF!"}},null,null,null,null,null,null,{"$f":"IF(AI5>=0,$AI$4,IF(AH5>=0,$AH$4,IF(AG5>=0,$AG$4,IF(AF5>=0,$AF$4,IF(AE5>=0,$AE$4,IF(AD5>=0,$AD$4,IF(AC5>=0,$AC$4,IF(AB5>=0,$AB$4,$AA$4))))))))","v":{"$error":"#REF!"}}]
[null,null,null,"NN11093058","RAI ELBALHAA","GREGORY","UNIVERSITE MONTPELLIER STAPS","MONTPELLIER",null,54.95,null,null,null,null,70,73,-75,{"$f":"IF(J6=\"\",\"\",IF(MAXA(O6:Q6)<=0,0,MAXA(O6:Q6)))","v":73},null,-87.5,-87.5,-87.5,{"$f":"IF(J6=\"\",\"\",IF(MAXA(T6:V6)<=0,0,MAXA(T6:V6)))","v":0},{"$f":"IF(J6=\"\",\"\",IF(OR(R6=0,W6=0),0,R6+W6))","v":0},null," ",{"$f":"S6-HLOOKUP(#REF!,Feuil1!$C$1:$BL$10,2,FALSE)","v":{"$error":"#REF!"}},{"$f":"S6-HLOOKUP(#REF!,Feuil1!$C$1:$BL$10,3,FALSE)","v":{"$error":"#REF!"}},{"$f":"S6-HLOOKUP(#REF!,Feuil1!$C$1:$BL$10,4,FALSE)","v":{"$error":"#REF!"}},{"$f":"S6-HLOOKUP(#REF!,Feuil1!$C$1:$BL$10,5,FALSE)","v":{"$error":"#REF!"}},{"$f":"S6-HLOOKUP(#REF!,Feuil1!$C$1:$BL$10,6,FALSE)","v":{"$error":"#REF!"}},{"$f":"S6-HLOOKUP(#REF!,Feuil1!$C$1:$BL$10,7,FALSE)","v":{"$error":"#REF!"}},{"$f":"S6-HLOOKUP(#REF!,Feuil1!$C$1:$BL$10,8,FALSE)","v":{"$error":"#REF!"}},{"$f":"S6-HLOOKUP(#REF!,Feuil1!$C$1:$BL$10,9,FALSE)","v":{"$error":"#REF!"}},{"$f":"S6-HLOOKUP(#REF!,Feuil1!$C$1:$BL$10,10,FALSE)","v":{"$error":"#REF!"}},null,null,null,null,null,null,{"$f":"IF(AI6>=0,$AI$4,IF(AH6>=0,$AH$4,IF(AG6>=0,$AG$4,IF(AF6>=0,$AF$4,IF(AE6>=0,$AE$4,IF(AD6>=0,$AD$4,IF(AC6>=0,$AC$4,IF(AB6>=0,$AB$4,$AA$4))))))))","v":{"$error":"#REF!"}}]
[null,null,2,"S600049615","BOWEN","Maximilien","UPMC","PARIS",null,68.650000000000006,null,null,null,null,95,-100,-100,95,null,-107.5,107.5,-115,{"$f":"IF(J7=\"\",\"\",IF(MAXA(T7:V7)<=0,0,MAXA(T7:V7)))","v":107.5},202.5]
["69kg",null,5,"B101011691","LOORIUS","JULIEN","Université de Picardie","AMIENS",null,67.150000000000006,null,null,null,null,70,-75,-75,70,null,110,115,-117.5,{"$f":"IF(J8=\"\",\"\",IF(MAXA(T8:V8)<=0,0,MAXA(T8:V8)))","v":115},185,null," ",{"$f":"S8-HLOOKUP(#REF!,Feuil1!$C$1:$BL$10,2,FALSE)","v":{"$error":"#REF!"}},{"$f":"S8-HLOOKUP(#REF!,Feuil1!$C$1:$BL$10,3,FALSE)","v":{"$error":"#REF!"}},{"$f":"S8-HLOOKUP(#REF!,Feuil1!$C$1:$BL$10,4,FALSE)","v":{"$error":"#REF!"}},{"$f":"S8-HLOOKUP(#REF!,Feuil1!$C$1:$BL$10,5,FALSE)","v":{"$error":"#REF!"}},{"$f":"S8-HLOOKUP(#REF!,Feuil1!$C$1:$BL$10,6,FALSE)","v":{"$error":"#REF!"}},{"$f":"S8-HLOOKUP(#REF!,Feuil1!$C$1:$BL$10,7,FALSE)","v":{"$error":"#REF!"}},{"$f":"S8-HLOOKUP(#REF!,Feuil1!$C$1:$BL$10,8,FALSE)","v":{"$error":"#REF!"}},{"$f":"S8-HLOOKUP(#REF!,Feuil1!$C$1:$BL$10,9,FALSE)","v":{"$error":"#REF!"}},{"$f":"S8-HLOOKUP(#REF!,Feuil1!$C$1:$BL$10,10,FALSE)","v":{"$error":"#REF!"}},null,null,null,null,null,null,{"$f":"IF(AI8>=0,$AI$4,IF(AH8>=0,$AH$4,IF(AG8>=0,$AG$4,IF(AF8>=0,$AF$4,IF(AE8>=0,$AE$4,IF(AD8>=0,$AD$4,IF(AC8>=0,$AC$4,IF(AB8>=0,$AB$4,$AA$4))))))))","v":{"$error":"#REF!"}}]
{"$rows_left_out":525}
{"sheet":"DC EQUIPE","index":3,"n_rows":55,"n_cols":18,"rows_kept":55,"cut":false,"hidden":false,"merged":[[49,0,54,0],[49,5,54,5],[49,6,54,6],[49,17,54,17],[37,2,42,2],[43,2,48,2],[49,2,54,2],[37,5,42,5],[37,6,42,6],[37,17,42,17],[43,0,48,0],[43,5,48,5],[43,6,48,6],[43,17,48,17],[25,2,30,2],[25,5,30,5],[25,6,30,6],[25,17,30,17],[31,0,36,0],[31,2,36,2],[31,5,36,5],[31,6,36,6],[31,17,36,17],[4,0,9,0],[10,0,15,0],[25,0,30,0],[37,0,42,0],[16,0,21,0],[16,17,21,17],[16,5,21,5],[16,6,21,6],[16,2,21,2],[0,10,0,14],[3,15,3,16],[0,3,0,6],[1,7,1,8],[4,5,9,5],[4,6,9,6],[4,17,9,17],[10,17,15,17],[4,2,9,2],[10,5,15,5],[10,6,15,6],[10,2,15,2]]}
[null,null,"EPREUVE :","DC PAR EQUIPE -CFU 2015",null,null,null,null,"DATE :",null,"2015-05-13"]
[null,null,"LIEU :",null,null,"CLERMONT L'HERAULT",null,"ZONE :",null,null,null,"SUD"]
[]
[null,"SEXE","Class.","NOM","PRENOM","AS","Académie","N°","POIDS DE CORPS","BR",2,3,4,"PERF.","POINTS IND.","CATEGORIE",null,"POINTS EQUIPE"]
["EQUIPE 1","F",1,"MORO","MARLENE","Université Montpellier STAPS","MONTPELLIER",1,55.2,null,52.5,55,-57.5,{"$f":"IF(H5=\"\",\"\",IF(MAXA(J5:M5)<=0,0,MAXA(J5:M5)))","v":55},{"$f":"IF(N5=\"\",0,N5-(I5/2))","v":27.4},{"$f":"IF(I5=\"\",\"\",IF(B5=\"H\",IF(OR(H5=\"SEN\",H5<1995),VLOOKUP(I5,[2]Feuil1!$A$11:$G$29,6),IF(AND(H5>1994,H5<1998),VLOOKUP(I5,[2]Feuil1!$A$11:$G$29,5),IF(AND(H5>1997,H5<2000),VLOOKUP(I5,[2]Feuil1!$A$11:$G$29,4),IF(AND(H5>1999,H5<2002),VLOOKUP(I5,[2]Feuil1!$A$11:$G$29,3),VLOOKUP(I5,[2]Feuil1!$A$11:$G$29,2))))),IF(OR(H5=\"SEN\",H5<1995),VLOOKUP(I5,[2]Feuil1!$G$11:$L$25,6),IF(AND(H5>1994,H5<1998),VLOOKUP(I5,[2]Feuil1!$G$11:$L$25,5),IF(AND(H5>1997,H5<2000),VLOOKUP(I5,[2]Feuil1!$G$11:$L$25,4),IF(AND(H5>1999,H5<2002),VLOOKUP(I5,[2]Feuil1!$G$11:$L$25,3),VLOOKUP(I5,[2]Feuil1!$G$11:$L$25,2)))))))","v":"FS58"},null,{"$f":"SUM(O5:O10)","v":253}]
[null,"F",null,"REGNIER","CLAIRE",null,null,2,64,55,60,62.5,65,65,{"$f":"IF(N6=\"\",0,N6-(I6/2))","v":33},{"$f":"IF(I6=\"\",\"\",IF(B6=\"H\",IF(OR(H6=\"SEN\",H6<1995),VLOOKUP(I6,[2]Feuil1!$A$11:$G$29,6),IF(AND(H6>1994,H6<1998),VLOOKUP(I6,[2]Feuil1!$A$11:$G$29,5),IF(AND(H6>1997,H6<2000),VLOOKUP(I6,[2]Feuil1!$A$11:$G$29,4),IF(AND(H6>1999,H6<2002),VLOOKUP(I6,[2]Feuil1!$A$11:$G$29,3),VLOOKUP(I6,[2]Feuil1!$A$11:$G$29,2))))),IF(OR(H6=\"SEN\",H6<1995),VLOOKUP(I6,[2]Feuil1!$G$11:$L$25,6),IF(AND(H6>1994,H6<1998),VLOOKUP(I6,[2]Feuil1!$G$11:$L$25,5),IF(AND(H6>1997,H6<2000),VLOOKUP(I6,[2]Feuil1!$G$11:$L$25,4),IF(AND(H6>1999,H6<2002),VLOOKUP(I6,[2]Feuil1!$G$11:$L$25,3),VLOOKUP(I6,[2]Feuil1!$G$11:$L$25,2)))))))","v":"FS69"}]
[null,"H",null,"VILLEBRUN","FLORENT",null,null,3,77.599999999999994,65,-110,110,-115,110,{"$f":"IF(N7=\"\",0,N7-(I7/1))","v":32.400000000000006},{"$f":"IF(I7=\"\",\"\",IF(B7=\"H\",IF(OR(H7=\"SEN\",H7<1995),VLOOKUP(I7,[2]Feuil1!$A$11:$G$29,6),IF(AND(H7>1994,H7<1998),VLOOKUP(I7,[2]Feuil1!$A$11:$G$29,5),IF(AND(H7>1997,H7<2000),VLOOKUP(I7,[2]Feuil1!$A$11:$G$29,4),IF(AND(H7>1999,H7<2002),VLOOKUP(I7,[2]Feuil1!$A$11:$G$29,3),VLOOKUP(I7,[2]Feuil1!$A$11:$G$29,2))))),IF(OR(H7=\"SEN\",H7<1995),VLOOKUP(I7,[2]Feuil1!$G$11:$L$25,6),IF(AND(H7>1994,H7<1998),VLOOKUP(I7,[2]Feuil1!$G$11:$L$25,5),IF(AND(H7>1997,H7<2000),VLOOKUP(I7,[2]Feuil1!$G$11:$L$25,4),IF(AND(H7>1999,H7<2002),VLOOKUP(I7,[2]Feuil1!$G$11:$L$25,3),VLOOKUP(I7,[2]Feuil1!$G$11:$L$25,2)))))))","v":"S85"}]
[null,"H",null,"CHANTI","NIDAL",null,null,4,77.5,110,120,125,-130,125,{"$f":"IF(N8=\"\",0,N8-(I8/1))","v":47.5},{"$f":"IF(I8=\"\",\"\",IF(B8=\"H\",IF(OR(H8=\"SEN\",H8<1995),VLOOKUP(I8,[2]Feuil1!$A$11:$G$29,6),IF(AND(H8>1994,H8<1998),VLOOKUP(I8,[2]Feuil1!$A$11:$G$29,5),IF(AND(H8>1997,H8<2000),VLOOKUP(I8,[2]Feuil1!$A$11:$G$29,4),IF(AND(H8>1999,H8<2002),VLOOKUP(I8,[2]Feuil1!$A$11:$G$29,3),VLOOKUP(I8,[2]Feuil1!$A$11:$G$29,2))))),IF(OR(H8=\"SEN\",H8<1995),VLOOKUP(I8,[2]Feuil1!$G$11:$L$25,6),IF(AND(H8>1994,H8<1998),VLOOKUP(I8,[2]Feuil1!$G$11:$L$25,5),IF(AND(H8>1997,H8<2000),VLOOKUP(I8,[2]Feuil1!$G$11:$L$25,4),IF(AND(H8>1999,H8<2002),VLOOKUP(I8,[2]Feuil1!$G$11:$L$25,3),VLOOKUP(I8,[2]Feuil1!$G$11:$L$25,2)))))))","v":"S85"}]
{"$rows_left_out":48}
{"sheet":"HALTERO FIT BARRE","index":4,"n_rows":39,"n_cols":26,"rows_kept":39,"cut":false,"hidden":false,"merged":[[10,17,12,17],[18,17,20,17],[34,17,36,17],[26,17,28,17],[8,9,8,12],[30,13,32,13],[34,13,36,13],[10,13,12,13],[14,13,16,13],[18,13,20,13],[22,13,24,13],[26,13,28,13],[0,0,0,5],[1,2,1,3],[2,2,2,3],[1,0,2,1],[1,4,1,5],[2,4,2,5],[7,0,7,1],[8,0,8,1],[7,2,7,3],[8,2,8,3],[7,4,7,5],[8,4,8,6],[34,0,36,0],[34,7,36,7],[22,0,24,0],[22,7,24,7],[26,0,28,0],[26,7,28,7],[30,0,32,0],[30,7,32,7],[10,0,12,0],[10,7,12,7],[14,0,16,0],[14,7,16,7],[18,0,20,0],[18,7,20,7],[6,18,6,26],[10,19,12,20],[18,24,20,25],[26,24,28,25],[34,19,36,20],[10,23,12,23],[18,20,20,20],[26,20,28,20],[34,23,36,23]]}
["Déroulement des épreuves d'Hatéro Fit Barre : 7 équipes inscrites",null,null,null,null,null,null,null,null,"Poids","Chaque côté","Charge réelle","Charge totale ",null,"vérification"]
["Mardi 12 mai : 11H30 1/4 de finale",null,"Mardi 12 mai : 15H15 1/2 finales",null,"Jeudi 13 mai : 11H Finale et Classements",null,null,null,null,66.95,{"$f":"((J2-(1.772*4))/8)","v":7.4827500000000002},8,{"$f":"(L2*8)+(1.772*4)","v":71.087999999999994},null,{"$f":"(((J2/4)-1.772))/2","v":7.4827500000000002}]
[null,null,"et 1er tour Classement",null,"définitif ",null,null,null,null,"Bleu",3,2,{"$f":"K3*L3","v":6}]
["1ère série","M1: Eq4 - Eq5","1ère série","M5 1/2 finale : 1 - 4","1ère série","M9* Clas : 5 - 6 ",null,null,null,"Rouge",2,0,{"$f":"K4*L4","v":0}]
["2ème série ","M2 : Eq3 - Eq6","2ème série ","M6 1/2 finale : 2 - 3","2ème série ","M10* Cla : 7 seul e",null,null,null,"Vert",1,null,{"$f":"K5*L5","v":0}]
["3ème série","M3: Eq2-Eq7","3ème série","M7* Clas M7 : 5 - 7","3ème série","Place 3/4 : Pd M5 - Pd M6",null,null,null,"Noire",1.25,1,{"$f":"K6*L6","v":1.25}]
["4ème série","M4: Eq1 seule","4ème série","M8* Clas : 6 seule","4ème série","Finale :  Vq M5 -Vq M6",null,null,null,"Jaune",0.5,1,{"$f":"K7*L7","v":0.5},null,null,null,null,null,"Finale"]
["A l'ssue des 1/4 de Finale, les équipes sont",null,"1/2 finales pour les équipes classées de ",null,"Finales et fin de classement ",null,null,null,null,null,null,null,{"$f":"SUM(M3:M7)","v":7.75}]
{"$rows_left_out":31}