{"text_format":"1","workbook":"xlsx","n_sheets":3,"sheets":["MINIMES FILLES","MINIMES GARCONS","Feuil1"],"not_rendered":{"charts":0,"images":0,"macros":1,"external_links":0,"defined_names":4,"comments":2,"pivot_tables":0},"unopened":[],"bounds":{"document_bytes":16777216,"sheet_cells":100000,"rows_first":2000,"rows_last":500,"rows_between":2000,"halvings":0,"cell_chars":16384,"cell_head_chars":4096},"cells_cut":0,"cells_raw":0,"read":"whole","date_system":"1900"}

{"sheet":"MINIMES FILLES","index":0,"n_rows":551,"n_cols":48,"rows_kept":551,"cut":false,"hidden":false,"merged":[[0,6,0,14],[0,18,0,21],[1,5,1,10],[1,11,1,13],[1,14,1,17],[1,18,1,19],[1,21,1,22]]}
[null,null,null,"LISTING NATIONAL",null,null,"MINIMES FILLES",null,null,null,null,null,null,null,null,null,"DATE :",null,"2015-03-08"]
[null,null,null," ",null,null,null,null,null,null,null,"2° TRIMESTRE"]
[]
["SEXE","ZONE","REG.","Place","LICENCE","NOMS","Prénoms","AN","POIDS","CLUB","NAT",1,2,3,"ARR",1,2,3,"EP-J","TOTAL","IWF","Points",null,"Catég"," ","DEP +","REG +","IRG +","FED +","NAT +","INTB +","INTA +","OLY +","NCL"]
[null,null,null,null,null,null,null,null,null,null,null,null,null,null,null,null,null,null,null,null,null,null,null,null,null,{"$f":"T5-HLOOKUP(X5,#REF!,2,FALSE)","v":{"$error":"#REF!"}},{"$f":"T5-HLOOKUP(X5,#REF!,3,FALSE)","v":{"$error":"#REF!"}},{"$f":"T5-HLOOKUP(X5,#REF!,4,FALSE)","v":{"$error":"#REF!"}},{"$f":"T5-HLOOKUP(X5,#REF!,5,FALSE)","v":{"$error":"#REF!"}},{"$f":"T5-HLOOKUP(X5,#REF!,6,FALSE)","v":{"$error":"#REF!"}},{"$f":"T5-HLOOKUP(X5,#REF!,7,FALSE)","v":{"$error":"#REF!"}},{"$f":"T5-HLOOKUP(X5,#REF!,8,FALSE)","v":{"$error":"#REF!"}},{"$f":"T5-HLOOKUP(X5,#REF!,9,FALSE)","v":{"$error":"#REF!"}},null,null,null,null,null,null,null,{"$f":"IF(AG5>=0,$AG$4,IF(AF5>=0,$AF$4,IF(AE5>=0,$AE$4,IF(AD5>=0,$AD$4,IF(AC5>=0,$AC$4,IF(AB5>=0,$AB$4,IF(AA5>=0,$AA$4,IF(Z5>=0,$Z$4,$AH$4))))))))","v":{"$error":"#REF!"}}]
["F","NORD","PIC",1,386173,"POTARD","Cindy",2002,31.04,"Péronne AAEEP","F",14,16,-18,{"$f":"IF(MAXA(L6+M6,M6+N6,L6+N6,L6,M6,N6)<=0,0,MAXA(L6+M6,M6+N6,L6+N6,L6,M6,N6))","v":30},20,22,24,{"$f":"IF(MAXA(P6+Q6,Q6+R6,P6+R6,P6,Q6,R6)<=0,0,MAXA(P6+Q6,Q6+R6,P6+R6,P6,Q6,R6))","v":46},{"$f":"IF(H6=\"\",\"\",IF(OR(O6=0,S6=0),0,O6+S6))","v":76},{"$f":"IF(I6=\"\",\"\",IF(A6=\"H\",10^(0.794358141*LOG(I6/174.393)^2)*T6,IF(A6=\"F\",10^(0.89726074 * LOG(I6/148.026)^2)*T6,\"\")))","v":196.68744967316121},{"$f":"SUM(T6-I6)","v":44.96},null,{"$f":"IF(A6=\"F\",(IF(OR(H6>2001,H6<2004),VLOOKUP(I6,Feuil1!$G$11:$H$25,2))),IF(A6=\"H\",(IF(OR(H6>2001,H6<2004),VLOOKUP(I6,Feuil1!$A$11:$F$29,2)))))","v":"FM36"},null,{"$f":"T6-HLOOKUP(X6,#REF!,2,FALSE)","v":{"$error":"#REF!"}},{"$f":"T6-HLOOKUP(X6,#REF!,3,FALSE)","v":{"$error":"#REF!"}},{"$f":"T6-HLOOKUP(X6,#REF!,4,FALSE)","v":{"$error":"#REF!"}},{"$f":"T6-HLOOKUP(X6,#REF!,5,FALSE)","v":{"$error":"#REF!"}},{"$f":"T6-HLOOKUP(X6,#REF!,6,FALSE)","v":{"$error":"#REF!"}},{"$f":"T6-HLOOKUP(X6,#REF!,7,FALSE)","v":{"$error":"#REF!"}},{"$f":"T6-HLOOKUP(X6,#REF!,8,FALSE)","v":{"$error":"#REF!"}},{"$f":"T6-HLOOKUP(X6,#REF!,9,FALSE)","v":{"$error":"#REF!"}},null,null,null,null,null,null,null,{"$error":"#REF!"}]
["F","SEST","RAL",2,352111,"PICOT","Zianne",2003,34.54,"CH Saint Baldoph","F",10,12,14,{"$f":"IF(MAXA(L7+M7,M7+N7,L7+N7,L7,M7,N7)<=0,0,MAXA(L7+M7,M7+N7,L7+N7,L7,M7,N7))","v":26},16,18,-20,{"$f":"IF(MAXA(P7+Q7,Q7+R7,P7+R7,P7,Q7,R7)<=0,0,MAXA(P7+Q7,Q7+R7,P7+R7,P7,Q7,R7))","v":34},{"$f":"IF(H7=\"\",\"\",IF(OR(O7=0,S7=0),0,O7+S7))","v":60},{"$f":"IF(I7=\"\",\"\",IF(A7=\"H\",10^(0.794358141*LOG(I7/174.393)^2)*T7,IF(A7=\"F\",10^(0.89726074 * LOG(I7/148.026)^2)*T7,\"\")))","v":136.9482531154643},{"$f":"SUM(T7-I7)","v":25.46},null,{"$f":"IF(A7=\"F\",(IF(OR(H7>2001,H7<2004),VLOOKUP(I7,Feuil1!$G$11:$H$25,2))),IF(A7=\"H\",(IF(OR(H7>2001,H7<2004),VLOOKUP(I7,Feuil1!$A$11:$F$29,2)))))","v":"FM36"},null,{"$f":"T7-HLOOKUP(X7,#REF!,2,FALSE)","v":{"$error":"#REF!"}},{"$f":"T7-HLOOKUP(X7,#REF!,3,FALSE)","v":{"$error":"#REF!"}},{"$f":"T7-HLOOKUP(X7,#REF!,4,FALSE)","v":{"$error":"#REF!"}},{"$f":"T7-HLOOKUP(X7,#REF!,5,FALSE)","v":{"$error":"#REF!"}},{"$f":"T7-HLOOKUP(X7,#REF!,6,FALSE)","v":{"$error":"#REF!"}},{"$f":"T7-HLOOKUP(X7,#REF!,7,FALSE)","v":{"$error":"#REF!"}},{"$f":"T7-HLOOKUP(X7,#REF!,8,FALSE)","v":{"$error":"#REF!"}},{"$f":"T7-HLOOKUP(X7,#REF!,9,FALSE)","v":{"$error":"#REF!"}},null,null,null,null,null,null,null,{"$error":"#REF!"}]
["F","NORD","PIC",3,377089,"THIERRY","Charlotte",2003,23.2,"La Ferté Milon CMHM","F",10,12,-14,{"$f":"IF(MAXA(L8+M8,M8+N8,L8+N8,L8,M8,N8)<=0,0,MAXA(L8+M8,M8+N8,L8+N8,L8,M8,N8))","v":22},15,16,17,{"$f":"IF(MAXA(P8+Q8,Q8+R8,P8+R8,P8,Q8,R8)<=0,0,MAXA(P8+Q8,Q8+R8,P8+R8,P8,Q8,R8))","v":33},{"$f":"IF(H8=\"\",\"\",IF(OR(O8=0,S8=0),0,O8+S8))","v":55},{"$f":"IF(I8=\"\",\"\",IF(A8=\"H\",10^(0.794358141*LOG(I8/174.393)^2)*T8,IF(A8=\"F\",10^(0.89726074 * LOG(I8/148.026)^2)*T8,\"\")))","v":209.69759005613093},{"$f":"SUM(T8-I8)","v":31.8},null,{"$f":"IF(A8=\"F\",(IF(OR(H8>2001,H8<2004),VLOOKUP(I8,Feuil1!$G$11:$H$25,2))),IF(A8=\"H\",(IF(OR(H8>2001,H8<2004),VLOOKUP(I8,Feuil1!$A$11:$F$29,2)))))","v":"FM36"},null,{"$f":"T8-HLOOKUP(X8,#REF!,2,FALSE)","v":{"$error":"#REF!"}},{"$f":"T8-HLOOKUP(X8,#REF!,3,FALSE)","v":{"$error":"#REF!"}},{"$f":"T8-HLOOKUP(X8,#REF!,4,FALSE)","v":{"$error":"#REF!"}},{"$f":"T8-HLOOKUP(X8,#REF!,5,FALSE)","v":{"$error":"#REF!"}},{"$f":"T8-HLOOKUP(X8,#REF!,6,FALSE)","v":{"$error":"#REF!"}},{"$f":"T8-HLOOKUP(X8,#REF!,7,FALSE)","v":{"$error":"#REF!"}},{"$f":"T8-HLOOKUP(X8,#REF!,8,FALSE)","v":{"$error":"#REF!"}},{"$f":"T8-HLOOKUP(X8,#REF!,9,FALSE)","v":{"$error":"#REF!"}},null,null,null,null,null,null,null,{"$f":"IF(AG8>=0,$AG$4,IF(AF8>=0,$AF$4,IF(AE8>=0,$AE$4,IF(AD8>=0,$AD$4,IF(AC8>=0,$AC$4,IF(AB8>=0,$AB$4,IF(AA8>=0,$AA$4,IF(Z8>=0,$Z$4,$AH$4))))))))","v":{"$error":"#REF!"}}]
[null,null,null,null,null,null,null,null,null,null,null,null,null,null,null,null,null,null,null,null,null,null,null,null,null,{"$f":"T9-HLOOKUP(X9,#REF!,2,FALSE)","v":{"$error":"#REF!"}},{"$f":"T9-HLOOKUP(X9,#REF!,3,FALSE)","v":{"$error":"#REF!"}},{"$f":"T9-HLOOKUP(X9,#REF!,4,FALSE)","v":{"$error":"#REF!"}},{"$f":"T9-HLOOKUP(X9,#REF!,5,FALSE)","v":{"$error":"#REF!"}},{"$f":"T9-HLOOKUP(X9,#REF!,6,FALSE)","v":{"$error":"#REF!"}},{"$f":"T9-HLOOKUP(X9,#REF!,7,FALSE)","v":{"$error":"#REF!"}},{"$f":"T9-HLOOKUP(X9,#REF!,8,FALSE)","v":{"$error":"#REF!"}},{"$f":"T9-HLOOKUP(X9,#REF!,9,FALSE)","v":{"$error":"#REF!"}},null,null,null,null,null,null,null,{"$error":"#REF!"}]
["F","NE","ALS",1,354663,"SCHULTZ","LEANE",2003,38.35,"US Wittenheim","F",17,19,21,{"$f":"IF(MAXA(L10+M10,M10+N10,L10+N10,L10,M10,N10)<=0,0,MAXA(L10+M10,M10+N10,L10+N10,L10,M10,N10))","v":40},25,27,29,{"$f":"IF(MAXA(P10+Q10,Q10+R10,P10+R10,P10,Q10,R10)<=0,0,MAXA(P10+Q10,Q10+R10,P10+R10,P10,Q10,R10))","v":56},{"$f":"IF(H10=\"\",\"\",IF(OR(O10=0,S10=0),0,O10+S10))","v":96},{"$f":"IF(I10=\"\",\"\",IF(A10=\"H\",10^(0.794358141*LOG(I10/174.393)^2)*T10,IF(A10=\"F\",10^(0.89726074 * LOG(I10/148.026)^2)*T10,\"\")))","v":195.42919978501948},{"$f":"SUM(T10-I10)","v":57.65},null,{"$f":"IF(A10=\"F\",(IF(OR(H10>2001,H10<2004),VLOOKUP(I10,Feuil1!$G$11:$H$25,2))),IF(A10=\"H\",(IF(OR(H10>2001,H10<2004),VLOOKUP(I10,Feuil1!$A$11:$F$29,2)))))","v":"FM40"},null,{"$f":"T10-HLOOKUP(X10,#REF!,2,FALSE)","v":{"$error":"#REF!"}},{"$f":"T10-HLOOKUP(X10,#REF!,3,FALSE)","v":{"$error":"#REF!"}},{"$f":"T10-HLOOKUP(X10,#REF!,4,FALSE)","v":{"$error":"#REF!"}},{"$f":"T10-HLOOKUP(X10,#REF!,5,FALSE)","v":{"$error":"#REF!"}},{"$f":"T10-HLOOKUP(X10,#REF!,6,FALSE)","v":{"$error":"#REF!"}},{"$f":"T10-HLOOKUP(X10,#REF!,7,FALSE)","v":{"$error":"#REF!"}},{"$f":"T10-HLOOKUP(X10,#REF!,8,FALSE)","v":{"$error":"#REF!"}},{"$f":"T10-HLOOKUP(X10,#REF!,9,FALSE)","v":{"$error":"#REF!"}},null,null,null,null,null,null,null,{"$f":"IF(AG10>=0,$AG$4,IF(AF10>=0,$AF$4,IF(AE10>=0,$AE$4,IF(AD10>=0,$AD$4,IF(AC10>=0,$AC$4,IF(AB10>=0,$AB$4,IF(AA10>=0,$AA$4,IF(Z10>=0,$Z$4,$AH$4))))))))","v":{"$error":"#REF!"}}]
["F","SEST","RAL",2,352111,"PICOT","Zianne",2003,37.4,"CH Saint Baldoph","F",18,19,20,39,23,25,27,52,91,190.25367748123449,53.6,null,{"$f":"IF(A11=\"F\",(IF(OR(H11>2001,H11<2004),VLOOKUP(I11,Feuil1!$G$11:$H$25,2))),IF(A11=\"H\",(IF(OR(H11>2001,H11<2004),VLOOKUP(I11,Feuil1!$A$11:$F$29,2)))))","v":"FM40"},null,{"$f":"T11-HLOOKUP(X11,#REF!,2,FALSE)","v":{"$error":"#REF!"}},{"$f":"T11-HLOOKUP(X11,#REF!,3,FALSE)","v":{"$error":"#REF!"}},{"$f":"T11-HLOOKUP(X11,#REF!,4,FALSE)","v":{"$error":"#REF!"}},{"$f":"T11-HLOOKUP(X11,#REF!,5,FALSE)","v":{"$error":"#REF!"}},{"$f":"T11-HLOOKUP(X11,#REF!,6,FALSE)","v":{"$error":"#REF!"}},{"$f":"T11-HLOOKUP(X11,#REF!,7,FALSE)","v":{"$error":"#REF!"}},{"$f":"T11-HLOOKUP(X11,#REF!,8,FALSE)","v":{"$error":"#REF!"}},{"$f":"T11-HLOOKUP(X11,#REF!,9,FALSE)","v":{"$error":"#REF!"}},null,null,null,null,null,null,null,{"$error":"#REF!"}]
["F","CO","PDL",3,386516,"ABRAHAM","Ines-Sarah",2002,38.1,"CJF LAVAL - VOUTRÉ","F",15,17,19,36,17,19,21,40,76,155.78616917683112,37.9,null,{"$f":"IF(A12=\"F\",(IF(OR(H12>2001,H12<2004),VLOOKUP(I12,Feuil1!$G$11:$H$25,2))),IF(A12=\"H\",(IF(OR(H12>2001,H12<2004),VLOOKUP(I12,Feuil1!$A$11:$F$29,2)))))","v":"FM40"},null,{"$f":"T12-HLOOKUP(X12,#REF!,2,FALSE)","v":{"$error":"#REF!"}},{"$f":"T12-HLOOKUP(X12,#REF!,3,FALSE)","v":{"$error":"#REF!"}},{"$f":"T12-HLOOKUP(X12,#REF!,4,FALSE)","v":{"$error":"#REF!"}},{"$f":"T12-HLOOKUP(X12,#REF!,5,FALSE)","v":{"$error":"#REF!"}},{"$f":"T12-HLOOKUP(X12,#REF!,6,FALSE)","v":{"$error":"#REF!"}},{"$f":"T12-HLOOKUP(X12,#REF!,7,FALSE)","v":{"$error":"#REF!"}},{"$f":"T12-HLOOKUP(X12,#REF!,8,FALSE)","v":{"$error":"#REF!"}},{"$f":"T12-HLOOKUP(X12,#REF!,9,FALSE)","v":{"$error":"#REF!"}},null,null,null,null,null,null,null,{"$error":"#REF!"}]
["F","N-E","LOR",4,282113,"LEYSER","Aline",2003,39.299999999999997,"H.VALLEROY-AUBOUÉ","F",-13,13,14,27,16,17,18,35,62,123.03392799072296,22.700000000000003,null,{"$f":"IF(A13=\"F\",(IF(OR(H13>2001,H13<2004),VLOOKUP(I13,Feuil1!$G$11:$H$25,2))),IF(A13=\"H\",(IF(OR(H13>2001,H13<2004),VLOOKUP(I13,Feuil1!$A$11:$F$29,2)))))","v":"FM40"},null,{"$f":"T13-HLOOKUP(X13,#REF!,2,FALSE)","v":{"$error":"#REF!"}},{"$f":"T13-HLOOKUP(X13,#REF!,3,FALSE)","v":{"$error":"#REF!"}},{"$f":"T13-HLOOKUP(X13,#REF!,4,FALSE)","v":{"$error":"#REF!"}},{"$f":"T13-HLOOKUP(X13,#REF!,5,FALSE)","v":{"$error":"#REF!"}},{"$f":"T13-HLOOKUP(X13,#REF!,6,FALSE)","v":{"$error":"#REF!"}},{"$f":"T13-HLOOKUP(X13,#REF!,7,FALSE)","v":{"$error":"#REF!"}},{"$f":"T13-HLOOKUP(X13,#REF!,8,FALSE)","v":{"$error":"#REF!"}},{"$f":"T13-HLOOKUP(X13,#REF!,9,FALSE)","v":{"$error":"#REF!"}},null,null,null,null,null,null,null,{"$error":"#REF!"}]
["F","CO","PDL",5,388363,"RENOIR","Anaïs",2003,39.6,"CJF LAVAL - VOUTRÉ","F",12,-14,14,26,13,14,-15,27,53,104.35311777024165,13.399999999999999,null,{"$f":"IF(A14=\"F\",(IF(OR(H14>2001,H14<2004),VLOOKUP(I14,Feuil1!$G$11:$H$25,2))),IF(A14=\"H\",(IF(OR(H14>2001,H14<2004),VLOOKUP(I14,Feuil1!$A$11:$F$29,2)))))","v":"FM40"},null,{"$f":"T14-HLOOKUP(X14,#REF!,2,FALSE)","v":{"$error":"#REF!"}},{"$f":"T14-HLOOKUP(X14,#REF!,3,FALSE)","v":{"$error":"#REF!"}},{"$f":"T14-HLOOKUP(X14,#REF!,4,FALSE)","v":{"$error":"#REF!"}},{"$f":"T14-HLOOKUP(X14,#REF!,5,FALSE)","v":{"$error":"#REF!"}},{"$f":"T14-HLOOKUP(X14,#REF!,6,FALSE)","v":{"$error":"#REF!"}},{"$f":"T14-HLOOKUP(X14,#REF!,7,FALSE)","v":{"$error":"#REF!"}},{"$f":"T14-HLOOKUP(X14,#REF!,8,FALSE)","v":{"$error":"#REF!"}},{"$f":"T14-HLOOKUP(X14,#REF!,9,FALSE)","v":{"$error":"#REF!"}},null,null,null,null,null,null,null,{"$error":"#REF!"}]
["F","NORD","PIC",6,390613,"QUIN-PLOYARD","Ludivine",2002,38.9,"Saleux CHM","F",9,11,13,24,13,14,-15,27,51,102.28526679135062,12.100000000000001,null,{"$f":"IF(A15=\"F\",(IF(OR(H15>2001,H15<2004),VLOOKUP(I15,Feuil1!$G$11:$H$25,2))),IF(A15=\"H\",(IF(OR(H15>2001,H15<2004),VLOOKUP(I15,Feuil1!$A$11:$F$29,2)))))","v":"FM40"},null,{"$f":"T15-HLOOKUP(X15,#REF!,2,FALSE)","v":{"$error":"#REF!"}},{"$f":"T15-HLOOKUP(X15,#REF!,3,FALSE)","v":{"$error":"#REF!"}},{"$f":"T15-HLOOKUP(X15,#REF!,4,FALSE)","v":{"$error":"#REF!"}},{"$f":"T15-HLOOKUP(X15,#REF!,5,FALSE)","v":{"$error":"#REF!"}},{"$f":"T15-HLOOKUP(X15,#REF!,6,FALSE)","v":{"$error":"#REF!"}},{"$f":"T15-HLOOKUP(X15,#REF!,7,FALSE)","v":{"$error":"#REF!"}},{"$f":"T15-HLOOKUP(X15,#REF!,8,FALSE)","v":{"$error":"#REF!"}},{"$f":"T15-HLOOKUP(X15,#REF!,9,FALSE)","v":{"$error":"#REF!"}},null,null,null,null,null,null,null,{"$error":"#REF!"}]
[null,null,null,null,null,null,null,null,null,null,null,null,null,null,null,null,null,null,null,null,null,null,null,null,null,{"$f":"T16-HLOOKUP(X16,#REF!,2,FALSE)","v":{"$error":"#REF!"}},{"$f":"T16-HLOOKUP(X16,#REF!,3,FALSE)","v":{"$error":"#REF!"}},{"$f":"T16-HLOOKUP(X16,#REF!,4,FALSE)","v":{"$error":"#REF!"}},{"$f":"T16-HLOOKUP(X16,#REF!,5,FALSE)","v":{"$error":"#REF!"}},{"$f":"T16-HLOOKUP(X16,#REF!,6,FALSE)","v":{"$error":"#REF!"}},{"$f":"T16-HLOOKUP(X16,#REF!,7,FALSE)","v":{"$error":"#REF!"}},{"$f":"T16-HLOOKUP(X16,#REF!,8,FALSE)","v":{"$error":"#REF!"}},{"$f":"T16-HLOOKUP(X16,#REF!,9,FALSE)","v":{"$error":"#REF!"}},null,null,null,null,null,null,null,{"$error":"#REF!"}]
["F","SEST","CAZ",1,384345,"LEBORGNE DEKOUEL","Marie",2002,43.5,"ES VILLENEUVE LOUBET","F",22,24,26,{"$f":"IF(MAXA(L17+M17,M17+N17,L17+N17,L17,M17,N17)<=0,0,MAXA(L17+M17,M17+N17,L17+N17,L17,M17,N17))","v":50},33,35,-37,{"$f":"IF(MAXA(P17+Q17,Q17+R17,P17+R17,P17,Q17,R17)<=0,0,MAXA(P17+Q17,Q17+R17,P17+R17,P17,Q17,R17))","v":68},{"$f":"IF(H17=\"\",\"\",IF(OR(O17=0,S17=0),0,O17+S17))","v":118},{"$f":"IF(I17=\"\",\"\",IF(A17=\"H\",10^(0.794358141*LOG(I17/174.393)^2)*T17,IF(A17=\"F\",10^(0.89726074 * LOG(I17/148.026)^2)*T17,\"\")))","v":211.68201075704155},{"$f":"SUM(T17-I17)","v":74.5},null,{"$f":"IF(A17=\"F\",(IF(OR(H17>2001,H17<2004),VLOOKUP(I17,Feuil1!$G$11:$H$25,2))),IF(A17=\"H\",(IF(OR(H17>2001,H17<2004),VLOOKUP(I17,Feuil1!$A$11:$F$29,2)))))","v":"FM44"},null,{"$f":"T17-HLOOKUP(X17,#REF!,2,FALSE)","v":{"$error":"#REF!"}},{"$f":"T17-HLOOKUP(X17,#REF!,3,FALSE)","v":{"$error":"#REF!"}},{"$f":"T17-HLOOKUP(X17,#REF!,4,FALSE)","v":{"$error":"#REF!"}},{"$f":"T17-HLOOKUP(X17,#REF!,5,FALSE)","v":{"$error":"#REF!"}},{"$f":"T17-HLOOKUP(X17,#REF!,6,FALSE)","v":{"$error":"#REF!"}},{"$f":"T17-HLOOKUP(X17,#REF!,7,FALSE)","v":{"$error":"#REF!"}},{"$f":"T17-HLOOKUP(X17,#REF!,8,FALSE)","v":{"$error":"#REF!"}},{"$f":"T17-HLOOKUP(X17,#REF!,9,FALSE)","v":{"$error":"#REF!"}},null,null,null,null,null,null,null,{"$f":"IF(AG17>=0,$AG$4,IF(AF17>=0,$AF$4,IF(AE17>=0,$AE$4,IF(AD17>=0,$AD$4,IF(AC17>=0,$AC$4,IF(AB17>=0,$AB$4,IF(AA17>=0,$AA$4,IF(Z17>=0,$Z$4,$AH$4))))))))","v":{"$error":"#REF!"}}]
["F","NE","ALS",2,354663,"SCHULTZ","LEANE",2003,41,"US Wittenheim","F",16,18,20,{"$f":"IF(MAXA(L18+M18,M18+N18,L18+N18,L18,M18,N18)<=0,0,MAXA(L18+M18,M18+N18,L18+N18,L18,M18,N18))","v":38},26,28,30,{"$f":"IF(MAXA(P18+Q18,Q18+R18,P18+R18,P18,Q18,R18)<=0,0,MAXA(P18+Q18,Q18+R18,P18+R18,P18,Q18,R18))","v":58},{"$f":"IF(H18=\"\",\"\",IF(OR(O18=0,S18=0),0,O18+S18))","v":96},{"$f":"IF(I18=\"\",\"\",IF(A18=\"H\",10^(0.794358141*LOG(I18/174.393)^2)*T18,IF(A18=\"F\",10^(0.89726074 * LOG(I18/148.026)^2)*T18,\"\")))","v":182.47343712395269},{"$f":"SUM(T18-I18)","v":55},null,{"$f":"IF(A18=\"F\",(IF(OR(H18>2001,H18<2004),VLOOKUP(I18,Feuil1!$G$11:$H$25,2))),IF(A18=\"H\",(IF(OR(H18>2001,H18<2004),VLOOKUP(I18,Feuil1!$A$11:$F$29,2)))))","v":"FM44"},null,{"$f":"T18-HLOOKUP(X18,#REF!,2,FALSE)","v":{"$error":"#REF!"}},{"$f":"T18-HLOOKUP(X18,#REF!,3,FALSE)","v":{"$error":"#REF!"}},{"$f":"T18-HLOOKUP(X18,#REF!,4,FALSE)","v":{"$error":"#REF!"}},{"$f":"T18-HLOOKUP(X18,#REF!,5,FALSE)","v":{"$error":"#REF!"}},{"$f":"T18-HLOOKUP(X18,#REF!,6,FALSE)","v":{"$error":"#REF!"}},{"$f":"T18-HLOOKUP(X18,#REF!,7,FALSE)","v":{"$error":"#REF!"}},{"$f":"T18-HLOOKUP(X18,#REF!,8,FALSE)","v":{"$error":"#REF!"}},{"$f":"T18-HLOOKUP(X18,#REF!,9,FALSE)","v":{"$error":"#REF!"}},null,null,null,null,null,null,null,{"$f":"IF(AG18>=0,$AG$4,IF(AF18>=0,$AF$4,IF(AE18>=0,$AE$4,IF(AD18>=0,$AD$4,IF(AC18>=0,$AC$4,IF(AB18>=0,$AB$4,IF(AA18>=0,$AA$4,IF(Z18>=0,$Z$4,$AH$4))))))))","v":{"$error":"#REF!"}}]
["F","NORD","NPC",3,349247,"RIQUIER","Cassandra",2003,42,"CHCD COMINES","F",16,18,-20,{"$f":"IF(MAXA(L19+M19,M19+N19,L19+N19,L19,M19,N19)<=0,0,MAXA(L19+M19,M19+N19,L19+N19,L19,M19,N19))","v":34},22,24,26,{"$f":"IF(MAXA(P19+Q19,Q19+R19,P19+R19,P19,Q19,R19)<=0,0,MAXA(P19+Q19,Q19+R19,P19+R19,P19,Q19,R19))","v":50},{"$f":"IF(H19=\"\",\"\",IF(OR(O19=0,S19=0),0,O19+S19))","v":84},{"$f":"IF(I19=\"\",\"\",IF(A19=\"H\",10^(0.794358141*LOG(I19/174.393)^2)*T19,IF(A19=\"F\",10^(0.89726074 * LOG(I19/148.026)^2)*T19,\"\")))","v":155.89596086140224},{"$f":"SUM(T19-I19)","v":42},null,{"$f":"IF(A19=\"F\",(IF(OR(H19>2001,H19<2004),VLOOKUP(I19,Feuil1!$G$11:$H$25,2))),IF(A19=\"H\",(IF(OR(H19>2001,H19<2004),VLOOKUP(I19,Feuil1!$A$11:$F$29,2)))))","v":"FM44"},null,{"$f":"T19-HLOOKUP(X19,#REF!,2,FALSE)","v":{"$error":"#REF!"}},{"$f":"T19-HLOOKUP(X19,#REF!,3,FALSE)","v":{"$error":"#REF!"}},{"$f":"T19-HLOOKUP(X19,#REF!,4,FALSE)","v":{"$error":"#REF!"}},{"$f":"T19-HLOOKUP(X19,#REF!,5,FALSE)","v":{"$error":"#REF!"}},{"$f":"T19-HLOOKUP(X19,#REF!,6,FALSE)","v":{"$error":"#REF!"}},{"$f":"T19-HLOOKUP(X19,#REF!,7,FALSE)","v":{"$error":"#REF!"}},{"$f":"T19-HLOOKUP(X19,#REF!,8,FALSE)","v":{"$error":"#REF!"}},{"$f":"T19-HLOOKUP(X19,#REF!,9,FALSE)","v":{"$error":"#REF!"}},null,null,null,null,null,null,null,{"$f":"IF(AG19>=0,$AG$4,IF(AF19>=0,$AF$4,IF(AE19>=0,$AE$4,IF(AD19>=0,$AD$4,IF(AC19>=0,$AC$4,IF(AB19>=0,$AB$4,IF(AA19>=0,$AA$4,IF(Z19>=0,$Z$4,$AH$4))))))))","v":{"$error":"#REF!"}}]
["F","SEST","CAZ",4,360579,"GEFFROY","Lisa",2003,40.9,"ASPTT DRAGUIGNAN","F",15,16,18,{"$f":"IF(MAXA(L20+M20,M20+N20,L20+N20,L20,M20,N20)<=0,0,MAXA(L20+M20,M20+N20,L20+N20,L20,M20,N20))","v":34},22,23,25,{"$f":"IF(MAXA(P20+Q20,Q20+R20,P20+R20,P20,Q20,R20)<=0,0,MAXA(P20+Q20,Q20+R20,P20+R20,P20,Q20,R20))","v":48},{"$f":"IF(H20=\"\",\"\",IF(OR(O20=0,S20=0),0,O20+S20))","v":82},{"$f":"IF(I20=\"\",\"\",IF(A20=\"H\",10^(0.794358141*LOG(I20/174.393)^2)*T20,IF(A20=\"F\",10^(0.89726074 * LOG(I20/148.026)^2)*T20,\"\")))","v":156.24438022428052},{"$f":"SUM(T20-I20)","v":41.1},null,{"$f":"IF(A20=\"F\",(IF(OR(H20>2001,H20<2004),VLOOKUP(I20,Feuil1!$G$11:$H$25,2))),IF(A20=\"H\",(IF(OR(H20>2001,H20<2004),VLOOKUP(I20,Feuil1!$A$11:$F$29,2)))))","v":"FM44"},null,{"$f":"T20-HLOOKUP(X20,#REF!,2,FALSE)","v":{"$error":"#REF!"}},{"$f":"T20-HLOOKUP(X20,#REF!,3,FALSE)","v":{"$error":"#REF!"}},{"$f":"T20-HLOOKUP(X20,#REF!,4,FALSE)","v":{"$error":"#REF!"}},{"$f":"T20-HLOOKUP(X20,#REF!,5,FALSE)","v":{"$error":"#REF!"}},{"$f":"T20-HLOOKUP(X20,#REF!,6,FALSE)","v":{"$error":"#REF!"}},{"$f":"T20-HLOOKUP(X20,#REF!,7,FALSE)","v":{"$error":"#REF!"}},{"$f":"T20-HLOOKUP(X20,#REF!,8,FALSE)","v":{"$error":"#REF!"}},{"$f":"T20-HLOOKUP(X20,#REF!,9,FALSE)","v":{"$error":"#REF!"}},null,null,null,null,null,null,null,{"$f":"IF(AG20>=0,$AG$4,IF(AF20>=0,$AF$4,IF(AE20>=0,$AE$4,IF(AD20>=0,$AD$4,IF(AC20>=0,$AC$4,IF(AB20>=0,$AB$4,IF(AA20>=0,$AA$4,IF(Z20>=0,$Z$4,$AH$4))))))))","v":{"$error":"#REF!"}}]
["F","NE","ALS",5,373892,"MANNY","ELODIE",2003,43.6,"MJC Ungersheim","F",12,14,16,{"$f":"IF(MAXA(L21+M21,M21+N21,L21+N21,L21,M21,N21)<=0,0,MAXA(L21+M21,M21+N21,L21+N21,L21,M21,N21))","v":30},18,20,22,{"$f":"IF(MAXA(P21+Q21,Q21+R21,P21+R21,P21,Q21,R21)<=0,0,MAXA(P21+Q21,Q21+R21,P21+R21,P21,Q21,R21))","v":42},{"$f":"IF(H21=\"\",\"\",IF(OR(O21=0,S21=0),0,O21+S21))","v":72},{"$f":"IF(I21=\"\",\"\",IF(A21=\"H\",10^(0.794358141*LOG(I21/174.393)^2)*T21,IF(A21=\"F\",10^(0.89726074 * LOG(I21/148.026)^2)*T21,\"\")))","v":128.87941649902638},{"$f":"SUM(T21-I21)","v":28.4},null,{"$f":"IF(A21=\"F\",(IF(OR(H21>2001,H21<2004),VLOOKUP(I21,Feuil1!$G$11:$H$25,2))),IF(A21=\"H\",(IF(OR(H21>2001,H21<2004),VLOOKUP(I21,Feuil1!$A$11:$F$29,2)))))","v":"FM44"},null,{"$f":"T21-HLOOKUP(X21,#REF!,2,FALSE)","v":{"$error":"#REF!"}},{"$f":"T21-HLOOKUP(X21,#REF!,3,FALSE)","v":{"$error":"#REF!"}},{"$f":"T21-HLOOKUP(X21,#REF!,4,FALSE)","v":{"$error":"#REF!"}},{"$f":"T21-HLOOKUP(X21,#REF!,5,FALSE)","v":{"$error":"#REF!"}},{"$f":"T21-HLOOKUP(X21,#REF!,6,FALSE)","v":{"$error":"#REF!"}},{"$f":"T21-HLOOKUP(X21,#REF!,7,FALSE)","v":{"$error":"#REF!"}},{"$f":"T21-HLOOKUP(X21,#REF!,8,FALSE)","v":{"$error":"#REF!"}},{"$f":"T21-HLOOKUP(X21,#REF!,9,FALSE)","v":{"$error":"#REF!"}},null,null,null,null,null,null,null,{"$f":"IF(AG21>=0,$AG$4,IF(AF21>=0,$AF$4,IF(AE21>=0,$AE$4,IF(AD21>=0,$AD$4,IF(AC21>=0,$AC$4,IF(AB21>=0,$AB$4,IF(AA21>=0,$AA$4,IF(Z21>=0,$Z$4,$AH$4))))))))","v":{"$error":"#REF!"}}]
[null,null,null,null,null,null,null,null,null,null,null,null,null,null,null,null,null,null,null,null,null,null,null,null,null,{"$f":"T22-HLOOKUP(X22,#REF!,2,FALSE)","v":{"$error":"#REF!"}},{"$f":"T22-HLOOKUP(X22,#REF!,3,FALSE)","v":{"$error":"#REF!"}},{"$f":"T22-HLOOKUP(X22,#REF!,4,FALSE)","v":{"$error":"#REF!"}},{"$f":"T22-HLOOKUP(X22,#REF!,5,FALSE)","v":{"$error":"#REF!"}},{"$f":"T22-HLOOKUP(X22,#REF!,6,FALSE)","v":{"$error":"#REF!"}},{"$f":"T22-HLOOKUP(X22,#REF!,7,FALSE)","v":{"$error":"#REF!"}},{"$f":"T22-HLOOKUP(X22,#REF!,8,FALSE)","v":{"$error":"#REF!"}},{"$f":"T22-HLOOKUP(X22,#REF!,9,FALSE)","v":{"$error":"#REF!"}},null,null,null,null,null,null,null,{"$error":"#REF!"}]
["F","NORD","NPC",1,340969,"DESMAREST","Lucie",2002,45.9,"CHCD COMINES","F",22,24,-26,{"$f":"IF(MAXA(L23+M23,M23+N23,L23+N23,L23,M23,N23)<=0,0,MAXA(L23+M23,M23+N23,L23+N23,L23,M23,N23))","v":46},36,38,40,{"$f":"IF(MAXA(P23+Q23,Q23+R23,P23+R23,P23,Q23,R23)<=0,0,MAXA(P23+Q23,Q23+R23,P23+R23,P23,Q23,R23))","v":78},{"$f":"IF(H23=\"\",\"\",IF(OR(O23=0,S23=0),0,O23+S23))","v":124},{"$f":"IF(I23=\"\",\"\",IF(A23=\"H\",10^(0.794358141*LOG(I23/174.393)^2)*T23,IF(A23=\"F\",10^(0.89726074 * LOG(I23/148.026)^2)*T23,\"\")))","v":211.56874859981434},{"$f":"SUM(T23-I23)","v":78.099999999999994},null,{"$f":"IF(A23=\"F\",(IF(OR(H23>2001,H23<2004),VLOOKUP(I23,Feuil1!$G$11:$H$25,2))),IF(A23=\"H\",(IF(OR(H23>2001,H23<2004),VLOOKUP(I23,Feuil1!$A$11:$F$29,2)))))","v":"FM48"},null,{"$f":"T23-HLOOKUP(X23,#REF!,2,FALSE)","v":{"$error":"#REF!"}},{"$f":"T23-HLOOKUP(X23,#REF!,3,FALSE)","v":{"$error":"#REF!"}},{"$f":"T23-HLOOKUP(X23,#REF!,4,FALSE)","v":{"$error":"#REF!"}},{"$f":"T23-HLOOKUP(X23,#REF!,5,FALSE)","v":{"$error":"#REF!"}},{"$f":"T23-HLOOKUP(X23,#REF!,6,FALSE)","v":{"$error":"#REF!"}},{"$f":"T23-HLOOKUP(X23,#REF!,7,FALSE)","v":{"$error":"#REF!"}},{"$f":"T23-HLOOKUP(X23,#REF!,8,FALSE)","v":{"$error":"#REF!"}},{"$f":"T23-HLOOKUP(X23,#REF!,9,FALSE)","v":{"$error":"#REF!"}},null,null,null,null,null,null,null,{"$f":"IF(AG23>=0,$AG$4,IF(AF23>=0,$AF$4,IF(AE23>=0,$AE$4,IF(AD23>=0,$AD$4,IF(AC23>=0,$AC$4,IF(AB23>=0,$AB$4,IF(AA23>=0,$AA$4,IF(Z23>=0,$Z$4,$AH$4))))))))","v":{"$error":"#REF!"}}]
["F","NE","ALS",2,350199,"BAJARD","PERINE",2003,46.5,"Dorlisheim FH","F",22,24,26,50,30,32,-34,62,112,188.85536154965345,65.5,null,{"$f":"IF(A24=\"F\",(IF(OR(H24>2001,H24<2004),VLOOKUP(I24,Feuil1!$G$11:$H$25,2))),IF(A24=\"H\",(IF(OR(H24>2001,H24<2004),VLOOKUP(I24,Feuil1!$A$11:$F$29,2)))))","v":"FM48"},null,{"$f":"T24-HLOOKUP(X24,#REF!,2,FALSE)","v":{"$error":"#REF!"}},{"$f":"T24-HLOOKUP(X24,#REF!,3,FALSE)","v":{"$error":"#REF!"}},{"$f":"T24-HLOOKUP(X24,#REF!,4,FALSE)","v":{"$error":"#REF!"}},{"$f":"T24-HLOOKUP(X24,#REF!,5,FALSE)","v":{"$error":"#REF!"}},{"$f":"T24-HLOOKUP(X24,#REF!,6,FALSE)","v":{"$error":"#REF!"}},{"$f":"T24-HLOOKUP(X24,#REF!,7,FALSE)","v":{"$error":"#REF!"}},{"$f":"T24-HLOOKUP(X24,#REF!,8,FALSE)","v":{"$error":"#REF!"}},{"$f":"T24-HLOOKUP(X24,#REF!,9,FALSE)","v":{"$error":"#REF!"}},null,null,null,null,null,null,null,{"$error":"#REF!"}]
["F","NORD","PIC",3,378352,"BÉDOT","Manon",2002,46.8,"Villers-Bretonneux KC","F",18,20,-22,38,23,25,-27,48,86,144.17711366591226,39.200000000000003,null,{"$f":"IF(A25=\"F\",(IF(OR(H25>2001,H25<2004),VLOOKUP(I25,Feuil1!$G$11:$H$25,2))),IF(A25=\"H\",(IF(OR(H25>2001,H25<2004),VLOOKUP(I25,Feuil1!$A$11:$F$29,2)))))","v":"FM48"},null,{"$f":"T25-HLOOKUP(X25,#REF!,2,FALSE)","v":{"$error":"#REF!"}},{"$f":"T25-HLOOKUP(X25,#REF!,3,FALSE)","v":{"$error":"#REF!"}},{"$f":"T25-HLOOKUP(X25,#REF!,4,FALSE)","v":{"$error":"#REF!"}},{"$f":"T25-HLOOKUP(X25,#REF!,5,FALSE)","v":{"$error":"#REF!"}},{"$f":"T25-HLOOKUP(X25,#REF!,6,FALSE)","v":{"$error":"#REF!"}},{"$f":"T25-HLOOKUP(X25,#REF!,7,FALSE)","v":{"$error":"#REF!"}},{"$f":"T25-HLOOKUP(X25,#REF!,8,FALSE)","v":{"$error":"#REF!"}},{"$f":"T25-HLOOKUP(X25,#REF!,9,FALSE)","v":{"$error":"#REF!"}},null,null,null,null,null,null,null,{"$error":"#REF!"}]
["F","NE","ALS",4,373892,"MANNY","ELODIE",2003,44.05,"MJC Ungersheim","F",15,17,19,36,22,24,-26,46,82,145.35654935259413,37.950000000000003,null,{"$f":"IF(A26=\"F\",(IF(OR(H26>2001,H26<2004),VLOOKUP(I26,Feuil1!$G$11:$H$25,2))),IF(A26=\"H\",(IF(OR(H26>2001,H26<2004),VLOOKUP(I26,Feuil1!$A$11:$F$29,2)))))","v":"FM48"},null,{"$f":"T26-HLOOKUP(X26,#REF!,2,FALSE)","v":{"$error":"#REF!"}},{"$f":"T26-HLOOKUP(X26,#REF!,3,FALSE)","v":{"$error":"#REF!"}},{"$f":"T26-HLOOKUP(X26,#REF!,4,FALSE)","v":{"$error":"#REF!"}},{"$f":"T26-HLOOKUP(X26,#REF!,5,FALSE)","v":{"$error":"#REF!"}},{"$f":"T26-HLOOKUP(X26,#REF!,6,FALSE)","v":{"$error":"#REF!"}},{"$f":"T26-HLOOKUP(X26,#REF!,7,FALSE)","v":{"$error":"#REF!"}},{"$f":"T26-HLOOKUP(X26,#REF!,8,FALSE)","v":{"$error":"#REF!"}},{"$f":"T26-HLOOKUP(X26,#REF!,9,FALSE)","v":{"$error":"#REF!"}},null,null,null,null,null,null,null,{"$error":"#REF!"}]
["F","NORD","PIC",5,386138,"ETÉVÉ","Solène",2003,47.7,"Péronne AAEEP","F",12,14,16,30,16,18,20,38,68,112.08415226420678,20.299999999999997,null,{"$f":"IF(A27=\"F\",(IF(OR(H27>2001,H27<2004),VLOOKUP(I27,Feuil1!$G$11:$H$25,2))),IF(A27=\"H\",(IF(OR(H27>2001,H27<2004),VLOOKUP(I27,Feuil1!$A$11:$F$29,2)))))","v":"FM48"},null,{"$f":"T27-HLOOKUP(X27,#REF!,2,FALSE)","v":{"$error":"#REF!"}},{"$f":"T27-HLOOKUP(X27,#REF!,3,FALSE)","v":{"$error":"#REF!"}},{"$f":"T27-HLOOKUP(X27,#REF!,4,FALSE)","v":{"$error":"#REF!"}},{"$f":"T27-HLOOKUP(X27,#REF!,5,FALSE)","v":{"$error":"#REF!"}},{"$f":"T27-HLOOKUP(X27,#REF!,6,FALSE)","v":{"$error":"#REF!"}},{"$f":"T27-HLOOKUP(X27,#REF!,7,FALSE)","v":{"$error":"#REF!"}},{"$f":"T27-HLOOKUP(X27,#REF!,8,FALSE)","v":{"$error":"#REF!"}},{"$f":"T27-HLOOKUP(X27,#REF!,9,FALSE)","v":{"$error":"#REF!"}},null,null,null,null,null,null,null,{"$error":"#REF!"}]
["F","NORD","PIC",6,386143,"ETÉVÉ","Axelle",2003,47.1,"Péronne AAEEP","F",12,14,15,29,16,18,19,37,66,110.01662428285235,18.899999999999999,null,{"$f":"IF(A28=\"F\",(IF(OR(H28>2001,H28<2004),VLOOKUP(I28,Feuil1!$G$11:$H$25,2))),IF(A28=\"H\",(IF(OR(H28>2001,H28<2004),VLOOKUP(I28,Feuil1!$A$11:$F$29,2)))))","v":"FM48"},null,{"$f":"T28-HLOOKUP(X28,#REF!,2,FALSE)","v":{"$error":"#REF!"}},{"$f":"T28-HLOOKUP(X28,#REF!,3,FALSE)","v":{"$error":"#REF!"}},{"$f":"T28-HLOOKUP(X28,#REF!,4,FALSE)","v":{"$error":"#REF!"}},{"$f":"T28-HLOOKUP(X28,#REF!,5,FALSE)","v":{"$error":"#REF!"}},{"$f":"T28-HLOOKUP(X28,#REF!,6,FALSE)","v":{"$error":"#REF!"}},{"$f":"T28-HLOOKUP(X28,#REF!,7,FALSE)","v":{"$error":"#REF!"}},{"$f":"T28-HLOOKUP(X28,#REF!,8,FALSE)","v":{"$error":"#REF!"}},{"$f":"T28-HLOOKUP(X28,#REF!,9,FALSE)","v":{"$error":"#REF!"}},null,null,null,null,null,null,null,{"$error":"#REF!"}]
[null,null,null,null,null,null,null,null,null,null,null,null,null,null,null,null,null,null,null,null,null,null,null,null,null,{"$f":"T29-HLOOKUP(X29,#REF!,2,FALSE)","v":{"$error":"#REF!"}},{"$f":"T29-HLOOKUP(X29,#REF!,3,FALSE)","v":{"$error":"#REF!"}},{"$f":"T29-HLOOKUP(X29,#REF!,4,FALSE)","v":{"$error":"#REF!"}},{"$f":"T29-HLOOKUP(X29,#REF!,5,FALSE)","v":{"$error":"#REF!"}},{"$f":"T29-HLOOKUP(X29,#REF!,6,FALSE)","v":{"$error":"#REF!"}},{"$f":"T29-HLOOKUP(X29,#REF!,7,FALSE)","v":{"$error":"#REF!"}},{"$f":"T29-HLOOKUP(X29,#REF!,8,FALSE)","v":{"$error":"#REF!"}},{"$f":"T29-HLOOKUP(X29,#REF!,9,FALSE)","v":{"$error":"#REF!"}},null,null,null,null,null,null,null,{"$error":"#REF!"}]
["F","NE","BOU",1,344068,"COMTE","Coralie",2002,51.45,"HC Avallon","F",36,38,-40,{"$f":"IF(MAXA(L30+M30,M30+N30,L30+N30,L30,M30,N30)<=0,0,MAXA(L30+M30,M30+N30,L30+N30,L30,M30,N30))","v":74},44,46,48,{"$f":"IF(MAXA(P30+Q30,Q30+R30,P30+R30,P30,Q30,R30)<=0,0,MAXA(P30+Q30,Q30+R30,P30+R30,P30,Q30,R30))","v":94},{"$f":"IF(H30=\"\",\"\",IF(OR(O30=0,S30=0),0,O30+S30))","v":168},{"$f":"IF(I30=\"\",\"\",IF(A30=\"H\",10^(0.794358141*LOG(I30/174.393)^2)*T30,IF(A30=\"F\",10^(0.89726074 * LOG(I30/148.026)^2)*T30,\"\")))","v":259.60081481317604},{"$f":"SUM(T30-I30)","v":116.55},null,{"$f":"IF(A30=\"F\",(IF(OR(H30>2001,H30<2004),VLOOKUP(I30,Feuil1!$G$11:$H$25,2))),IF(A30=\"H\",(IF(OR(H30>2001,H30<2004),VLOOKUP(I30,Feuil1!$A$11:$F$29,2)))))","v":"FM53"},null,{"$f":"T30-HLOOKUP(X30,#REF!,2,FALSE)","v":{"$error":"#REF!"}},{"$f":"T30-HLOOKUP(X30,#REF!,3,FALSE)","v":{"$error":"#REF!"}},{"$f":"T30-HLOOKUP(X30,#REF!,4,FALSE)","v":{"$error":"#REF!"}},{"$f":"T30-HLOOKUP(X30,#REF!,5,FALSE)","v":{"$error":"#REF!"}},{"$f":"T30-HLOOKUP(X30,#REF!,6,FALSE)","v":{"$error":"#REF!"}},{"$f":"T30-HLOOKUP(X30,#REF!,7,FALSE)","v":{"$error":"#REF!"}},{"$f":"T30-HLOOKUP(X30,#REF!,8,FALSE)","v":{"$error":"#REF!"}},{"$f":"T30-HLOOKUP(X30,#REF!,9,FALSE)","v":{"$error":"#REF!"}},null,null,null,null,null,null,null,{"$f":"IF(AG30>=0,$AG$4,IF(AF30>=0,$AF$4,IF(AE30>=0,$AE$4,IF(AD30>=0,$AD$4,IF(AC30>=0,$AC$4,IF(AB30>=0,$AB$4,IF(AA30>=0,$AA$4,IF(Z30>=0,$Z$4,$AH$4))))))))","v":{"$error":"#REF!"}}]
["F","SEST","RAL",2,352110,"PICOT","Zéline",2003,49.8,"CH Saint Baldoph","F",30,31,32,{"$f":"IF(MAXA(L31+M31,M31+N31,L31+N31,L31,M31,N31)<=0,0,MAXA(L31+M31,M31+N31,L31+N31,L31,M31,N31))","v":63},40,42,44,{"$f":"IF(MAXA(P31+Q31,Q31+R31,P31+R31,P31,Q31,R31)<=0,0,MAXA(P31+Q31,Q31+R31,P31+R31,P31,Q31,R31))","v":86},{"$f":"IF(H31=\"\",\"\",IF(OR(O31=0,S31=0),0,O31+S31))","v":149},{"$f":"IF(I31=\"\",\"\",IF(A31=\"H\",10^(0.794358141*LOG(I31/174.393)^2)*T31,IF(A31=\"F\",10^(0.89726074 * LOG(I31/148.026)^2)*T31,\"\")))","v":236.60382399757975},{"$f":"SUM(T31-I31)","v":99.2},null,{"$f":"IF(A31=\"F\",(IF(OR(H31>2001,H31<2004),VLOOKUP(I31,Feuil1!$G$11:$H$25,2))),IF(A31=\"H\",(IF(OR(H31>2001,H31<2004),VLOOKUP(I31,Feuil1!$A$11:$F$29,2)))))","v":"FM53"},null,{"$f":"T31-HLOOKUP(X31,#REF!,2,FALSE)","v":{"$error":"#REF!"}},{"$f":"T31-HLOOKUP(X31,#REF!,3,FALSE)","v":{"$error":"#REF!"}},{"$f":"T31-HLOOKUP(X31,#REF!,4,FALSE)","v":{"$error":"#REF!"}},{"$f":"T31-HLOOKUP(X31,#REF!,5,FALSE)","v":{"$error":"#REF!"}},{"$f":"T31-HLOOKUP(X31,#REF!,6,FALSE)","v":{"$error":"#REF!"}},{"$f":"T31-HLOOKUP(X31,#REF!,7,FALSE)","v":{"$error":"#REF!"}},{"$f":"T31-HLOOKUP(X31,#REF!,8,FALSE)","v":{"$error":"#REF!"}},{"$f":"T31-HLOOKUP(X31,#REF!,9,FALSE)","v":{"$error":"#REF!"}},null,null,null,null,null,null,null,{"$f":"IF(AG31>=0,$AG$4,IF(AF31>=0,$AF$4,IF(AE31>=0,$AE$4,IF(AD31>=0,$AD$4,IF(AC31>=0,$AC$4,IF(AB31>=0,$AB$4,IF(AA31>=0,$AA$4,IF(Z31>=0,$Z$4,$AH$4))))))))","v":{"$error":"#REF!"}}]
["F","NE","ALS",3,350199,"BAJARD","PERINE",2003,49.7,"Dorlisheim FH","F",26,28,30,{"$f":"IF(MAXA(L32+M32,M32+N32,L32+N32,L32,M32,N32)<=0,0,MAXA(L32+M32,M32+N32,L32+N32,L32,M32,N32))","v":58},35,37,-39,{"$f":"IF(MAXA(P32+Q32,Q32+R32,P32+R32,P32,Q32,R32)<=0,0,MAXA(P32+Q32,Q32+R32,P32+R32,P32,Q32,R32))","v":72},{"$f":"IF(H32=\"\",\"\",IF(OR(O32=0,S32=0),0,O32+S32))","v":130},{"$f":"IF(I32=\"\",\"\",IF(A32=\"H\",10^(0.794358141*LOG(I32/174.393)^2)*T32,IF(A32=\"F\",10^(0.89726074 * LOG(I32/148.026)^2)*T32,\"\")))","v":206.78577897070895},{"$f":"SUM(T32-I32)","v":80.3},null,{"$f":"IF(A32=\"F\",(IF(OR(H32>2001,H32<2004),VLOOKUP(I32,Feuil1!$G$11:$H$25,2))),IF(A32=\"H\",(IF(OR(H32>2001,H32<2004),VLOOKUP(I32,Feuil1!$A$11:$F$29,2)))))","v":"FM53"},null,{"$f":"T32-HLOOKUP(X32,#REF!,2,FALSE)","v":{"$error":"#REF!"}},{"$f":"T32-HLOOKUP(X32,#REF!,3,FALSE)","v":{"$error":"#REF!"}},{"$f":"T32-HLOOKUP(X32,#REF!,4,FALSE)","v":{"$error":"#REF!"}},{"$f":"T32-HLOOKUP(X32,#REF!,5,FALSE)","v":{"$error":"#REF!"}},{"$f":"T32-HLOOKUP(X32,#REF!,6,FALSE)","v":{"$error":"#REF!"}},{"$f":"T32-HLOOKUP(X32,#REF!,7,FALSE)","v":{"$error":"#REF!"}},{"$f":"T32-HLOOKUP(X32,#REF!,8,FALSE)","v":{"$error":"#REF!"}},{"$f":"T32-HLOOKUP(X32,#REF!,9,FALSE)","v":{"$error":"#REF!"}},null,null,null,null,null,null,null,{"$f":"IF(AG32>=0,$AG$4,IF(AF32>=0,$AF$4,IF(AE32>=0,$AE$4,IF(AD32>=0,$AD$4,IF(AC32>=0,$AC$4,IF(AB32>=0,$AB$4,IF(AA32>=0,$AA$4,IF(Z32>=0,$Z$4,$AH$4))))))))","v":{"$error":"#REF!"}}]
["F","NORD","PIC",4,380663,"VAN MALLEGHEM","Charlotte",2002,50.76,"Roisel CHFM","F",10,12,14,{"$f":"IF(MAXA(L33+M33,M33+N33,L33+N33,L33,M33,N33)<=0,0,MAXA(L33+M33,M33+N33,L33+N33,L33,M33,N33))","v":26},15,17,19,{"$f":"IF(MAXA(P33+Q33,Q33+R33,P33+R33,P33,Q33,R33)<=0,0,MAXA(P33+Q33,Q33+R33,P33+R33,P33,Q33,R33))","v":36},{"$f":"IF(H33=\"\",\"\",IF(OR(O33=0,S33=0),0,O33+S33))","v":62},{"$f":"IF(I33=\"\",\"\",IF(A33=\"H\",10^(0.794358141*LOG(I33/174.393)^2)*T33,IF(A33=\"F\",10^(0.89726074 * LOG(I33/148.026)^2)*T33,\"\")))","v":96.883252369408041},{"$f":"SUM(T33-I33)","v":11.240000000000002},null,{"$f":"IF(A33=\"F\",(IF(OR(H33>2001,H33<2004),VLOOKUP(I33,Feuil1!$G$11:$H$25,2))),IF(A33=\"H\",(IF(OR(H33>2001,H33<2004),VLOOKUP(I33,Feuil1!$A$11:$F$29,2)))))","v":"FM53"},null,{"$f":"T33-HLOOKUP(X33,#REF!,2,FALSE)","v":{"$error":"#REF!"}},{"$f":"T33-HLOOKUP(X33,#REF!,3,FALSE)","v":{"$error":"#REF!"}},{"$f":"T33-HLOOKUP(X33,#REF!,4,FALSE)","v":{"$error":"#REF!"}},{"$f":"T33-HLOOKUP(X33,#REF!,5,FALSE)","v":{"$error":"#REF!"}},{"$f":"T33-HLOOKUP(X33,#REF!,6,FALSE)","v":{"$error":"#REF!"}},{"$f":"T33-HLOOKUP(X33,#REF!,7,FALSE)","v":{"$error":"#REF!"}},{"$f":"T33-HLOOKUP(X33,#REF!,8,FALSE)","v":{"$error":"#REF!"}},{"$f":"T33-HLOOKUP(X33,#REF!,9,FALSE)","v":{"$error":"#REF!"}},null,null,null,null,null,null,null,{"$f":"IF(AG33>=0,$AG$4,IF(AF33>=0,$AF$4,IF(AE33>=0,$AE$4,IF(AD33>=0,$AD$4,IF(AC33>=0,$AC$4,IF(AB33>=0,$AB$4,IF(AA33>=0,$AA$4,IF(Z33>=0,$Z$4,$AH$4))))))))","v":{"$error":"#REF!"}}]
["F","SO","MPY",5,378621,"HOUZE","Mandy",2002,51.7,"FIGEAC HC","F",7,8,9,{"$f":"IF(MAXA(L34+M34,M34+N34,L34+N34,L34,M34,N34)<=0,0,MAXA(L34+M34,M34+N34,L34+N34,L34,M34,N34))","v":17},12,14,16,{"$f":"IF(MAXA(P34+Q34,Q34+R34,P34+R34,P34,Q34,R34)<=0,0,MAXA(P34+Q34,Q34+R34,P34+R34,P34,Q34,R34))","v":30},{"$f":"IF(H34=\"\",\"\",IF(OR(O34=0,S34=0),0,O34+S34))","v":47},{"$f":"IF(I34=\"\",\"\",IF(A34=\"H\",10^(0.794358141*LOG(I34/174.393)^2)*T34,IF(A34=\"F\",10^(0.89726074 * LOG(I34/148.026)^2)*T34,\"\")))","v":72.337715651590528},{"$f":"SUM(T34-I34)","v":-4.7000000000000028},null,{"$f":"IF(A34=\"F\",(IF(OR(H34>2001,H34<2004),VLOOKUP(I34,Feuil1!$G$11:$H$25,2))),IF(A34=\"H\",(IF(OR(H34>2001,H34<2004),VLOOKUP(I34,Feuil1!$A$11:$F$29,2)))))","v":"FM53"},null,{"$f":"T34-HLOOKUP(X34,#REF!,2,FALSE)","v":{"$error":"#REF!"}},{"$f":"T34-HLOOKUP(X34,#REF!,3,FALSE)","v":{"$error":"#REF!"}},{"$f":"T34-HLOOKUP(X34,#REF!,4,FALSE)","v":{"$error":"#REF!"}},{"$f":"T34-HLOOKUP(X34,#REF!,5,FALSE)","v":{"$error":"#REF!"}},{"$f":"T34-HLOOKUP(X34,#REF!,6,FALSE)","v":{"$error":"#REF!"}},{"$f":"T34-HLOOKUP(X34,#REF!,7,FALSE)","v":{"$error":"#REF!"}},{"$f":"T34-HLOOKUP(X34,#REF!,8,FALSE)","v":{"$error":"#REF!"}},{"$f":"T34-HLOOKUP(X34,#REF!,9,FALSE)","v":{"$error":"#REF!"}},null,null,null,null,null,null,null,{"$f":"IF(AG34>=0,$AG$4,IF(AF34>=0,$AF$4,IF(AE34>=0,$AE$4,IF(AD34>=0,$AD$4,IF(AC34>=0,$AC$4,IF(AB34>=0,$AB$4,IF(AA34>=0,$AA$4,IF(Z34>=0,$Z$4,$AH$4))))))))","v":{"$error":"#REF!"}}]
[null,null,null,null,null,null,null,null,null,null,null,null,null,null,null,null,null,null,null,null,null,null,null,null,null,{"$f":"T35-HLOOKUP(X35,#REF!,2,FALSE)","v":{"$error":"#REF!"}},{"$f":"T35-HLOOKUP(X35,#REF!,3,FALSE)","v":{"$error":"#REF!"}},{"$f":"T35-HLOOKUP(X35,#REF!,4,FALSE)","v":{"$error":"#REF!"}},{"$f":"T35-HLOOKUP(X35,#REF!,5,FALSE)","v":{"$error":"#REF!"}},{"$f":"T35-HLOOKUP(X35,#REF!,6,FALSE)","v":{"$error":"#REF!"}},{"$f":"T35-HLOOKUP(X35,#REF!,7,FALSE)","v":{"$error":"#REF!"}},{"$f":"T35-HLOOKUP(X35,#REF!,8,FALSE)","v":{"$error":"#REF!"}},{"$f":"T35-HLOOKUP(X35,#REF!,9,FALSE)","v":{"$error":"#REF!"}},null,null,null,null,null,null,null,{"$error":"#REF!"}]
["F","CO","BRE",1,357283,"BEGHAIN","Mayliss",2002,55.15,"AL QUIMPER","F",29,31,-32,{"$f":"IF(MAXA(L36+M36,M36+N36,L36+N36,L36,M36,N36)<=0,0,MAXA(L36+M36,M36+N36,L36+N36,L36,M36,N36))","v":60},37,39,-40,{"$f":"IF(MAXA(P36+Q36,Q36+R36,P36+R36,P36,Q36,R36)<=0,0,MAXA(P36+Q36,Q36+R36,P36+R36,P36,Q36,R36))","v":76},{"$f":"IF(H36=\"\",\"\",IF(OR(O36=0,S36=0),0,O36+S36))","v":136},{"$f":"IF(I36=\"\",\"\",IF(A36=\"H\",10^(0.794358141*LOG(I36/174.393)^2)*T36,IF(A36=\"F\",10^(0.89726074 * LOG(I36/148.026)^2)*T36,\"\")))","v":198.84375551105413},{"$f":"SUM(T36-I36)","v":80.849999999999994},null,{"$f":"IF(A36=\"F\",(IF(OR(H36>2001,H36<2004),VLOOKUP(I36,Feuil1!$G$11:$H$25,2))),IF(A36=\"H\",(IF(OR(H36>2001,H36<2004),VLOOKUP(I36,Feuil1!$A$11:$F$29,2)))))","v":"FM58"},null,{"$f":"T36-HLOOKUP(X36,#REF!,2,FALSE)","v":{"$error":"#REF!"}},{"$f":"T36-HLOOKUP(X36,#REF!,3,FALSE)","v":{"$error":"#REF!"}},{"$f":"T36-HLOOKUP(X36,#REF!,4,FALSE)","v":{"$error":"#REF!"}},{"$f":"T36-HLOOKUP(X36,#REF!,5,FALSE)","v":{"$error":"#REF!"}},{"$f":"T36-HLOOKUP(X36,#REF!,6,FALSE)","v":{"$error":"#REF!"}},{"$f":"T36-HLOOKUP(X36,#REF!,7,FALSE)","v":{"$error":"#REF!"}},{"$f":"T36-HLOOKUP(X36,#REF!,8,FALSE)","v":{"$error":"#REF!"}},{"$f":"T36-HLOOKUP(X36,#REF!,9,FALSE)","v":{"$error":"#REF!"}},null,null,null,null,null,null,null,{"$f":"IF(AG36>=0,$AG$4,IF(AF36>=0,$AF$4,IF(AE36>=0,$AE$4,IF(AD36>=0,$AD$4,IF(AC36>=0,$AC$4,IF(AB36>=0,$AB$4,IF(AA36>=0,$AA$4,IF(Z36>=0,$Z$4,$AH$4))))))))","v":{"$error":"#REF!"}}]
["F","NORD","NPC",2,390782,"BAUQUEL","Aurélia",2003,55.8,"C.A.ROSENDAEL","F",17,19,21,{"$f":"IF(MAXA(L37+M37,M37+N37,L37+N37,L37,M37,N37)<=0,0,MAXA(L37+M37,M37+N37,L37+N37,L37,M37,N37))","v":40},27,29,31,{"$f":"IF(MAXA(P37+Q37,Q37+R37,P37+R37,P37,Q37,R37)<=0,0,MAXA(P37+Q37,Q37+R37,P37+R37,P37,Q37,R37))","v":60},{"$f":"IF(H37=\"\",\"\",IF(OR(O37=0,S37=0),0,O37+S37))","v":100},{"$f":"IF(I37=\"\",\"\",IF(A37=\"H\",10^(0.794358141*LOG(I37/174.393)^2)*T37,IF(A37=\"F\",10^(0.89726074 * LOG(I37/148.026)^2)*T37,\"\")))","v":144.90409449185191},{"$f":"SUM(T37-I37)","v":44.2},null,{"$f":"IF(A37=\"F\",(IF(OR(H37>2001,H37<2004),VLOOKUP(I37,Feuil1!$G$11:$H$25,2))),IF(A37=\"H\",(IF(OR(H37>2001,H37<2004),VLOOKUP(I37,Feuil1!$A$11:$F$29,2)))))","v":"FM58"},null,{"$f":"T37-HLOOKUP(X37,#REF!,2,FALSE)","v":{"$error":"#REF!"}},{"$f":"T37-HLOOKUP(X37,#REF!,3,FALSE)","v":{"$error":"#REF!"}},{"$f":"T37-HLOOKUP(X37,#REF!,4,FALSE)","v":{"$error":"#REF!"}},{"$f":"T37-HLOOKUP(X37,#REF!,5,FALSE)","v":{"$error":"#REF!"}},{"$f":"T37-HLOOKUP(X37,#REF!,6,FALSE)","v":{"$error":"#REF!"}},{"$f":"T37-HLOOKUP(X37,#REF!,7,FALSE)","v":{"$error":"#REF!"}},{"$f":"T37-HLOOKUP(X37,#REF!,8,FALSE)","v":{"$error":"#REF!"}},{"$f":"T37-HLOOKUP(X37,#REF!,9,FALSE)","v":{"$error":"#REF!"}},null,null,null,null,null,null,null,{"$f":"IF(AG37>=0,$AG$4,IF(AF37>=0,$AF$4,IF(AE37>=0,$AE$4,IF(AD37>=0,$AD$4,IF(AC37>=0,$AC$4,IF(AB37>=0,$AB$4,IF(AA37>=0,$AA$4,IF(Z37>=0,$Z$4,$AH$4))))))))","v":{"$error":"#REF!"}}]
["F","SE","LAN",3,375101,"TORRAYSI","Souhaid",2003,55.2,"Narbonne Haltéro","F",14,16,-18,{"$f":"IF(MAXA(L38+M38,M38+N38,L38+N38,L38,M38,N38)<=0,0,MAXA(L38+M38,M38+N38,L38+N38,L38,M38,N38))","v":30},24,26,28,{"$f":"IF(MAXA(P38+Q38,Q38+R38,P38+R38,P38,Q38,R38)<=0,0,MAXA(P38+Q38,Q38+R38,P38+R38,P38,Q38,R38))","v":54},{"$f":"IF(H38=\"\",\"\",IF(OR(O38=0,S38=0),0,O38+S38))","v":84},{"$f":"IF(I38=\"\",\"\",IF(A38=\"H\",10^(0.794358141*LOG(I38/174.393)^2)*T38,IF(A38=\"F\",10^(0.89726074 * LOG(I38/148.026)^2)*T38,\"\")))","v":122.72969004116382},{"$f":"SUM(T38-I38)","v":28.799999999999997},null,{"$f":"IF(A38=\"F\",(IF(OR(H38>2001,H38<2004),VLOOKUP(I38,Feuil1!$G$11:$H$25,2))),IF(A38=\"H\",(IF(OR(H38>2001,H38<2004),VLOOKUP(I38,Feuil1!$A$11:$F$29,2)))))","v":"FM58"},null,{"$f":"T38-HLOOKUP(X38,#REF!,2,FALSE)","v":{"$error":"#REF!"}},{"$f":"T38-HLOOKUP(X38,#REF!,3,FALSE)","v":{"$error":"#REF!"}},{"$f":"T38-HLOOKUP(X38,#REF!,4,FALSE)","v":{"$error":"#REF!"}},{"$f":"T38-HLOOKUP(X38,#REF!,5,FALSE)","v":{"$error":"#REF!"}},{"$f":"T38-HLOOKUP(X38,#REF!,6,FALSE)","v":{"$error":"#REF!"}},{"$f":"T38-HLOOKUP(X38,#REF!,7,FALSE)","v":{"$error":"#REF!"}},{"$f":"T38-HLOOKUP(X38,#REF!,8,FALSE)","v":{"$error":"#REF!"}},{"$f":"T38-HLOOKUP(X38,#REF!,9,FALSE)","v":{"$error":"#REF!"}},null,null,null,null,null,null,null,{"$f":"IF(AG38>=0,$AG$4,IF(AF38>=0,$AF$4,IF(AE38>=0,$AE$4,IF(AD38>=0,$AD$4,IF(AC38>=0,$AC$4,IF(AB38>=0,$AB$4,IF(AA38>=0,$AA$4,IF(Z38>=0,$Z$4,$AH$4))))))))","v":{"$error":"#REF!"}}]
[null,null,null,null,null,null,null,null,null,null,null,null,null,null,null,null,null,null,null,null,null,null,null,null,null,{"$f":"T39-HLOOKUP(X39,#REF!,2,FALSE)","v":{"$error":"#REF!"}},{"$f":"T39-HLOOKUP(X39,#REF!,3,FALSE)","v":{"$error":"#REF!"}},{"$f":"T39-HLOOKUP(X39,#REF!,4,FALSE)","v":{"$error":"#REF!"}},{"$f":"T39-HLOOKUP(X39,#REF!,5,FALSE)","v":{"$error":"#REF!"}},{"$f":"T39-HLOOKUP(X39,#REF!,6,FALSE)","v":{"$error":"#REF!"}},{"$f":"T39-HLOOKUP(X39,#REF!,7,FALSE)","v":{"$error":"#REF!"}},{"$f":"T39-HLOOKUP(X39,#REF!,8,FALSE)","v":{"$error":"#REF!"}},{"$f":"T39-HLOOKUP(X39,#REF!,9,FALSE)","v":{"$error":"#REF!"}},null,null,null,null,null,null,null,{"$error":"#REF!"}]
["F","N","IDF",1,378747,"REZZAK","AMELLE",2002,61.9,"FRANCONVILLE","F",19,21,23,{"$f":"IF(MAXA(L40+M40,M40+N40,L40+N40,L40,M40,N40)<=0,0,MAXA(L40+M40,M40+N40,L40+N40,L40,M40,N40))","v":44},28,30,32,{"$f":"IF(MAXA(P40+Q40,Q40+R40,P40+R40,P40,Q40,R40)<=0,0,MAXA(P40+Q40,Q40+R40,P40+R40,P40,Q40,R40))","v":62},{"$f":"IF(H40=\"\",\"\",IF(OR(O40=0,S40=0),0,O40+S40))","v":106},{"$f":"IF(I40=\"\",\"\",IF(A40=\"H\",10^(0.794358141*LOG(I40/174.393)^2)*T40,IF(A40=\"F\",10^(0.89726074 * LOG(I40/148.026)^2)*T40,\"\")))","v":142.54420440588174},{"$f":"SUM(T40-I40)","v":44.1},null,{"$f":"IF(A40=\"F\",(IF(OR(H40>2001,H40<2004),VLOOKUP(I40,Feuil1!$G$11:$H$25,2))),IF(A40=\"H\",(IF(OR(H40>2001,H40<2004),VLOOKUP(I40,Feuil1!$A$11:$F$29,2)))))","v":"FM+58"},null,{"$f":"T40-HLOOKUP(X40,#REF!,2,FALSE)","v":{"$error":"#REF!"}},{"$f":"T40-HLOOKUP(X40,#REF!,3,FALSE)","v":{"$error":"#REF!"}},{"$f":"T40-HLOOKUP(X40,#REF!,4,FALSE)","v":{"$error":"#REF!"}},{"$f":"T40-HLOOKUP(X40,#REF!,5,FALSE)","v":{"$error":"#REF!"}},{"$f":"T40-HLOOKUP(X40,#REF!,6,FALSE)","v":{"$error":"#REF!"}},{"$f":"T40-HLOOKUP(X40,#REF!,7,FALSE)","v":{"$error":"#REF!"}},{"$f":"T40-HLOOKUP(X40,#REF!,8,FALSE)","v":{"$error":"#REF!"}},{"$f":"T40-HLOOKUP(X40,#REF!,9,FALSE)","v":{"$error":"#REF!"}},null,null,null,null,null,null,null,{"$f":"IF(AG40>=0,$AG$4,IF(AF40>=0,$AF$4,IF(AE40>=0,$AE$4,IF(AD40>=0,$AD$4,IF(AC40>=0,$AC$4,IF(AB40>=0,$AB$4,IF(AA40>=0,$AA$4,IF(Z40>=0,$Z$4,$AH$4))))))))","v":{"$error":"#REF!"}}]
["F","SE","PRO",2,361672,"BOURGEOIS","Clara",2002,60.3,"ISTRES SPORTS","F",18,20,22,{"$f":"IF(MAXA(L41+M41,M41+N41,L41+N41,L41,M41,N41)<=0,0,MAXA(L41+M41,M41+N41,L41+N41,L41,M41,N41))","v":42},27,29,31,{"$f":"IF(MAXA(P41+Q41,Q41+R41,P41+R41,P41,Q41,R41)<=0,0,MAXA(P41+Q41,Q41+R41,P41+R41,P41,Q41,R41))","v":60},{"$f":"IF(H41=\"\",\"\",IF(OR(O41=0,S41=0),0,O41+S41))","v":102},{"$f":"IF(I41=\"\",\"\",IF(A41=\"H\",10^(0.794358141*LOG(I41/174.393)^2)*T41,IF(A41=\"F\",10^(0.89726074 * LOG(I41/148.026)^2)*T41,\"\")))","v":139.66513707499277},{"$f":"SUM(T41-I41)","v":41.7},null,{"$f":"IF(A41=\"F\",(IF(OR(H41>2001,H41<2004),VLOOKUP(I41,Feuil1!$G$11:$H$25,2))),IF(A41=\"H\",(IF(OR(H41>2001,H41<2004),VLOOKUP(I41,Feuil1!$A$11:$F$29,2)))))","v":"FM+58"},null,{"$f":"T41-HLOOKUP(X41,#REF!,2,FALSE)","v":{"$error":"#REF!"}},{"$f":"T41-HLOOKUP(X41,#REF!,3,FALSE)","v":{"$error":"#REF!"}},{"$f":"T41-HLOOKUP(X41,#REF!,4,FALSE)","v":{"$error":"#REF!"}},{"$f":"T41-HLOOKUP(X41,#REF!,5,FALSE)","v":{"$error":"#REF!"}},{"$f":"T41-HLOOKUP(X41,#REF!,6,FALSE)","v":{"$error":"#REF!"}},{"$f":"T41-HLOOKUP(X41,#REF!,7,FALSE)","v":{"$error":"#REF!"}},{"$f":"T41-HLOOKUP(X41,#REF!,8,FALSE)","v":{"$error":"#REF!"}},{"$f":"T41-HLOOKUP(X41,#REF!,9,FALSE)","v":{"$error":"#REF!"}},null,null,null,null,null,null,null,{"$f":"IF(AG41>=0,$AG$4,IF(AF41>=0,$AF$4,IF(AE41>=0,$AE$4,IF(AD41>=0,$AD$4,IF(AC41>=0,$AC$4,IF(AB41>=0,$AB$4,IF(AA41>=0,$AA$4,IF(Z41>=0,$Z$4,$AH$4))))))))","v":{"$error":"#REF!"}}]
["F","CO","BRE",3,387354,"ABREUVEUX","Méline",2002,58.3,"ES Saint-Avé","F",17,-18,18,{"$f":"IF(MAXA(L42+M42,M42+N42,L42+N42,L42,M42,N42)<=0,0,MAXA(L42+M42,M42+N42,L42+N42,L42,M42,N42))","v":35},24,25,27,{"$f":"IF(MAXA(P42+Q42,Q42+R42,P42+R42,P42,Q42,R42)<=0,0,MAXA(P42+Q42,Q42+R42,P42+R42,P42,Q42,R42))","v":52},{"$f":"IF(H42=\"\",\"\",IF(OR(O42=0,S42=0),0,O42+S42))","v":87},{"$f":"IF(I42=\"\",\"\",IF(A42=\"H\",10^(0.794358141*LOG(I42/174.393)^2)*T42,IF(A42=\"F\",10^(0.89726074 * LOG(I42/148.026)^2)*T42,\"\")))","v":122.02598028776661},{"$f":"SUM(T42-I42)","v":28.700000000000003},null,{"$f":"IF(A42=\"F\",(IF(OR(H42>2001,H42<2004),VLOOKUP(I42,Feuil1!$G$11:$H$25,2))),IF(A42=\"H\",(IF(OR(H42>2001,H42<2004),VLOOKUP(I42,Feuil1!$A$11:$F$29,2)))))","v":"FM+58"},null,{"$f":"T42-HLOOKUP(X42,#REF!,2,FALSE)","v":{"$error":"#REF!"}},{"$f":"T42-HLOOKUP(X42,#REF!,3,FALSE)","v":{"$error":"#REF!"}},{"$f":"T42-HLOOKUP(X42,#REF!,4,FALSE)","v":{"$error":"#REF!"}},{"$f":"T42-HLOOKUP(X42,#REF!,5,FALSE)","v":{"$error":"#REF!"}},{"$f":"T42-HLOOKUP(X42,#REF!,6,FALSE)","v":{"$error":"#REF!"}},{"$f":"T42-HLOOKUP(X42,#REF!,7,FALSE)","v":{"$error":"#REF!"}},{"$f":"T42-HLOOKUP(X42,#REF!,8,FALSE)","v":{"$error":"#REF!"}},{"$f":"T42-HLOOKUP(X42,#REF!,9,FALSE)","v":{"$error":"#REF!"}},null,null,null,null,null,null,null,{"$f":"IF(AG42>=0,$AG$4,IF(AF42>=0,$AF$4,IF(AE42>=0,$AE$4,IF(AD42>=0,$AD$4,IF(AC42>=0,$AC$4,IF(AB42>=0,$AB$4,IF(AA42>=0,$AA$4,IF(Z42>=0,$Z$4,$AH$4))))))))","v":{"$error":"#REF!"}}]
["F","CO","HNO",4,361094,"GALHAUT ","Lucie",2003,69.5,"CHM Le Trait","F",8,10,12,{"$f":"IF(MAXA(L43+M43,M43+N43,L43+N43,L43,M43,N43)<=0,0,MAXA(L43+M43,M43+N43,L43+N43,L43,M43,N43))","v":22},15,17,19,{"$f":"IF(MAXA(P43+Q43,Q43+R43,P43+R43,P43,Q43,R43)<=0,0,MAXA(P43+Q43,Q43+R43,P43+R43,P43,Q43,R43))","v":36},{"$f":"IF(H43=\"\",\"\",IF(OR(O43=0,S43=0),0,O43+S43))","v":58},{"$f":"IF(I43=\"\",\"\",IF(A43=\"H\",10^(0.794358141*LOG(I43/174.393)^2)*T43,IF(A43=\"F\",10^(0.89726074 * LOG(I43/148.026)^2)*T43,\"\")))","v":72.471441370374265},{"$f":"SUM(T43-I43)","v":-11.5},null,{"$f":"IF(A43=\"F\",(IF(OR(H43>2001,H43<2004),VLOOKUP(I43,Feuil1!$G$11:$H$25,2))),IF(A43=\"H\",(IF(OR(H43>2001,H43<2004),VLOOKUP(I43,Feuil1!$A$11:$F$29,2)))))","v":"FM+58"},null,{"$f":"T43-HLOOKUP(X43,#REF!,2,FALSE)","v":{"$error":"#REF!"}},{"$f":"T43-HLOOKUP(X43,#REF!,3,FALSE)","v":{"$error":"#REF!"}},{"$f":"T43-HLOOKUP(X43,#REF!,4,FALSE)","v":{"$error":"#REF!"}},{"$f":"T43-HLOOKUP(X43,#REF!,5,FALSE)","v":{"$error":"#REF!"}},{"$f":"T43-HLOOKUP(X43,#REF!,6,FALSE)","v":{"$error":"#REF!"}},{"$f":"T43-HLOOKUP(X43,#REF!,7,FALSE)","v":{"$error":"#REF!"}},{"$f":"T43-HLOOKUP(X43,#REF!,8,FALSE)","v":{"$error":"#REF!"}},{"$f":"T43-HLOOKUP(X43,#REF!,9,FALSE)","v":{"$error":"#REF!"}},null,null,null,null,null,null,null,{"$f":"IF(AG43>=0,$AG$4,IF(AF43>=0,$AF$4,IF(AE43>=0,$AE$4,IF(AD43>=0,$AD$4,IF(AC43>=0,$AC$4,IF(AB43>=0,$AB$4,IF(AA43>=0,$AA$4,IF(Z43>=0,$Z$4,$AH$4))))))))","v":{"$error":"#REF!"}}]
[null,null,null,null,null,null,null,null,null,null,null,null,null,null,null,null,null,null,null,null,null,null,null,null,null,{"$f":"T44-HLOOKUP(X44,#REF!,2,FALSE)","v":{"$error":"#REF!"}},{"$f":"T44-HLOOKUP(X44,#REF!,3,FALSE)","v":{"$error":"#REF!"}},{"$f":"T44-HLOOKUP(X44,#REF!,4,FALSE)","v":{"$error":"#REF!"}},{"$f":"T44-HLOOKUP(X44,#REF!,5,FALSE)","v":{"$error":"#REF!"}},{"$f":"T44-HLOOKUP(X44,#REF!,6,FALSE)","v":{"$error":"#REF!"}},{"$f":"T44-HLOOKUP(X44,#REF!,7,FALSE)","v":{"$error":"#REF!"}},{"$f":"T44-HLOOKUP(X44,#REF!,8,FALSE)","v":{"$error":"#REF!"}},{"$f":"T44-HLOOKUP(X44,#REF!,9,FALSE)","v":{"$error":"#REF!"}},null,null,null,null,null,null,null,{"$error":"#REF!"}]
[]
[]
[]
[]
[]
[]
[]
[]
[]
[]
[]
[]
[]
[]
[]
[]
[]
[]
[]
[]
[]
[]
[]
[]
[]
[]
[]
[]
[]
[]
[]
[]
[]
[]
[]
[]
[]
[]
[]
[]
[]
[]
[]
[]
[]
[]
[]
[]
[]
[]
[]
[]
[]
[]
[]
[]
[]
[]
[]
[]
[]
[]
[]
[]
[]
[]
[]
[]
[]
[]
[]
[]
[]
[]
[]
[]
[]
[]
[]
[]
[]
[]
[]
[]
[]
[]
[]
[]
[]
[]
[]
[]
[]
[]
[]
[]
[]
[]
[]
[]
[]
[]
[]
[]
[]
[]
[]
[]
[]
[]
[]
[]
[]
[]
[]
[]
[]
[]
[]
[]
[]
[]
[]
[]
[]
[]
[]
[]
[]
[]
[]
[]
[]
[]
[]
[]
[]
[]
[]
[]
[]
[]
[]
[]
[]
[]
[]
[]
[]
[]
[]
[]
[]
[]
[]
[]
[]
[]
[]
[]
[]
[]
[]
[]
[]
[]
[]
[]
[]
[]
[]
[]
[]
[]
[]
[]
[]
[]
[]
[]
[]
[]
[]
[]
[]
[]
[]
[]
[]
[]
[]
[]
[]
[]
[]
[]
[]
[]
[]
[]
[]
[]
[]
[]
[]
[]
[]
[]
[]
[]
[]
[]
[]
[]
[]
[]
[]
[]
[]
[]
[]
[]
[]
[]
[]
[]
[]
[]
[]
[]
[]
[]
[]
[]
[]
[]
[]
[]
[]
[]
[]
[]
[]
[]
[]
[]
[]
[]
[]
[]
[]
[]
[]
[]
[]
[]
[]
[]
[]
[]
[]
[]
[]
[]
[]
[]
[]
[]
[]
[]
[]
[]
[]
[]
[]
[]
[]
[]
[]
[]
[]
[]
[]
[]
[]
[]
[]
[]
[]
[]
[]
[]
[]
[]
[]
[]
[]
[]
[]
[]
[]
[]
[]
[]
[]
[]
[]
[]
[]
[]
[]
[]
[]
[]
[]
[]
[]
[]
[]
[]
[]
[]
[]
[]
[]
[]
[]
[]
[]
[]
[]
[]
[]
[]
[]
[]
[]
[]
[]
[]
[]
[]
[]
[]
[]
[]
[]
[]
[]
[]
[]
[]
[]
[]
[]
[]
[]
[]
[]
[]
[]
[]
[]
[]
[]
[]
[]
[]
[]
[]
[]
[]
[]
[]
[]
[]
[]
[]
[]
[]
[]
[]
[]
[]
[]
[]
[]
[]
[]
[]
[]
[]
[]
[]
[]
[]
[]
[]
[]
[]
[]
[]
[]
[]
[]
[]
[]
[]
[]
[]
[]
[]
[]
[]
[]
[]
[]
[]
[]
[]
[]
[]
[]
[]
[]
[]
[]
[]
[]
[]
[]
[]
[]
[]
[]
[]
[]
[]
[]
[]
[]
[]
[]
[]
[]
[]
[]
[]
[]
[]
[]
[]
[]
[]
[]
[]
[]
[]
[]
[]
[]
[]
[]
[]
[]
[]
[]
[]
[]
[]
[]
[]
[]
[]
[]
[]
[]
[]
[]
[]
[]
[]
[]
[]
[]
[]
[]
[]
[]
[]
[]
[]
[]
[]
[]
[]
[]
[]
[]
[null,null,null,null,null,null,null,null,null,null,null,null,null,null,null,null,null,null,null,null,null,null,null,null,"J69","J77","J85","J94","J105","J+105",null,"J56","J62","J69","J77","J85","J94","J105","J+105",null,"S56","S62","S69","S77","S85","S94","S105","S+105"]
[null,null,null,null,null,null,null,null,null,null,null,null,null,null,null,null,null,null,null,null,null,null,null,null,130,145,160,170,180,190,null,100,115,130,145,160,170,180,190,null,115,135,150,165,180,190,200,210]
[null,null,null,null,null,null,null,null,null,null,null,null,null,null,null,null,null,null,null,null,null,null,null,null,150,165,180,190,200,210,null,115,135,150,165,180,190,200,210,null,130,150,165,185,200,210,220,230]
[null,null,null,null,null,null,null,null,null,null,null,null,null,null,null,null,null,null,null,null,null,null,null,null,165,185,200,210,220,230,null,130,150,165,185,200,210,220,230,null,145,165,180,200,220,230,240,250]
[null,null,null,null,null,null,null,null,null,null,null,null,null,null,null,null,null,null,null,null,null,null,null,null,180,200,220,230,240,250,null,145,165,180,200,220,230,240,250,null,175,195,215,235,250,260,275,280]
[null,null,null,null,null,null,null,null,null,null,null,null,null,null,null,null,null,null,null,null,null,null,null,null,215,235,250,260,275,280,null,175,195,215,235,250,260,275,280,null,210,230,250,270,290,300,310,325]
[null,null,null,null,null,null,null,null,null,null,null,null,null,null,null,null,null,null,null,null,null,null,null,null,250,270,290,300,310,325,null,210,230,250,270,290,300,310,325,null,230,255,275,300,315,335,345,355]
[null,null,null,null,null,null,null,null,null,null,null,null,null,null,null,null,null,null,null,null,null,null,null,null,295,320,335,355,370,380,null,245,270,295,320,335,355,370,380,null,245,270,295,320,335,355,370,380]

{"sheet":"MINIMES GARCONS","index":1,"n_rows":645,"n_cols":48,"rows_kept":645,"cut":false,"hidden":false,"merged":[[0,6,0,14],[0,18,0,21],[1,5,1,10],[1,11,1,13],[1,14,1,17],[1,18,1,19],[1,21,1,22]]}
[null,null,null,"LISTING NATIONAL",null,null,"MINIMES GARCONS",null,null,null,null,null,null,null,null,null,"DATE :",null,"2015-03-08"]
[null,null,null," ",null,null,null,null,null,null,null,"2° TRIMESTRE"]
[]
["SEXE","ZONE","REG.","Place","LICENCE","NOMS","Prénoms","AN","POIDS","CLUB","NAT",1,2,3,"ARR",1,2,3,"EP-J","TOTAL","IWF","Points",null,"Catég"," ","DEP +","REG +","IRG +","FED +","NAT +","INTB +","INTA +","OLY +","NCL"]
[null,null,null,null,null,null,null,null,null,null,null,null,null,null,null,null,null,null,null,null,null,null,null,null,null,{"$f":"T5-HLOOKUP(X5,#REF!,2,FALSE)","v":{"$error":"#REF!"}},{"$f":"T5-HLOOKUP(X5,#REF!,3,FALSE)","v":{"$error":"#REF!"}},{"$f":"T5-HLOOKUP(X5,#REF!,4,FALSE)","v":{"$error":"#REF!"}},{"$f":"T5-HLOOKUP(X5,#REF!,5,FALSE)","v":{"$error":"#REF!"}},{"$f":"T5-HLOOKUP(X5,#REF!,6,FALSE)","v":{"$error":"#REF!"}},{"$f":"T5-HLOOKUP(X5,#REF!,7,FALSE)","v":{"$error":"#REF!"}},{"$f":"T5-HLOOKUP(X5,#REF!,8,FALSE)","v":{"$error":"#REF!"}},{"$f":"T5-HLOOKUP(X5,#REF!,9,FALSE)","v":{"$error":"#REF!"}},null,null,null,null,null,null,null,{"$f":"IF(AG5>=0,$AG$4,IF(AF5>=0,$AF$4,IF(AE5>=0,$AE$4,IF(AD5>=0,$AD$4,IF(AC5>=0,$AC$4,IF(AB5>=0,$AB$4,IF(AA5>=0,$AA$4,IF(Z5>=0,$Z$4,$AH$4))))))))","v":{"$error":"#REF!"}}]
["H","CO","PDL",1,355921,"COGNON","Théo",2002,40,"CJF LAVAL - VOUTRÉ","F",36,38,40,{"$f":"IF(MAXA(L6+M6,M6+N6,L6+N6,L6,M6,N6)<=0,0,MAXA(L6+M6,M6+N6,L6+N6,L6,M6,N6))","v":78},46,48,50,{"$f":"IF(MAXA(P6+Q6,Q6+R6,P6+R6,P6,Q6,R6)<=0,0,MAXA(P6+Q6,Q6+R6,P6+R6,P6,Q6,R6))","v":98},{"$f":"IF(H6=\"\",\"\",IF(OR(O6=0,S6=0),0,O6+S6))","v":176},{"$f":"IF(I6=\"\",\"\",IF(A6=\"H\",10^(0.794358141*LOG(I6/174.393)^2)*T6,IF(A6=\"F\",10^(0.89726074 * LOG(I6/148.026)^2)*T6,\"\")))","v":371.82803824702239},{"$f":"SUM(T6-I6)","v":136},null,{"$f":"IF(A6=\"F\",(IF(OR(H6>2001,H6<2004),VLOOKUP(I6,Feuil1!$G$11:$H$25,2))),IF(A6=\"H\",(IF(OR(H6>2001,H6<2004),VLOOKUP(I6,Feuil1!$A$11:$F$29,2)))))","v":"M40"},null,{"$f":"T6-HLOOKUP(X6,#REF!,2,FALSE)","v":{"$error":"#REF!"}},{"$f":"T6-HLOOKUP(X6,#REF!,3,FALSE)","v":{"$error":"#REF!"}},{"$f":"T6-HLOOKUP(X6,#REF!,4,FALSE)","v":{"$error":"#REF!"}},{"$f":"T6-HLOOKUP(X6,#REF!,5,FALSE)","v":{"$error":"#REF!"}},{"$f":"T6-HLOOKUP(X6,#REF!,6,FALSE)","v":{"$error":"#REF!"}},{"$f":"T6-HLOOKUP(X6,#REF!,7,FALSE)","v":{"$error":"#REF!"}},{"$f":"T6-HLOOKUP(X6,#REF!,8,FALSE)","v":{"$error":"#REF!"}},{"$f":"T6-HLOOKUP(X6,#REF!,9,FALSE)","v":{"$error":"#REF!"}},null,null,null,null,null,null,null,{"$f":"IF(AG6>=0,$AG$4,IF(AF6>=0,$AF$4,IF(AE6>=0,$AE$4,IF(AD6>=0,$AD$4,IF(AC6>=0,$AC$4,IF(AB6>=0,$AB$4,IF(AA6>=0,$AA$4,IF(Z6>=0,$Z$4,$AH$4))))))))","v":{"$error":"#REF!"}}]
["H","NORD","NPC",2,248952,"BUYSSCHAERT","Tristan",2003,35.1,"CHCD COMINES","F",30,32,-34,62,40,42,-44,82,144,349.4682500302215,108.9,null,{"$f":"IF(A7=\"F\",(IF(OR(H7>2001,H7<2004),VLOOKUP(I7,Feuil1!$G$11:$H$25,2))),IF(A7=\"H\",(IF(OR(H7>2001,H7<2004),VLOOKUP(I7,Feuil1!$A$11:$F$29,2)))))","v":"M40"},null,{"$f":"T7-HLOOKUP(X7,#REF!,2,FALSE)","v":{"$error":"#REF!"}},{"$f":"T7-HLOOKUP(X7,#REF!,3,FALSE)","v":{"$error":"#REF!"}},{"$f":"T7-HLOOKUP(X7,#REF!,4,FALSE)","v":{"$error":"#REF!"}},{"$f":"T7-HLOOKUP(X7,#REF!,5,FALSE)","v":{"$error":"#REF!"}},{"$f":"T7-HLOOKUP(X7,#REF!,6,FALSE)","v":{"$error":"#REF!"}},{"$f":"T7-HLOOKUP(X7,#REF!,7,FALSE)","v":{"$error":"#REF!"}},{"$f":"T7-HLOOKUP(X7,#REF!,8,FALSE)","v":{"$error":"#REF!"}},{"$f":"T7-HLOOKUP(X7,#REF!,9,FALSE)","v":{"$error":"#REF!"}},null,null,null,null,null,null,null,{"$error":"#REF!"}]
["H","CO","BRE",3,355330,"OLLIVIER","Leny",2003,35.799999999999997,"AL QUIMPER","F",-26,26,28,54,35,37,38,75,129,306.34271625703104,93.2,null,{"$f":"IF(A8=\"F\",(IF(OR(H8>2001,H8<2004),VLOOKUP(I8,Feuil1!$G$11:$H$25,2))),IF(A8=\"H\",(IF(OR(H8>2001,H8<2004),VLOOKUP(I8,Feuil1!$A$11:$F$29,2)))))","v":"M40"},null,{"$f":"T8-HLOOKUP(X8,#REF!,2,FALSE)","v":{"$error":"#REF!"}},{"$f":"T8-HLOOKUP(X8,#REF!,3,FALSE)","v":{"$error":"#REF!"}},{"$f":"T8-HLOOKUP(X8,#REF!,4,FALSE)","v":{"$error":"#REF!"}},{"$f":"T8-HLOOKUP(X8,#REF!,5,FALSE)","v":{"$error":"#REF!"}},{"$f":"T8-HLOOKUP(X8,#REF!,6,FALSE)","v":{"$error":"#REF!"}},{"$f":"T8-HLOOKUP(X8,#REF!,7,FALSE)","v":{"$error":"#REF!"}},{"$f":"T8-HLOOKUP(X8,#REF!,8,FALSE)","v":{"$error":"#REF!"}},{"$f":"T8-HLOOKUP(X8,#REF!,9,FALSE)","v":{"$error":"#REF!"}},null,null,null,null,null,null,null,{"$error":"#REF!"}]
["H","SEST","RAL",4,359944,"CHABERT","Lucas",2003,38.5,"La Ricamarie","F",24,26,28,54,32,-34,34,66,120,263.6898157984445,81.5,null,{"$f":"IF(A9=\"F\",(IF(OR(H9>2001,H9<2004),VLOOKUP(I9,Feuil1!$G$11:$H$25,2))),IF(A9=\"H\",(IF(OR(H9>2001,H9<2004),VLOOKUP(I9,Feuil1!$A$11:$F$29,2)))))","v":"M40"},null,{"$f":"T9-HLOOKUP(X9,#REF!,2,FALSE)","v":{"$error":"#REF!"}},{"$f":"T9-HLOOKUP(X9,#REF!,3,FALSE)","v":{"$error":"#REF!"}},{"$f":"T9-HLOOKUP(X9,#REF!,4,FALSE)","v":{"$error":"#REF!"}},{"$f":"T9-HLOOKUP(X9,#REF!,5,FALSE)","v":{"$error":"#REF!"}},{"$f":"T9-HLOOKUP(X9,#REF!,6,FALSE)","v":{"$error":"#REF!"}},{"$f":"T9-HLOOKUP(X9,#REF!,7,FALSE)","v":{"$error":"#REF!"}},{"$f":"T9-HLOOKUP(X9,#REF!,8,FALSE)","v":{"$error":"#REF!"}},{"$f":"T9-HLOOKUP(X9,#REF!,9,FALSE)","v":{"$error":"#REF!"}},null,null,null,null,null,null,null,{"$error":"#REF!"}]
["H","SO","MPY",5,378627,"VALEAN","Andrei",2003,39.9,"FIGEAC HC","R",23,25,27,52,31,33,35,68,120,254.16519033566215,80.099999999999994,null,{"$f":"IF(A10=\"F\",(IF(OR(H10>2001,H10<2004),VLOOKUP(I10,Feuil1!$G$11:$H$25,2))),IF(A10=\"H\",(IF(OR(H10>2001,H10<2004),VLOOKUP(I10,Feuil1!$A$11:$F$29,2)))))","v":"M40"},null,{"$f":"T10-HLOOKUP(X10,#REF!,2,FALSE)","v":{"$error":"#REF!"}},{"$f":"T10-HLOOKUP(X10,#REF!,3,FALSE)","v":{"$error":"#REF!"}},{"$f":"T10-HLOOKUP(X10,#REF!,4,FALSE)","v":{"$error":"#REF!"}},{"$f":"T10-HLOOKUP(X10,#REF!,5,FALSE)","v":{"$error":"#REF!"}},{"$f":"T10-HLOOKUP(X10,#REF!,6,FALSE)","v":{"$error":"#REF!"}},{"$f":"T10-HLOOKUP(X10,#REF!,7,FALSE)","v":{"$error":"#REF!"}},{"$f":"T10-HLOOKUP(X10,#REF!,8,FALSE)","v":{"$error":"#REF!"}},{"$f":"T10-HLOOKUP(X10,#REF!,9,FALSE)","v":{"$error":"#REF!"}},null,null,null,null,null,null,null,{"$error":"#REF!"}]
["H","SEST","CAZ",6,391434,"MERAUX ","Tom",2002,38.9,"ES VILLENEUVE LOUBET","F",-20,20,22,42,32,34,-36,66,108,234.78648425716207,69.099999999999994,null,{"$f":"IF(A11=\"F\",(IF(OR(H11>2001,H11<2004),VLOOKUP(I11,Feuil1!$G$11:$H$25,2))),IF(A11=\"H\",(IF(OR(H11>2001,H11<2004),VLOOKUP(I11,Feuil1!$A$11:$F$29,2)))))","v":"M40"},null,{"$f":"T11-HLOOKUP(X11,#REF!,2,FALSE)","v":{"$error":"#REF!"}},{"$f":"T11-HLOOKUP(X11,#REF!,3,FALSE)","v":{"$error":"#REF!"}},{"$f":"T11-HLOOKUP(X11,#REF!,4,FALSE)","v":{"$error":"#REF!"}},{"$f":"T11-HLOOKUP(X11,#REF!,5,FALSE)","v":{"$error":"#REF!"}},{"$f":"T11-HLOOKUP(X11,#REF!,6,FALSE)","v":{"$error":"#REF!"}},{"$f":"T11-HLOOKUP(X11,#REF!,7,FALSE)","v":{"$error":"#REF!"}},{"$f":"T11-HLOOKUP(X11,#REF!,8,FALSE)","v":{"$error":"#REF!"}},{"$f":"T11-HLOOKUP(X11,#REF!,9,FALSE)","v":{"$error":"#REF!"}},null,null,null,null,null,null,null,{"$error":"#REF!"}]
["H","CO","BRE",7,377882,"ENARD","Thibaut",2002,38.6,"AL QUIMPER","F",20,21,23,44,26,27,29,56,100,219.14869177457342,61.4,null,{"$f":"IF(A12=\"F\",(IF(OR(H12>2001,H12<2004),VLOOKUP(I12,Feuil1!$G$11:$H$25,2))),IF(A12=\"H\",(IF(OR(H12>2001,H12<2004),VLOOKUP(I12,Feuil1!$A$11:$F$29,2)))))","v":"M40"},null,{"$f":"T12-HLOOKUP(X12,#REF!,2,FALSE)","v":{"$error":"#REF!"}},{"$f":"T12-HLOOKUP(X12,#REF!,3,FALSE)","v":{"$error":"#REF!"}},{"$f":"T12-HLOOKUP(X12,#REF!,4,FALSE)","v":{"$error":"#REF!"}},{"$f":"T12-HLOOKUP(X12,#REF!,5,FALSE)","v":{"$error":"#REF!"}},{"$f":"T12-HLOOKUP(X12,#REF!,6,FALSE)","v":{"$error":"#REF!"}},{"$f":"T12-HLOOKUP(X12,#REF!,7,FALSE)","v":{"$error":"#REF!"}},{"$f":"T12-HLOOKUP(X12,#REF!,8,FALSE)","v":{"$error":"#REF!"}},{"$f":"T12-HLOOKUP(X12,#REF!,9,FALSE)","v":{"$error":"#REF!"}},null,null,null,null,null,null,null,{"$error":"#REF!"}]
["H","NORD","PIC",8,323797,"MARTIN","Thomas",2002,29.7,"Saleux CHM","F",18,20,22,42,25,27,29,56,98,288.86885557771507,68.3,null,{"$f":"IF(A13=\"F\",(IF(OR(H13>2001,H13<2004),VLOOKUP(I13,Feuil1!$G$11:$H$25,2))),IF(A13=\"H\",(IF(OR(H13>2001,H13<2004),VLOOKUP(I13,Feuil1!$A$11:$F$29,2)))))","v":"M40"},null,{"$f":"T13-HLOOKUP(X13,#REF!,2,FALSE)","v":{"$error":"#REF!"}},{"$f":"T13-HLOOKUP(X13,#REF!,3,FALSE)","v":{"$error":"#REF!"}},{"$f":"T13-HLOOKUP(X13,#REF!,4,FALSE)","v":{"$error":"#REF!"}},{"$f":"T13-HLOOKUP(X13,#REF!,5,FALSE)","v":{"$error":"#REF!"}},{"$f":"T13-HLOOKUP(X13,#REF!,6,FALSE)","v":{"$error":"#REF!"}},{"$f":"T13-HLOOKUP(X13,#REF!,7,FALSE)","v":{"$error":"#REF!"}},{"$f":"T13-HLOOKUP(X13,#REF!,8,FALSE)","v":{"$error":"#REF!"}},{"$f":"T13-HLOOKUP(X13,#REF!,9,FALSE)","v":{"$error":"#REF!"}},null,null,null,null,null,null,null,{"$error":"#REF!"}]
["H","NE","LOR",9,251046,"DUCHAUFFOUR","Lucas",2003,28.1,"H.VALLEROY-AUBOUÉ","F",20,-21,21,41,-27,27,29,56,97,306.25257315311359,68.900000000000006,null,{"$f":"IF(A14=\"F\",(IF(OR(H14>2001,H14<2004),VLOOKUP(I14,Feuil1!$G$11:$H$25,2))),IF(A14=\"H\",(IF(OR(H14>2001,H14<2004),VLOOKUP(I14,Feuil1!$A$11:$F$29,2)))))","v":"M40"},null,{"$f":"T14-HLOOKUP(X14,#REF!,2,FALSE)","v":{"$error":"#REF!"}},{"$f":"T14-HLOOKUP(X14,#REF!,3,FALSE)","v":{"$error":"#REF!"}},{"$f":"T14-HLOOKUP(X14,#REF!,4,FALSE)","v":{"$error":"#REF!"}},{"$f":"T14-HLOOKUP(X14,#REF!,5,FALSE)","v":{"$error":"#REF!"}},{"$f":"T14-HLOOKUP(X14,#REF!,6,FALSE)","v":{"$error":"#REF!"}},{"$f":"T14-HLOOKUP(X14,#REF!,7,FALSE)","v":{"$error":"#REF!"}},{"$f":"T14-HLOOKUP(X14,#REF!,8,FALSE)","v":{"$error":"#REF!"}},{"$f":"T14-HLOOKUP(X14,#REF!,9,FALSE)","v":{"$error":"#REF!"}},null,null,null,null,null,null,null,{"$error":"#REF!"}]
["H","SEST","RAL",10,373869,"MATHUREL","Lucas",2002,36.4,"CH Saint Baldoph","F",19,20,21,41,25,27,29,56,97,226.2273467812486,60.6,null,{"$f":"IF(A15=\"F\",(IF(OR(H15>2001,H15<2004),VLOOKUP(I15,Feuil1!$G$11:$H$25,2))),IF(A15=\"H\",(IF(OR(H15>2001,H15<2004),VLOOKUP(I15,Feuil1!$A$11:$F$29,2)))))","v":"M40"},null,{"$f":"T15-HLOOKUP(X15,#REF!,2,FALSE)","v":{"$error":"#REF!"}},{"$f":"T15-HLOOKUP(X15,#REF!,3,FALSE)","v":{"$error":"#REF!"}},{"$f":"T15-HLOOKUP(X15,#REF!,4,FALSE)","v":{"$error":"#REF!"}},{"$f":"T15-HLOOKUP(X15,#REF!,5,FALSE)","v":{"$error":"#REF!"}},{"$f":"T15-HLOOKUP(X15,#REF!,6,FALSE)","v":{"$error":"#REF!"}},{"$f":"T15-HLOOKUP(X15,#REF!,7,FALSE)","v":{"$error":"#REF!"}},{"$f":"T15-HLOOKUP(X15,#REF!,8,FALSE)","v":{"$error":"#REF!"}},{"$f":"T15-HLOOKUP(X15,#REF!,9,FALSE)","v":{"$error":"#REF!"}},null,null,null,null,null,null,null,{"$error":"#REF!"}]
["H","NE","ALS",11,375712,"VOLTZ","ANTOINE",2003,40,"SHC Haguenau","F",18,20,22,42,23,25,27,52,94,198.5899749728415,54,null,{"$f":"IF(A16=\"F\",(IF(OR(H16>2001,H16<2004),VLOOKUP(I16,Feuil1!$G$11:$H$25,2))),IF(A16=\"H\",(IF(OR(H16>2001,H16<2004),VLOOKUP(I16,Feuil1!$A$11:$F$29,2)))))","v":"M40"},null,{"$f":"T16-HLOOKUP(X16,#REF!,2,FALSE)","v":{"$error":"#REF!"}},{"$f":"T16-HLOOKUP(X16,#REF!,3,FALSE)","v":{"$error":"#REF!"}},{"$f":"T16-HLOOKUP(X16,#REF!,4,FALSE)","v":{"$error":"#REF!"}},{"$f":"T16-HLOOKUP(X16,#REF!,5,FALSE)","v":{"$error":"#REF!"}},{"$f":"T16-HLOOKUP(X16,#REF!,6,FALSE)","v":{"$error":"#REF!"}},{"$f":"T16-HLOOKUP(X16,#REF!,7,FALSE)","v":{"$error":"#REF!"}},{"$f":"T16-HLOOKUP(X16,#REF!,8,FALSE)","v":{"$error":"#REF!"}},{"$f":"T16-HLOOKUP(X16,#REF!,9,FALSE)","v":{"$error":"#REF!"}},null,null,null,null,null,null,null,{"$error":"#REF!"}]
["H","NORD","NPC",12,392615,"LECOINTRE","Charles",2003,37.9,"CHCD COMINES","F",15,17,19,36,27,29,-31,56,92,205.51665169128395,54.1,null,{"$f":"IF(A17=\"F\",(IF(OR(H17>2001,H17<2004),VLOOKUP(I17,Feuil1!$G$11:$H$25,2))),IF(A17=\"H\",(IF(OR(H17>2001,H17<2004),VLOOKUP(I17,Feuil1!$A$11:$F$29,2)))))","v":"M40"},null,{"$f":"T17-HLOOKUP(X17,#REF!,2,FALSE)","v":{"$error":"#REF!"}},{"$f":"T17-HLOOKUP(X17,#REF!,3,FALSE)","v":{"$error":"#REF!"}},{"$f":"T17-HLOOKUP(X17,#REF!,4,FALSE)","v":{"$error":"#REF!"}},{"$f":"T17-HLOOKUP(X17,#REF!,5,FALSE)","v":{"$error":"#REF!"}},{"$f":"T17-HLOOKUP(X17,#REF!,6,FALSE)","v":{"$error":"#REF!"}},{"$f":"T17-HLOOKUP(X17,#REF!,7,FALSE)","v":{"$error":"#REF!"}},{"$f":"T17-HLOOKUP(X17,#REF!,8,FALSE)","v":{"$error":"#REF!"}},{"$f":"T17-HLOOKUP(X17,#REF!,9,FALSE)","v":{"$error":"#REF!"}},null,null,null,null,null,null,null,{"$error":"#REF!"}]
["H","SE","PRO",13,320573,"POUBLAN","Thomas",2002,29.6,"EEAR MONTEUX","F",15,17,19,36,20,22,24,46,82,242.7052533929488,52.4,null,{"$f":"IF(A18=\"F\",(IF(OR(H18>2001,H18<2004),VLOOKUP(I18,Feuil1!$G$11:$H$25,2))),IF(A18=\"H\",(IF(OR(H18>2001,H18<2004),VLOOKUP(I18,Feuil1!$A$11:$F$29,2)))))","v":"M40"},null,{"$f":"T18-HLOOKUP(X18,#REF!,2,FALSE)","v":{"$error":"#REF!"}},{"$f":"T18-HLOOKUP(X18,#REF!,3,FALSE)","v":{"$error":"#REF!"}},{"$f":"T18-HLOOKUP(X18,#REF!,4,FALSE)","v":{"$error":"#REF!"}},{"$f":"T18-HLOOKUP(X18,#REF!,5,FALSE)","v":{"$error":"#REF!"}},{"$f":"T18-HLOOKUP(X18,#REF!,6,FALSE)","v":{"$error":"#REF!"}},{"$f":"T18-HLOOKUP(X18,#REF!,7,FALSE)","v":{"$error":"#REF!"}},{"$f":"T18-HLOOKUP(X18,#REF!,8,FALSE)","v":{"$error":"#REF!"}},{"$f":"T18-HLOOKUP(X18,#REF!,9,FALSE)","v":{"$error":"#REF!"}},null,null,null,null,null,null,null,{"$error":"#REF!"}]
["H","NORD","NPC",14,386699,"ROEGIERS","Jérôme",2003,34,"CHCD COMINES","F",15,17,19,36,20,22,24,46,82,206.20839463040809,48,null,{"$f":"IF(A19=\"F\",(IF(OR(H19>2001,H19<2004),VLOOKUP(I19,Feuil1!$G$11:$H$25,2))),IF(A19=\"H\",(IF(OR(H19>2001,H19<2004),VLOOKUP(I19,Feuil1!$A$11:$F$29,2)))))","v":"M40"},null,{"$f":"T19-HLOOKUP(X19,#REF!,2,FALSE)","v":{"$error":"#REF!"}},{"$f":"T19-HLOOKUP(X19,#REF!,3,FALSE)","v":{"$error":"#REF!"}},{"$f":"T19-HLOOKUP(X19,#REF!,4,FALSE)","v":{"$error":"#REF!"}},{"$f":"T19-HLOOKUP(X19,#REF!,5,FALSE)","v":{"$error":"#REF!"}},{"$f":"T19-HLOOKUP(X19,#REF!,6,FALSE)","v":{"$error":"#REF!"}},{"$f":"T19-HLOOKUP(X19,#REF!,7,FALSE)","v":{"$error":"#REF!"}},{"$f":"T19-HLOOKUP(X19,#REF!,8,FALSE)","v":{"$error":"#REF!"}},{"$f":"T19-HLOOKUP(X19,#REF!,9,FALSE)","v":{"$error":"#REF!"}},null,null,null,null,null,null,null,{"$error":"#REF!"}]
["H","SEST","RAL",15,357869,"BARBIER","Jocelyn",2003,39.5,"Vaulx en Velin","F",15,17,19,36,20,22,24,46,82,175.47569552905856,42.5,null,{"$f":"IF(A20=\"F\",(IF(OR(H20>2001,H20<2004),VLOOKUP(I20,Feuil1!$G$11:$H$25,2))),IF(A20=\"H\",(IF(OR(H20>2001,H20<2004),VLOOKUP(I20,Feuil1!$A$11:$F$29,2)))))","v":"M40"},null,{"$f":"T20-HLOOKUP(X20,#REF!,2,FALSE)","v":{"$error":"#REF!"}},{"$f":"T20-HLOOKUP(X20,#REF!,3,FALSE)","v":{"$error":"#REF!"}},{"$f":"T20-HLOOKUP(X20,#REF!,4,FALSE)","v":{"$error":"#REF!"}},{"$f":"T20-HLOOKUP(X20,#REF!,5,FALSE)","v":{"$error":"#REF!"}},{"$f":"T20-HLOOKUP(X20,#REF!,6,FALSE)","v":{"$error":"#REF!"}},{"$f":"T20-HLOOKUP(X20,#REF!,7,FALSE)","v":{"$error":"#REF!"}},{"$f":"T20-HLOOKUP(X20,#REF!,8,FALSE)","v":{"$error":"#REF!"}},{"$f":"T20-HLOOKUP(X20,#REF!,9,FALSE)","v":{"$error":"#REF!"}},null,null,null,null,null,null,null,{"$error":"#REF!"}]
["H","NORD","NPC",16,369340,"FOURNIER","Romain",2002,37,"ST POL/MER","F",15,17,19,36,20,22,-24,42,78,178.74442442115927,41,null,{"$f":"IF(A21=\"F\",(IF(OR(H21>2001,H21<2004),VLOOKUP(I21,Feuil1!$G$11:$H$25,2))),IF(A21=\"H\",(IF(OR(H21>2001,H21<2004),VLOOKUP(I21,Feuil1!$A$11:$F$29,2)))))","v":"M40"},null,{"$f":"T21-HLOOKUP(X21,#REF!,2,FALSE)","v":{"$error":"#REF!"}},{"$f":"T21-HLOOKUP(X21,#REF!,3,FALSE)","v":{"$error":"#REF!"}},{"$f":"T21-HLOOKUP(X21,#REF!,4,FALSE)","v":{"$error":"#REF!"}},{"$f":"T21-HLOOKUP(X21,#REF!,5,FALSE)","v":{"$error":"#REF!"}},{"$f":"T21-HLOOKUP(X21,#REF!,6,FALSE)","v":{"$error":"#REF!"}},{"$f":"T21-HLOOKUP(X21,#REF!,7,FALSE)","v":{"$error":"#REF!"}},{"$f":"T21-HLOOKUP(X21,#REF!,8,FALSE)","v":{"$error":"#REF!"}},{"$f":"T21-HLOOKUP(X21,#REF!,9,FALSE)","v":{"$error":"#REF!"}},null,null,null,null,null,null,null,{"$error":"#REF!"}]
["H","N","IDF",17,335649,"LEDEAN","LOUAN",2002,35.299999999999997,"PONTOISE","F",14,16,18,34,18,20,22,42,76,183.28809792584258,40.700000000000003,null,{"$f":"IF(A22=\"F\",(IF(OR(H22>2001,H22<2004),VLOOKUP(I22,Feuil1!$G$11:$H$25,2))),IF(A22=\"H\",(IF(OR(H22>2001,H22<2004),VLOOKUP(I22,Feuil1!$A$11:$F$29,2)))))","v":"M40"},null,{"$f":"T22-HLOOKUP(X22,#REF!,2,FALSE)","v":{"$error":"#REF!"}},{"$f":"T22-HLOOKUP(X22,#REF!,3,FALSE)","v":{"$error":"#REF!"}},{"$f":"T22-HLOOKUP(X22,#REF!,4,FALSE)","v":{"$error":"#REF!"}},{"$f":"T22-HLOOKUP(X22,#REF!,5,FALSE)","v":{"$error":"#REF!"}},{"$f":"T22-HLOOKUP(X22,#REF!,6,FALSE)","v":{"$error":"#REF!"}},{"$f":"T22-HLOOKUP(X22,#REF!,7,FALSE)","v":{"$error":"#REF!"}},{"$f":"T22-HLOOKUP(X22,#REF!,8,FALSE)","v":{"$error":"#REF!"}},{"$f":"T22-HLOOKUP(X22,#REF!,9,FALSE)","v":{"$error":"#REF!"}},null,null,null,null,null,null,null,{"$error":"#REF!"}]
["H","CO","BRE",18,378678,"VANLOQUEREN","Jolan",2003,34.299999999999997,"CHM Plouhinec","F",14,-16,16,30,17,19,21,40,70,174.30035920573945,35.700000000000003,null,{"$f":"IF(A23=\"F\",(IF(OR(H23>2001,H23<2004),VLOOKUP(I23,Feuil1!$G$11:$H$25,2))),IF(A23=\"H\",(IF(OR(H23>2001,H23<2004),VLOOKUP(I23,Feuil1!$A$11:$F$29,2)))))","v":"M40"},null,{"$f":"T23-HLOOKUP(X23,#REF!,2,FALSE)","v":{"$error":"#REF!"}},{"$f":"T23-HLOOKUP(X23,#REF!,3,FALSE)","v":{"$error":"#REF!"}},{"$f":"T23-HLOOKUP(X23,#REF!,4,FALSE)","v":{"$error":"#REF!"}},{"$f":"T23-HLOOKUP(X23,#REF!,5,FALSE)","v":{"$error":"#REF!"}},{"$f":"T23-HLOOKUP(X23,#REF!,6,FALSE)","v":{"$error":"#REF!"}},{"$f":"T23-HLOOKUP(X23,#REF!,7,FALSE)","v":{"$error":"#REF!"}},{"$f":"T23-HLOOKUP(X23,#REF!,8,FALSE)","v":{"$error":"#REF!"}},{"$f":"T23-HLOOKUP(X23,#REF!,9,FALSE)","v":{"$error":"#REF!"}},null,null,null,null,null,null,null,{"$error":"#REF!"}]
["H","SO","POI",19,384574,"FERNANDES","Hugo",2003,37.6,"St-Jean d'Angély","F",14,16,-18,30,17,19,21,40,70,157.68902746129345,32.4,null,{"$f":"IF(A24=\"F\",(IF(OR(H24>2001,H24<2004),VLOOKUP(I24,Feuil1!$G$11:$H$25,2))),IF(A24=\"H\",(IF(OR(H24>2001,H24<2004),VLOOKUP(I24,Feuil1!$A$11:$F$29,2)))))","v":"M40"},null,{"$f":"T24-HLOOKUP(X24,#REF!,2,FALSE)","v":{"$error":"#REF!"}},{"$f":"T24-HLOOKUP(X24,#REF!,3,FALSE)","v":{"$error":"#REF!"}},{"$f":"T24-HLOOKUP(X24,#REF!,4,FALSE)","v":{"$error":"#REF!"}},{"$f":"T24-HLOOKUP(X24,#REF!,5,FALSE)","v":{"$error":"#REF!"}},{"$f":"T24-HLOOKUP(X24,#REF!,6,FALSE)","v":{"$error":"#REF!"}},{"$f":"T24-HLOOKUP(X24,#REF!,7,FALSE)","v":{"$error":"#REF!"}},{"$f":"T24-HLOOKUP(X24,#REF!,8,FALSE)","v":{"$error":"#REF!"}},{"$f":"T24-HLOOKUP(X24,#REF!,9,FALSE)","v":{"$error":"#REF!"}},null,null,null,null,null,null,null,{"$error":"#REF!"}]
["H","NE","ALS",20,377282,"ALLAIN","ARSENE",2002,31.1,"ASPTT Strasbourg","F",13,15,16,31,16,18,20,38,69,192.40199090205007,37.9,null,{"$f":"IF(A25=\"F\",(IF(OR(H25>2001,H25<2004),VLOOKUP(I25,Feuil1!$G$11:$H$25,2))),IF(A25=\"H\",(IF(OR(H25>2001,H25<2004),VLOOKUP(I25,Feuil1!$A$11:$F$29,2)))))","v":"M40"},null,{"$f":"T25-HLOOKUP(X25,#REF!,2,FALSE)","v":{"$error":"#REF!"}},{"$f":"T25-HLOOKUP(X25,#REF!,3,FALSE)","v":{"$error":"#REF!"}},{"$f":"T25-HLOOKUP(X25,#REF!,4,FALSE)","v":{"$error":"#REF!"}},{"$f":"T25-HLOOKUP(X25,#REF!,5,FALSE)","v":{"$error":"#REF!"}},{"$f":"T25-HLOOKUP(X25,#REF!,6,FALSE)","v":{"$error":"#REF!"}},{"$f":"T25-HLOOKUP(X25,#REF!,7,FALSE)","v":{"$error":"#REF!"}},{"$f":"T25-HLOOKUP(X25,#REF!,8,FALSE)","v":{"$error":"#REF!"}},{"$f":"T25-HLOOKUP(X25,#REF!,9,FALSE)","v":{"$error":"#REF!"}},null,null,null,null,null,null,null,{"$error":"#REF!"}]
["H","CO","CEN",21,378393,"BAH","Idriss",2002,34.200000000000003,"AAJ BLOIS","F",15,16,-17,31,17,18,19,37,68,169.87644052840491,33.799999999999997,null,{"$f":"IF(A26=\"F\",(IF(OR(H26>2001,H26<2004),VLOOKUP(I26,Feuil1!$G$11:$H$25,2))),IF(A26=\"H\",(IF(OR(H26>2001,H26<2004),VLOOKUP(I26,Feuil1!$A$11:$F$29,2)))))","v":"M40"},null,{"$f":"T26-HLOOKUP(X26,#REF!,2,FALSE)","v":{"$error":"#REF!"}},{"$f":"T26-HLOOKUP(X26,#REF!,3,FALSE)","v":{"$error":"#REF!"}},{"$f":"T26-HLOOKUP(X26,#REF!,4,FALSE)","v":{"$error":"#REF!"}},{"$f":"T26-HLOOKUP(X26,#REF!,5,FALSE)","v":{"$error":"#REF!"}},{"$f":"T26-HLOOKUP(X26,#REF!,6,FALSE)","v":{"$error":"#REF!"}},{"$f":"T26-HLOOKUP(X26,#REF!,7,FALSE)","v":{"$error":"#REF!"}},{"$f":"T26-HLOOKUP(X26,#REF!,8,FALSE)","v":{"$error":"#REF!"}},{"$f":"T26-HLOOKUP(X26,#REF!,9,FALSE)","v":{"$error":"#REF!"}},null,null,null,null,null,null,null,{"$error":"#REF!"}]
["H","NORD","NPC",22,359629,"ETCHEVERRY","Antoine",2003,24.7,"C.A.ROSENDAEL","F",12,14,15,29,15,17,19,36,65,242.80691351741339,40.299999999999997,null,{"$f":"IF(A27=\"F\",(IF(OR(H27>2001,H27<2004),VLOOKUP(I27,Feuil1!$G$11:$H$25,2))),IF(A27=\"H\",(IF(OR(H27>2001,H27<2004),VLOOKUP(I27,Feuil1!$A$11:$F$29,2)))))","v":"M40"},null,{"$f":"T27-HLOOKUP(X27,#REF!,2,FALSE)","v":{"$error":"#REF!"}},{"$f":"T27-HLOOKUP(X27,#REF!,3,FALSE)","v":{"$error":"#REF!"}},{"$f":"T27-HLOOKUP(X27,#REF!,4,FALSE)","v":{"$error":"#REF!"}},{"$f":"T27-HLOOKUP(X27,#REF!,5,FALSE)","v":{"$error":"#REF!"}},{"$f":"T27-HLOOKUP(X27,#REF!,6,FALSE)","v":{"$error":"#REF!"}},{"$f":"T27-HLOOKUP(X27,#REF!,7,FALSE)","v":{"$error":"#REF!"}},{"$f":"T27-HLOOKUP(X27,#REF!,8,FALSE)","v":{"$error":"#REF!"}},{"$f":"T27-HLOOKUP(X27,#REF!,9,FALSE)","v":{"$error":"#REF!"}},null,null,null,null,null,null,null,{"$error":"#REF!"}]
["H","NE","CHA",23," 376655","GUSTIN","Isario",2003,34.6,"Reims HM","F",10,12,14,26,16,18,20,38,64,157.81496077749742,29.4,null,{"$f":"IF(A28=\"F\",(IF(OR(H28>2001,H28<2004),VLOOKUP(I28,Feuil1!$G$11:$H$25,2))),IF(A28=\"H\",(IF(OR(H28>2001,H28<2004),VLOOKUP(I28,Feuil1!$A$11:$F$29,2)))))","v":"M40"},null,{"$f":"T28-HLOOKUP(X28,#REF!,2,FALSE)","v":{"$error":"#REF!"}},{"$f":"T28-HLOOKUP(X28,#REF!,3,FALSE)","v":{"$error":"#REF!"}},{"$f":"T28-HLOOKUP(X28,#REF!,4,FALSE)","v":{"$error":"#REF!"}},{"$f":"T28-HLOOKUP(X28,#REF!,5,FALSE)","v":{"$error":"#REF!"}},{"$f":"T28-HLOOKUP(X28,#REF!,6,FALSE)","v":{"$error":"#REF!"}},{"$f":"T28-HLOOKUP(X28,#REF!,7,FALSE)","v":{"$error":"#REF!"}},{"$f":"T28-HLOOKUP(X28,#REF!,8,FALSE)","v":{"$error":"#REF!"}},{"$f":"T28-HLOOKUP(X28,#REF!,9,FALSE)","v":{"$error":"#REF!"}},null,null,null,null,null,null,null,{"$error":"#REF!"}]
["H","SO","MPY",24,378624,"MELIA","Maxence",2002,39.799999999999997,"FIGEAC HC","F",10,12,13,25,16,18,20,38,63,133.77821276885618,23.200000000000003,null,{"$f":"IF(A29=\"F\",(IF(OR(H29>2001,H29<2004),VLOOKUP(I29,Feuil1!$G$11:$H$25,2))),IF(A29=\"H\",(IF(OR(H29>2001,H29<2004),VLOOKUP(I29,Feuil1!$A$11:$F$29,2)))))","v":"M40"},null,{"$f":"T29-HLOOKUP(X29,#REF!,2,FALSE)","v":{"$error":"#REF!"}},{"$f":"T29-HLOOKUP(X29,#REF!,3,FALSE)","v":{"$error":"#REF!"}},{"$f":"T29-HLOOKUP(X29,#REF!,4,FALSE)","v":{"$error":"#REF!"}},{"$f":"T29-HLOOKUP(X29,#REF!,5,FALSE)","v":{"$error":"#REF!"}},{"$f":"T29-HLOOKUP(X29,#REF!,6,FALSE)","v":{"$error":"#REF!"}},{"$f":"T29-HLOOKUP(X29,#REF!,7,FALSE)","v":{"$error":"#REF!"}},{"$f":"T29-HLOOKUP(X29,#REF!,8,FALSE)","v":{"$error":"#REF!"}},{"$f":"T29-HLOOKUP(X29,#REF!,9,FALSE)","v":{"$error":"#REF!"}},null,null,null,null,null,null,null,{"$error":"#REF!"}]
["H","CO","CEN",25,375839,"DALLIER","Dévy",2002,35.4,"CHM CHATEAUROUX","F",14,15,-16,29,16,-17,17,33,62,149.05943523672593,26.6,null,{"$f":"IF(A30=\"F\",(IF(OR(H30>2001,H30<2004),VLOOKUP(I30,Feuil1!$G$11:$H$25,2))),IF(A30=\"H\",(IF(OR(H30>2001,H30<2004),VLOOKUP(I30,Feuil1!$A$11:$F$29,2)))))","v":"M40"},null,{"$f":"T30-HLOOKUP(X30,#REF!,2,FALSE)","v":{"$error":"#REF!"}},{"$f":"T30-HLOOKUP(X30,#REF!,3,FALSE)","v":{"$error":"#REF!"}},{"$f":"T30-HLOOKUP(X30,#REF!,4,FALSE)","v":{"$error":"#REF!"}},{"$f":"T30-HLOOKUP(X30,#REF!,5,FALSE)","v":{"$error":"#REF!"}},{"$f":"T30-HLOOKUP(X30,#REF!,6,FALSE)","v":{"$error":"#REF!"}},{"$f":"T30-HLOOKUP(X30,#REF!,7,FALSE)","v":{"$error":"#REF!"}},{"$f":"T30-HLOOKUP(X30,#REF!,8,FALSE)","v":{"$error":"#REF!"}},{"$f":"T30-HLOOKUP(X30,#REF!,9,FALSE)","v":{"$error":"#REF!"}},null,null,null,null,null,null,null,{"$error":"#REF!"}]
["H","SEST","RAL",26,377714,"SIMON","Matteo",2002,36.799999999999997,"Saint Marcellin","F",12,14,-16,26,15,17,19,36,62,142.90651420006301,25.200000000000003,null,{"$f":"IF(A31=\"F\",(IF(OR(H31>2001,H31<2004),VLOOKUP(I31,Feuil1!$G$11:$H$25,2))),IF(A31=\"H\",(IF(OR(H31>2001,H31<2004),VLOOKUP(I31,Feuil1!$A$11:$F$29,2)))))","v":"M40"},null,{"$f":"T31-HLOOKUP(X31,#REF!,2,FALSE)","v":{"$error":"#REF!"}},{"$f":"T31-HLOOKUP(X31,#REF!,3,FALSE)","v":{"$error":"#REF!"}},{"$f":"T31-HLOOKUP(X31,#REF!,4,FALSE)","v":{"$error":"#REF!"}},{"$f":"T31-HLOOKUP(X31,#REF!,5,FALSE)","v":{"$error":"#REF!"}},{"$f":"T31-HLOOKUP(X31,#REF!,6,FALSE)","v":{"$error":"#REF!"}},{"$f":"T31-HLOOKUP(X31,#REF!,7,FALSE)","v":{"$error":"#REF!"}},{"$f":"T31-HLOOKUP(X31,#REF!,8,FALSE)","v":{"$error":"#REF!"}},{"$f":"T31-HLOOKUP(X31,#REF!,9,FALSE)","v":{"$error":"#REF!"}},null,null,null,null,null,null,null,{"$error":"#REF!"}]
["H","NE","CHA",27," 376654","GUSTIN","Ophelio",2002,32.200000000000003,"Reims HM","F",10,12,-14,22,16,18,20,38,60,160.59626319202229,27.799999999999997,null,{"$f":"IF(A32=\"F\",(IF(OR(H32>2001,H32<2004),VLOOKUP(I32,Feuil1!$G$11:$H$25,2))),IF(A32=\"H\",(IF(OR(H32>2001,H32<2004),VLOOKUP(I32,Feuil1!$A$11:$F$29,2)))))","v":"M40"},null,{"$f":"T32-HLOOKUP(X32,#REF!,2,FALSE)","v":{"$error":"#REF!"}},{"$f":"T32-HLOOKUP(X32,#REF!,3,FALSE)","v":{"$error":"#REF!"}},{"$f":"T32-HLOOKUP(X32,#REF!,4,FALSE)","v":{"$error":"#REF!"}},{"$f":"T32-HLOOKUP(X32,#REF!,5,FALSE)","v":{"$error":"#REF!"}},{"$f":"T32-HLOOKUP(X32,#REF!,6,FALSE)","v":{"$error":"#REF!"}},{"$f":"T32-HLOOKUP(X32,#REF!,7,FALSE)","v":{"$error":"#REF!"}},{"$f":"T32-HLOOKUP(X32,#REF!,8,FALSE)","v":{"$error":"#REF!"}},{"$f":"T32-HLOOKUP(X32,#REF!,9,FALSE)","v":{"$error":"#REF!"}},null,null,null,null,null,null,null,{"$error":"#REF!"}]
["H","NE","CHA",28,387908,"CHAMARANDE","Johanny",2002,39.4,"Langres HM","F",10,12,14,26,14,16,18,34,60,128.73104768121976,20.6,null,{"$f":"IF(A33=\"F\",(IF(OR(H33>2001,H33<2004),VLOOKUP(I33,Feuil1!$G$11:$H$25,2))),IF(A33=\"H\",(IF(OR(H33>2001,H33<2004),VLOOKUP(I33,Feuil1!$A$11:$F$29,2)))))","v":"M40"},null,{"$f":"T33-HLOOKUP(X33,#REF!,2,FALSE)","v":{"$error":"#REF!"}},{"$f":"T33-HLOOKUP(X33,#REF!,3,FALSE)","v":{"$error":"#REF!"}},{"$f":"T33-HLOOKUP(X33,#REF!,4,FALSE)","v":{"$error":"#REF!"}},{"$f":"T33-HLOOKUP(X33,#REF!,5,FALSE)","v":{"$error":"#REF!"}},{"$f":"T33-HLOOKUP(X33,#REF!,6,FALSE)","v":{"$error":"#REF!"}},{"$f":"T33-HLOOKUP(X33,#REF!,7,FALSE)","v":{"$error":"#REF!"}},{"$f":"T33-HLOOKUP(X33,#REF!,8,FALSE)","v":{"$error":"#REF!"}},{"$f":"T33-HLOOKUP(X33,#REF!,9,FALSE)","v":{"$error":"#REF!"}},null,null,null,null,null,null,null,{"$error":"#REF!"}]
["H","SE","PRO",29,379241,"LABBE","Andy",2002,35,"EEAR MONTEUX","F",10,12,14,26,13,15,17,32,58,141.20334432679806,23,null,{"$f":"IF(A34=\"F\",(IF(OR(H34>2001,H34<2004),VLOOKUP(I34,Feuil1!$G$11:$H$25,2))),IF(A34=\"H\",(IF(OR(H34>2001,H34<2004),VLOOKUP(I34,Feuil1!$A$11:$F$29,2)))))","v":"M40"},null,{"$f":"T34-HLOOKUP(X34,#REF!,2,FALSE)","v":{"$error":"#REF!"}},{"$f":"T34-HLOOKUP(X34,#REF!,3,FALSE)","v":{"$error":"#REF!"}},{"$f":"T34-HLOOKUP(X34,#REF!,4,FALSE)","v":{"$error":"#REF!"}},{"$f":"T34-HLOOKUP(X34,#REF!,5,FALSE)","v":{"$error":"#REF!"}},{"$f":"T34-HLOOKUP(X34,#REF!,6,FALSE)","v":{"$error":"#REF!"}},{"$f":"T34-HLOOKUP(X34,#REF!,7,FALSE)","v":{"$error":"#REF!"}},{"$f":"T34-HLOOKUP(X34,#REF!,8,FALSE)","v":{"$error":"#REF!"}},{"$f":"T34-HLOOKUP(X34,#REF!,9,FALSE)","v":{"$error":"#REF!"}},null,null,null,null,null,null,null,{"$error":"#REF!"}]
["H","SEST","RAL",30,377618,"GRASPERGE","Amory",2002,36.6,"Vaulx en Velin","F",8,10,12,22,10,12,13,25,47,108.9690716804392,10.399999999999999,null,{"$f":"IF(A35=\"F\",(IF(OR(H35>2001,H35<2004),VLOOKUP(I35,Feuil1!$G$11:$H$25,2))),IF(A35=\"H\",(IF(OR(H35>2001,H35<2004),VLOOKUP(I35,Feuil1!$A$11:$F$29,2)))))","v":"M40"},null,{"$f":"T35-HLOOKUP(X35,#REF!,2,FALSE)","v":{"$error":"#REF!"}},{"$f":"T35-HLOOKUP(X35,#REF!,3,FALSE)","v":{"$error":"#REF!"}},{"$f":"T35-HLOOKUP(X35,#REF!,4,FALSE)","v":{"$error":"#REF!"}},{"$f":"T35-HLOOKUP(X35,#REF!,5,FALSE)","v":{"$error":"#REF!"}},{"$f":"T35-HLOOKUP(X35,#REF!,6,FALSE)","v":{"$error":"#REF!"}},{"$f":"T35-HLOOKUP(X35,#REF!,7,FALSE)","v":{"$error":"#REF!"}},{"$f":"T35-HLOOKUP(X35,#REF!,8,FALSE)","v":{"$error":"#REF!"}},{"$f":"T35-HLOOKUP(X35,#REF!,9,FALSE)","v":{"$error":"#REF!"}},null,null,null,null,null,null,null,{"$error":"#REF!"}]
["H","SE","LAN",31,378498,"CAYROL","Jimmy",2003,34.4,"Frontignan AC","F",7,9,11,20,10,12,14,26,46,114.16704622011579,11.600000000000001,null,{"$f":"IF(A36=\"F\",(IF(OR(H36>2001,H36<2004),VLOOKUP(I36,Feuil1!$G$11:$H$25,2))),IF(A36=\"H\",(IF(OR(H36>2001,H36<2004),VLOOKUP(I36,Feuil1!$A$11:$F$29,2)))))","v":"M40"},null,{"$f":"T36-HLOOKUP(X36,#REF!,2,FALSE)","v":{"$error":"#REF!"}},{"$f":"T36-HLOOKUP(X36,#REF!,3,FALSE)","v":{"$error":"#REF!"}},{"$f":"T36-HLOOKUP(X36,#REF!,4,FALSE)","v":{"$error":"#REF!"}},{"$f":"T36-HLOOKUP(X36,#REF!,5,FALSE)","v":{"$error":"#REF!"}},{"$f":"T36-HLOOKUP(X36,#REF!,6,FALSE)","v":{"$error":"#REF!"}},{"$f":"T36-HLOOKUP(X36,#REF!,7,FALSE)","v":{"$error":"#REF!"}},{"$f":"T36-HLOOKUP(X36,#REF!,8,FALSE)","v":{"$error":"#REF!"}},{"$f":"T36-HLOOKUP(X36,#REF!,9,FALSE)","v":{"$error":"#REF!"}},null,null,null,null,null,null,null,{"$error":"#REF!"}]
["H","CO","PDL",32,351830,"BEZIAS","guylian",2002,25.8,"ALSavenay","F",-7,7,8,15,8,9,10,19,34,119.83748971669419,8.1999999999999993,null,{"$f":"IF(A37=\"F\",(IF(OR(H37>2001,H37<2004),VLOOKUP(I37,Feuil1!$G$11:$H$25,2))),IF(A37=\"H\",(IF(OR(H37>2001,H37<2004),VLOOKUP(I37,Feuil1!$A$11:$F$29,2)))))","v":"M40"},null,{"$f":"T37-HLOOKUP(X37,#REF!,2,FALSE)","v":{"$error":"#REF!"}},{"$f":"T37-HLOOKUP(X37,#REF!,3,FALSE)","v":{"$error":"#REF!"}},{"$f":"T37-HLOOKUP(X37,#REF!,4,FALSE)","v":{"$error":"#REF!"}},{"$f":"T37-HLOOKUP(X37,#REF!,5,FALSE)","v":{"$error":"#REF!"}},{"$f":"T37-HLOOKUP(X37,#REF!,6,FALSE)","v":{"$error":"#REF!"}},{"$f":"T37-HLOOKUP(X37,#REF!,7,FALSE)","v":{"$error":"#REF!"}},{"$f":"T37-HLOOKUP(X37,#REF!,8,FALSE)","v":{"$error":"#REF!"}},{"$f":"T37-HLOOKUP(X37,#REF!,9,FALSE)","v":{"$error":"#REF!"}},null,null,null,null,null,null,null,{"$error":"#REF!"}]
["H","CO","CEN",33,375840,"FOUCHER","Paul",2002,33.6,"CHM CHATEAUROUX","F",7,8,9,17,7,8,9,17,34,86.654326989874193,0.39999999999999858,null,{"$f":"IF(A38=\"F\",(IF(OR(H38>2001,H38<2004),VLOOKUP(I38,Feuil1!$G$11:$H$25,2))),IF(A38=\"H\",(IF(OR(H38>2001,H38<2004),VLOOKUP(I38,Feuil1!$A$11:$F$29,2)))))","v":"M40"},null,{"$f":"T38-HLOOKUP(X38,#REF!,2,FALSE)","v":{"$error":"#REF!"}},{"$f":"T38-HLOOKUP(X38,#REF!,3,FALSE)","v":{"$error":"#REF!"}},{"$f":"T38-HLOOKUP(X38,#REF!,4,FALSE)","v":{"$error":"#REF!"}},{"$f":"T38-HLOOKUP(X38,#REF!,5,FALSE)","v":{"$error":"#REF!"}},{"$f":"T38-HLOOKUP(X38,#REF!,6,FALSE)","v":{"$error":"#REF!"}},{"$f":"T38-HLOOKUP(X38,#REF!,7,FALSE)","v":{"$error":"#REF!"}},{"$f":"T38-HLOOKUP(X38,#REF!,8,FALSE)","v":{"$error":"#REF!"}},{"$f":"T38-HLOOKUP(X38,#REF!,9,FALSE)","v":{"$error":"#REF!"}},null,null,null,null,null,null,null,{"$error":"#REF!"}]
[null,null,null,null,null,null,null,null,null,null,null,null,null,null,null,null,null,null,null,null,null,null,null,null,null,{"$f":"T39-HLOOKUP(X39,#REF!,2,FALSE)","v":{"$error":"#REF!"}},{"$f":"T39-HLOOKUP(X39,#REF!,3,FALSE)","v":{"$error":"#REF!"}},{"$f":"T39-HLOOKUP(X39,#REF!,4,FALSE)","v":{"$error":"#REF!"}},{"$f":"T39-HLOOKUP(X39,#REF!,5,FALSE)","v":{"$error":"#REF!"}},{"$f":"T39-HLOOKUP(X39,#REF!,6,FALSE)","v":{"$error":"#REF!"}},{"$f":"T39-HLOOKUP(X39,#REF!,7,FALSE)","v":{"$error":"#REF!"}},{"$f":"T39-HLOOKUP(X39,#REF!,8,FALSE)","v":{"$error":"#REF!"}},{"$f":"T39-HLOOKUP(X39,#REF!,9,FALSE)","v":{"$error":"#REF!"}},null,null,null,null,null,null,null,{"$f":"IF(AG39>=0,$AG$4,IF(AF39>=0,$AF$4,IF(AE39>=0,$AE$4,IF(AD39>=0,$AD$4,IF(AC39>=0,$AC$4,IF(AB39>=0,$AB$4,IF(AA39>=0,$AA$4,IF(Z39>=0,$Z$4,$AH$4))))))))","v":{"$error":"#REF!"}}]
["H","CO","PDL",1,355921,"COGNON","Théo",2002,40.4,"CJF LAVAL - VOUTRÉ","F",36,38,-40,{"$f":"IF(MAXA(L40+M40,M40+N40,L40+N40,L40,M40,N40)<=0,0,MAXA(L40+M40,M40+N40,L40+N40,L40,M40,N40))","v":74},46,48,50,{"$f":"IF(MAXA(P40+Q40,Q40+R40,P40+R40,P40,Q40,R40)<=0,0,MAXA(P40+Q40,Q40+R40,P40+R40,P40,Q40,R40))","v":98},{"$f":"IF(H40=\"\",\"\",IF(OR(O40=0,S40=0),0,O40+S40))","v":172},{"$f":"IF(I40=\"\",\"\",IF(A40=\"H\",10^(0.794358141*LOG(I40/174.393)^2)*T40,IF(A40=\"F\",10^(0.89726074 * LOG(I40/148.026)^2)*T40,\"\")))","v":359.73485085040926},{"$f":"SUM(T40-I40)","v":131.6},null,{"$f":"IF(A40=\"F\",(IF(OR(H40>2001,H40<2004),VLOOKUP(I40,Feuil1!$G$11:$H$25,2))),IF(A40=\"H\",(IF(OR(H40>2001,H40<2004),VLOOKUP(I40,Feuil1!$A$11:$F$29,2)))))","v":"M45"},null,{"$f":"T40-HLOOKUP(X40,#REF!,2,FALSE)","v":{"$error":"#REF!"}},{"$f":"T40-HLOOKUP(X40,#REF!,3,FALSE)","v":{"$error":"#REF!"}},{"$f":"T40-HLOOKUP(X40,#REF!,4,FALSE)","v":{"$error":"#REF!"}},{"$f":"T40-HLOOKUP(X40,#REF!,5,FALSE)","v":{"$error":"#REF!"}},{"$f":"T40-HLOOKUP(X40,#REF!,6,FALSE)","v":{"$error":"#REF!"}},{"$f":"T40-HLOOKUP(X40,#REF!,7,FALSE)","v":{"$error":"#REF!"}},{"$f":"T40-HLOOKUP(X40,#REF!,8,FALSE)","v":{"$error":"#REF!"}},{"$f":"T40-HLOOKUP(X40,#REF!,9,FALSE)","v":{"$error":"#REF!"}},null,null,null,null,null,null,null,{"$f":"IF(AG40>=0,$AG$4,IF(AF40>=0,$AF$4,IF(AE40>=0,$AE$4,IF(AD40>=0,$AD$4,IF(AC40>=0,$AC$4,IF(AB40>=0,$AB$4,IF(AA40>=0,$AA$4,IF(Z40>=0,$Z$4,$AH$4))))))))","v":{"$error":"#REF!"}}]
["H","SE","PRO",2,344414,"MARTIN","Gabriel",2002,42.6,"EEAR MONTEUX","F",28,30,32,62,38,40,42,82,144,285.75952753693315,101.4,null,{"$f":"IF(A41=\"F\",(IF(OR(H41>2001,H41<2004),VLOOKUP(I41,Feuil1!$G$11:$H$25,2))),IF(A41=\"H\",(IF(OR(H41>2001,H41<2004),VLOOKUP(I41,Feuil1!$A$11:$F$29,2)))))","v":"M45"},null,{"$f":"T41-HLOOKUP(X41,#REF!,2,FALSE)","v":{"$error":"#REF!"}},{"$f":"T41-HLOOKUP(X41,#REF!,3,FALSE)","v":{"$error":"#REF!"}},{"$f":"T41-HLOOKUP(X41,#REF!,4,FALSE)","v":{"$error":"#REF!"}},{"$f":"T41-HLOOKUP(X41,#REF!,5,FALSE)","v":{"$error":"#REF!"}},{"$f":"T41-HLOOKUP(X41,#REF!,6,FALSE)","v":{"$error":"#REF!"}},{"$f":"T41-HLOOKUP(X41,#REF!,7,FALSE)","v":{"$error":"#REF!"}},{"$f":"T41-HLOOKUP(X41,#REF!,8,FALSE)","v":{"$error":"#REF!"}},{"$f":"T41-HLOOKUP(X41,#REF!,9,FALSE)","v":{"$error":"#REF!"}},null,null,null,null,null,null,null,{"$error":"#REF!"}]
["H","NORD","NPC",3,344407,"GALLOO","Martin",2002,44.7,"CHCD COMINES","F",23,25,27,52,32,34,36,70,122,231.21823026992979,77.3,null,{"$f":"IF(A42=\"F\",(IF(OR(H42>2001,H42<2004),VLOOKUP(I42,Feuil1!$G$11:$H$25,2))),IF(A42=\"H\",(IF(OR(H42>2001,H42<2004),VLOOKUP(I42,Feuil1!$A$11:$F$29,2)))))","v":"M45"},null,{"$f":"T42-HLOOKUP(X42,#REF!,2,FALSE)","v":{"$error":"#REF!"}},{"$f":"T42-HLOOKUP(X42,#REF!,3,FALSE)","v":{"$error":"#REF!"}},{"$f":"T42-HLOOKUP(X42,#REF!,4,FALSE)","v":{"$error":"#REF!"}},{"$f":"T42-HLOOKUP(X42,#REF!,5,FALSE)","v":{"$error":"#REF!"}},{"$f":"T42-HLOOKUP(X42,#REF!,6,FALSE)","v":{"$error":"#REF!"}},{"$f":"T42-HLOOKUP(X42,#REF!,7,FALSE)","v":{"$error":"#REF!"}},{"$f":"T42-HLOOKUP(X42,#REF!,8,FALSE)","v":{"$error":"#REF!"}},{"$f":"T42-HLOOKUP(X42,#REF!,9,FALSE)","v":{"$error":"#REF!"}},null,null,null,null,null,null,null,{"$error":"#REF!"}]
["H","SE","LAN",4,367403,"TARUSSIO","Laurent",2003,44,"Narbonne Haltéro","F",18,20,22,42,25,27,29,56,98,188.52297587946788,54,null,{"$f":"IF(A43=\"F\",(IF(OR(H43>2001,H43<2004),VLOOKUP(I43,Feuil1!$G$11:$H$25,2))),IF(A43=\"H\",(IF(OR(H43>2001,H43<2004),VLOOKUP(I43,Feuil1!$A$11:$F$29,2)))))","v":"M45"},null,{"$f":"T43-HLOOKUP(X43,#REF!,2,FALSE)","v":{"$error":"#REF!"}},{"$f":"T43-HLOOKUP(X43,#REF!,3,FALSE)","v":{"$error":"#REF!"}},{"$f":"T43-HLOOKUP(X43,#REF!,4,FALSE)","v":{"$error":"#REF!"}},{"$f":"T43-HLOOKUP(X43,#REF!,5,FALSE)","v":{"$error":"#REF!"}},{"$f":"T43-HLOOKUP(X43,#REF!,6,FALSE)","v":{"$error":"#REF!"}},{"$f":"T43-HLOOKUP(X43,#REF!,7,FALSE)","v":{"$error":"#REF!"}},{"$f":"T43-HLOOKUP(X43,#REF!,8,FALSE)","v":{"$error":"#REF!"}},{"$f":"T43-HLOOKUP(X43,#REF!,9,FALSE)","v":{"$error":"#REF!"}},null,null,null,null,null,null,null,{"$error":"#REF!"}]
["H","NORD","NPC",5,383860,"BOULANGER","Geoffrey",2002,43.4,"A.O.SALLAUMINES","F",19,21,23,44,22,24,26,50,94,183.21462772827383,50.6,null,{"$f":"IF(A44=\"F\",(IF(OR(H44>2001,H44<2004),VLOOKUP(I44,Feuil1!$G$11:$H$25,2))),IF(A44=\"H\",(IF(OR(H44>2001,H44<2004),VLOOKUP(I44,Feuil1!$A$11:$F$29,2)))))","v":"M45"},null,{"$f":"T44-HLOOKUP(X44,#REF!,2,FALSE)","v":{"$error":"#REF!"}},{"$f":"T44-HLOOKUP(X44,#REF!,3,FALSE)","v":{"$error":"#REF!"}},{"$f":"T44-HLOOKUP(X44,#REF!,4,FALSE)","v":{"$error":"#REF!"}},{"$f":"T44-HLOOKUP(X44,#REF!,5,FALSE)","v":{"$error":"#REF!"}},{"$f":"T44-HLOOKUP(X44,#REF!,6,FALSE)","v":{"$error":"#REF!"}},{"$f":"T44-HLOOKUP(X44,#REF!,7,FALSE)","v":{"$error":"#REF!"}},{"$f":"T44-HLOOKUP(X44,#REF!,8,FALSE)","v":{"$error":"#REF!"}},{"$f":"T44-HLOOKUP(X44,#REF!,9,FALSE)","v":{"$error":"#REF!"}},null,null,null,null,null,null,null,{"$error":"#REF!"}]
["H","NORD","NPC",6,352093,"CABRE","Martin",2003,45,"ALSH BULLY LES MINES","F",18,20,-22,38,25,27,29,56,94,177.03869115489243,49,null,{"$f":"IF(A45=\"F\",(IF(OR(H45>2001,H45<2004),VLOOKUP(I45,Feuil1!$G$11:$H$25,2))),IF(A45=\"H\",(IF(OR(H45>2001,H45<2004),VLOOKUP(I45,Feuil1!$A$11:$F$29,2)))))","v":"M45"},null,{"$f":"T45-HLOOKUP(X45,#REF!,2,FALSE)","v":{"$error":"#REF!"}},{"$f":"T45-HLOOKUP(X45,#REF!,3,FALSE)","v":{"$error":"#REF!"}},{"$f":"T45-HLOOKUP(X45,#REF!,4,FALSE)","v":{"$error":"#REF!"}},{"$f":"T45-HLOOKUP(X45,#REF!,5,FALSE)","v":{"$error":"#REF!"}},{"$f":"T45-HLOOKUP(X45,#REF!,6,FALSE)","v":{"$error":"#REF!"}},{"$f":"T45-HLOOKUP(X45,#REF!,7,FALSE)","v":{"$error":"#REF!"}},{"$f":"T45-HLOOKUP(X45,#REF!,8,FALSE)","v":{"$error":"#REF!"}},{"$f":"T45-HLOOKUP(X45,#REF!,9,FALSE)","v":{"$error":"#REF!"}},null,null,null,null,null,null,null,{"$error":"#REF!"}]
["H","NE","ALS",7,375712,"VOLTZ","ANTOINE",2003,40.299999999999997,"SHC Haguenau","F",18,-20,20,38,22,24,26,50,88,184.51162770147769,47.7,null,{"$f":"IF(A46=\"F\",(IF(OR(H46>2001,H46<2004),VLOOKUP(I46,Feuil1!$G$11:$H$25,2))),IF(A46=\"H\",(IF(OR(H46>2001,H46<2004),VLOOKUP(I46,Feuil1!$A$11:$F$29,2)))))","v":"M45"},null,{"$f":"T46-HLOOKUP(X46,#REF!,2,FALSE)","v":{"$error":"#REF!"}},{"$f":"T46-HLOOKUP(X46,#REF!,3,FALSE)","v":{"$error":"#REF!"}},{"$f":"T46-HLOOKUP(X46,#REF!,4,FALSE)","v":{"$error":"#REF!"}},{"$f":"T46-HLOOKUP(X46,#REF!,5,FALSE)","v":{"$error":"#REF!"}},{"$f":"T46-HLOOKUP(X46,#REF!,6,FALSE)","v":{"$error":"#REF!"}},{"$f":"T46-HLOOKUP(X46,#REF!,7,FALSE)","v":{"$error":"#REF!"}},{"$f":"T46-HLOOKUP(X46,#REF!,8,FALSE)","v":{"$error":"#REF!"}},{"$f":"T46-HLOOKUP(X46,#REF!,9,FALSE)","v":{"$error":"#REF!"}},null,null,null,null,null,null,null,{"$error":"#REF!"}]
["H","NE","ALS",8,353650,"RIEHL","MATEO",2002,43.4,"Dorlisheim FH","F",17,19,21,40,20,22,24,46,86,167.62189345352712,42.6,null,{"$f":"IF(A47=\"F\",(IF(OR(H47>2001,H47<2004),VLOOKUP(I47,Feuil1!$G$11:$H$25,2))),IF(A47=\"H\",(IF(OR(H47>2001,H47<2004),VLOOKUP(I47,Feuil1!$A$11:$F$29,2)))))","v":"M45"},null,{"$f":"T47-HLOOKUP(X47,#REF!,2,FALSE)","v":{"$error":"#REF!"}},{"$f":"T47-HLOOKUP(X47,#REF!,3,FALSE)","v":{"$error":"#REF!"}},{"$f":"T47-HLOOKUP(X47,#REF!,4,FALSE)","v":{"$error":"#REF!"}},{"$f":"T47-HLOOKUP(X47,#REF!,5,FALSE)","v":{"$error":"#REF!"}},{"$f":"T47-HLOOKUP(X47,#REF!,6,FALSE)","v":{"$error":"#REF!"}},{"$f":"T47-HLOOKUP(X47,#REF!,7,FALSE)","v":{"$error":"#REF!"}},{"$f":"T47-HLOOKUP(X47,#REF!,8,FALSE)","v":{"$error":"#REF!"}},{"$f":"T47-HLOOKUP(X47,#REF!,9,FALSE)","v":{"$error":"#REF!"}},null,null,null,null,null,null,null,{"$error":"#REF!"}]
["H","NE","BOU",9,358738,"MILUD","Malik",2003,41.9,"HC Avallon","F",17,19,20,39,22,24,-26,46,85,171.43356850484545,43.1,null,{"$f":"IF(A48=\"F\",(IF(OR(H48>2001,H48<2004),VLOOKUP(I48,Feuil1!$G$11:$H$25,2))),IF(A48=\"H\",(IF(OR(H48>2001,H48<2004),VLOOKUP(I48,Feuil1!$A$11:$F$29,2)))))","v":"M45"},null,{"$f":"T48-HLOOKUP(X48,#REF!,2,FALSE)","v":{"$error":"#REF!"}},{"$f":"T48-HLOOKUP(X48,#REF!,3,FALSE)","v":{"$error":"#REF!"}},{"$f":"T48-HLOOKUP(X48,#REF!,4,FALSE)","v":{"$error":"#REF!"}},{"$f":"T48-HLOOKUP(X48,#REF!,5,FALSE)","v":{"$error":"#REF!"}},{"$f":"T48-HLOOKUP(X48,#REF!,6,FALSE)","v":{"$error":"#REF!"}},{"$f":"T48-HLOOKUP(X48,#REF!,7,FALSE)","v":{"$error":"#REF!"}},{"$f":"T48-HLOOKUP(X48,#REF!,8,FALSE)","v":{"$error":"#REF!"}},{"$f":"T48-HLOOKUP(X48,#REF!,9,FALSE)","v":{"$error":"#REF!"}},null,null,null,null,null,null,null,{"$error":"#REF!"}]
["H","NORD","PIC",10,386580,"CREQUIS","Sullivan",2003,43.4,"Hirson CEHT","F",14,16,18,34,22,24,26,50,84,163.72370988484045,40.6,null,{"$f":"IF(A49=\"F\",(IF(OR(H49>2001,H49<2004),VLOOKUP(I49,Feuil1!$G$11:$H$25,2))),IF(A49=\"H\",(IF(OR(H49>2001,H49<2004),VLOOKUP(I49,Feuil1!$A$11:$F$29,2)))))","v":"M45"},null,{"$f":"T49-HLOOKUP(X49,#REF!,2,FALSE)","v":{"$error":"#REF!"}},{"$f":"T49-HLOOKUP(X49,#REF!,3,FALSE)","v":{"$error":"#REF!"}},{"$f":"T49-HLOOKUP(X49,#REF!,4,FALSE)","v":{"$error":"#REF!"}},{"$f":"T49-HLOOKUP(X49,#REF!,5,FALSE)","v":{"$error":"#REF!"}},{"$f":"T49-HLOOKUP(X49,#REF!,6,FALSE)","v":{"$error":"#REF!"}},{"$f":"T49-HLOOKUP(X49,#REF!,7,FALSE)","v":{"$error":"#REF!"}},{"$f":"T49-HLOOKUP(X49,#REF!,8,FALSE)","v":{"$error":"#REF!"}},{"$f":"T49-HLOOKUP(X49,#REF!,9,FALSE)","v":{"$error":"#REF!"}},null,null,null,null,null,null,null,{"$error":"#REF!"}]
["H","NE","ALS",11,383774,"VERGNAUD","JAROD",2003,44.6,"SHC Haguenau","F",14,16,-17,30,20,22,23,45,75,142.44193491569689,30.4,null,{"$f":"IF(A50=\"F\",(IF(OR(H50>2001,H50<2004),VLOOKUP(I50,Feuil1!$G$11:$H$25,2))),IF(A50=\"H\",(IF(OR(H50>2001,H50<2004),VLOOKUP(I50,Feuil1!$A$11:$F$29,2)))))","v":"M45"},null,{"$f":"T50-HLOOKUP(X50,#REF!,2,FALSE)","v":{"$error":"#REF!"}},{"$f":"T50-HLOOKUP(X50,#REF!,3,FALSE)","v":{"$error":"#REF!"}},{"$f":"T50-HLOOKUP(X50,#REF!,4,FALSE)","v":{"$error":"#REF!"}},{"$f":"T50-HLOOKUP(X50,#REF!,5,FALSE)","v":{"$error":"#REF!"}},{"$f":"T50-HLOOKUP(X50,#REF!,6,FALSE)","v":{"$error":"#REF!"}},{"$f":"T50-HLOOKUP(X50,#REF!,7,FALSE)","v":{"$error":"#REF!"}},{"$f":"T50-HLOOKUP(X50,#REF!,8,FALSE)","v":{"$error":"#REF!"}},{"$f":"T50-HLOOKUP(X50,#REF!,9,FALSE)","v":{"$error":"#REF!"}},null,null,null,null,null,null,null,{"$error":"#REF!"}]
["H","NORD","PIC",12,376821,"LEGER LESOT","Dylan",2002,42.2,"La Vaillante Saint Quentin","F",13,15,16,31,18,20,22,42,73,146.20385816703154,30.799999999999997,null,{"$f":"IF(A51=\"F\",(IF(OR(H51>2001,H51<2004),VLOOKUP(I51,Feuil1!$G$11:$H$25,2))),IF(A51=\"H\",(IF(OR(H51>2001,H51<2004),VLOOKUP(I51,Feuil1!$A$11:$F$29,2)))))","v":"M45"},null,{"$f":"T51-HLOOKUP(X51,#REF!,2,FALSE)","v":{"$error":"#REF!"}},{"$f":"T51-HLOOKUP(X51,#REF!,3,FALSE)","v":{"$error":"#REF!"}},{"$f":"T51-HLOOKUP(X51,#REF!,4,FALSE)","v":{"$error":"#REF!"}},{"$f":"T51-HLOOKUP(X51,#REF!,5,FALSE)","v":{"$error":"#REF!"}},{"$f":"T51-HLOOKUP(X51,#REF!,6,FALSE)","v":{"$error":"#REF!"}},{"$f":"T51-HLOOKUP(X51,#REF!,7,FALSE)","v":{"$error":"#REF!"}},{"$f":"T51-HLOOKUP(X51,#REF!,8,FALSE)","v":{"$error":"#REF!"}},{"$f":"T51-HLOOKUP(X51,#REF!,9,FALSE)","v":{"$error":"#REF!"}},null,null,null,null,null,null,null,{"$error":"#REF!"}]
["H","SEST","RAL",13,372601,"VARDANIAN","Avetis",2003,42.2,"Vaulx en Velin","Arm",15,-16,16,31,18,20,22,42,73,146.20385816703154,30.799999999999997,null,{"$f":"IF(A52=\"F\",(IF(OR(H52>2001,H52<2004),VLOOKUP(I52,Feuil1!$G$11:$H$25,2))),IF(A52=\"H\",(IF(OR(H52>2001,H52<2004),VLOOKUP(I52,Feuil1!$A$11:$F$29,2)))))","v":"M45"},null,{"$f":"T52-HLOOKUP(X52,#REF!,2,FALSE)","v":{"$error":"#REF!"}},{"$f":"T52-HLOOKUP(X52,#REF!,3,FALSE)","v":{"$error":"#REF!"}},{"$f":"T52-HLOOKUP(X52,#REF!,4,FALSE)","v":{"$error":"#REF!"}},{"$f":"T52-HLOOKUP(X52,#REF!,5,FALSE)","v":{"$error":"#REF!"}},{"$f":"T52-HLOOKUP(X52,#REF!,6,FALSE)","v":{"$error":"#REF!"}},{"$f":"T52-HLOOKUP(X52,#REF!,7,FALSE)","v":{"$error":"#REF!"}},{"$f":"T52-HLOOKUP(X52,#REF!,8,FALSE)","v":{"$error":"#REF!"}},{"$f":"T52-HLOOKUP(X52,#REF!,9,FALSE)","v":{"$error":"#REF!"}},null,null,null,null,null,null,null,{"$error":"#REF!"}]
["H","NE","ALS",14,375935,"CIZEK","ERWAN",2002,43,"SHC Haguenau","F",15,-17,17,32,16,18,19,37,69,135.69168352303336,26,null,{"$f":"IF(A53=\"F\",(IF(OR(H53>2001,H53<2004),VLOOKUP(I53,Feuil1!$G$11:$H$25,2))),IF(A53=\"H\",(IF(OR(H53>2001,H53<2004),VLOOKUP(I53,Feuil1!$A$11:$F$29,2)))))","v":"M45"},null,{"$f":"T53-HLOOKUP(X53,#REF!,2,FALSE)","v":{"$error":"#REF!"}},{"$f":"T53-HLOOKUP(X53,#REF!,3,FALSE)","v":{"$error":"#REF!"}},{"$f":"T53-HLOOKUP(X53,#REF!,4,FALSE)","v":{"$error":"#REF!"}},{"$f":"T53-HLOOKUP(X53,#REF!,5,FALSE)","v":{"$error":"#REF!"}},{"$f":"T53-HLOOKUP(X53,#REF!,6,FALSE)","v":{"$error":"#REF!"}},{"$f":"T53-HLOOKUP(X53,#REF!,7,FALSE)","v":{"$error":"#REF!"}},{"$f":"T53-HLOOKUP(X53,#REF!,8,FALSE)","v":{"$error":"#REF!"}},{"$f":"T53-HLOOKUP(X53,#REF!,9,FALSE)","v":{"$error":"#REF!"}},null,null,null,null,null,null,null,{"$error":"#REF!"}]
["H","CO","PDL",15,388362,"CORROY","Tahiri",2003,43.1,"CJF LAVAL - VOUTRÉ","F",12,-14,-14,12,12,14,15,29,41,80.447815234175451,-2.1000000000000014,null,{"$f":"IF(A54=\"F\",(IF(OR(H54>2001,H54<2004),VLOOKUP(I54,Feuil1!$G$11:$H$25,2))),IF(A54=\"H\",(IF(OR(H54>2001,H54<2004),VLOOKUP(I54,Feuil1!$A$11:$F$29,2)))))","v":"M45"},null,{"$f":"T54-HLOOKUP(X54,#REF!,2,FALSE)","v":{"$error":"#REF!"}},{"$f":"T54-HLOOKUP(X54,#REF!,3,FALSE)","v":{"$error":"#REF!"}},{"$f":"T54-HLOOKUP(X54,#REF!,4,FALSE)","v":{"$error":"#REF!"}},{"$f":"T54-HLOOKUP(X54,#REF!,5,FALSE)","v":{"$error":"#REF!"}},{"$f":"T54-HLOOKUP(X54,#REF!,6,FALSE)","v":{"$error":"#REF!"}},{"$f":"T54-HLOOKUP(X54,#REF!,7,FALSE)","v":{"$error":"#REF!"}},{"$f":"T54-HLOOKUP(X54,#REF!,8,FALSE)","v":{"$error":"#REF!"}},{"$f":"T54-HLOOKUP(X54,#REF!,9,FALSE)","v":{"$error":"#REF!"}},null,null,null,null,null,null,null,{"$error":"#REF!"}]
[null,null,null,null,null,null,null,null,null,null,null,null,null,null,null,null,null,null,null,null,null,null,null,null,null,{"$f":"T55-HLOOKUP(X55,#REF!,2,FALSE)","v":{"$error":"#REF!"}},{"$f":"T55-HLOOKUP(X55,#REF!,3,FALSE)","v":{"$error":"#REF!"}},{"$f":"T55-HLOOKUP(X55,#REF!,4,FALSE)","v":{"$error":"#REF!"}},{"$f":"T55-HLOOKUP(X55,#REF!,5,FALSE)","v":{"$error":"#REF!"}},{"$f":"T55-HLOOKUP(X55,#REF!,6,FALSE)","v":{"$error":"#REF!"}},{"$f":"T55-HLOOKUP(X55,#REF!,7,FALSE)","v":{"$error":"#REF!"}},{"$f":"T55-HLOOKUP(X55,#REF!,8,FALSE)","v":{"$error":"#REF!"}},{"$f":"T55-HLOOKUP(X55,#REF!,9,FALSE)","v":{"$error":"#REF!"}},null,null,null,null,null,null,null,{"$f":"IF(AG55>=0,$AG$4,IF(AF55>=0,$AF$4,IF(AE55>=0,$AE$4,IF(AD55>=0,$AD$4,IF(AC55>=0,$AC$4,IF(AB55>=0,$AB$4,IF(AA55>=0,$AA$4,IF(Z55>=0,$Z$4,$AH$4))))))))","v":{"$error":"#REF!"}}]
["H","NE","ALS",1,324091,"SPAGNULO","GIACONO",2002,49.9,"SHC Haguenau","F",41,43,45,{"$f":"IF(MAXA(L56+M56,M56+N56,L56+N56,L56,M56,N56)<=0,0,MAXA(L56+M56,M56+N56,L56+N56,L56,M56,N56))","v":88},52,54,56,{"$f":"IF(MAXA(P56+Q56,Q56+R56,P56+R56,P56,Q56,R56)<=0,0,MAXA(P56+Q56,Q56+R56,P56+R56,P56,Q56,R56))","v":110},{"$f":"IF(H56=\"\",\"\",IF(OR(O56=0,S56=0),0,O56+S56))","v":198},{"$f":"IF(I56=\"\",\"\",IF(A56=\"H\",10^(0.794358141*LOG(I56/174.393)^2)*T56,IF(A56=\"F\",10^(0.89726074 * LOG(I56/148.026)^2)*T56,\"\")))","v":339.82137877802131},{"$f":"SUM(T56-I56)","v":148.1},null,{"$f":"IF(A56=\"F\",(IF(OR(H56>2001,H56<2004),VLOOKUP(I56,Feuil1!$G$11:$H$25,2))),IF(A56=\"H\",(IF(OR(H56>2001,H56<2004),VLOOKUP(I56,Feuil1!$A$11:$F$29,2)))))","v":"M50"},null,{"$f":"T56-HLOOKUP(X56,#REF!,2,FALSE)","v":{"$error":"#REF!"}},{"$f":"T56-HLOOKUP(X56,#REF!,3,FALSE)","v":{"$error":"#REF!"}},{"$f":"T56-HLOOKUP(X56,#REF!,4,FALSE)","v":{"$error":"#REF!"}},{"$f":"T56-HLOOKUP(X56,#REF!,5,FALSE)","v":{"$error":"#REF!"}},{"$f":"T56-HLOOKUP(X56,#REF!,6,FALSE)","v":{"$error":"#REF!"}},{"$f":"T56-HLOOKUP(X56,#REF!,7,FALSE)","v":{"$error":"#REF!"}},{"$f":"T56-HLOOKUP(X56,#REF!,8,FALSE)","v":{"$error":"#REF!"}},{"$f":"T56-HLOOKUP(X56,#REF!,9,FALSE)","v":{"$error":"#REF!"}},null,null,null,null,null,null,null,{"$f":"IF(AG56>=0,$AG$4,IF(AF56>=0,$AF$4,IF(AE56>=0,$AE$4,IF(AD56>=0,$AD$4,IF(AC56>=0,$AC$4,IF(AB56>=0,$AB$4,IF(AA56>=0,$AA$4,IF(Z56>=0,$Z$4,$AH$4))))))))","v":{"$error":"#REF!"}}]
["H","NORD","NPC",2,359647,"PARANTHOEN","Jason",2002,49,"C.A.ROSENDAEL","F",30,32,34,66,40,42,44,86,152,265.03490674454946,103,null,{"$f":"IF(A57=\"F\",(IF(OR(H57>2001,H57<2004),VLOOKUP(I57,Feuil1!$G$11:$H$25,2))),IF(A57=\"H\",(IF(OR(H57>2001,H57<2004),VLOOKUP(I57,Feuil1!$A$11:$F$29,2)))))","v":"M50"},null,{"$f":"T57-HLOOKUP(X57,#REF!,2,FALSE)","v":{"$error":"#REF!"}},{"$f":"T57-HLOOKUP(X57,#REF!,3,FALSE)","v":{"$error":"#REF!"}},{"$f":"T57-HLOOKUP(X57,#REF!,4,FALSE)","v":{"$error":"#REF!"}},{"$f":"T57-HLOOKUP(X57,#REF!,5,FALSE)","v":{"$error":"#REF!"}},{"$f":"T57-HLOOKUP(X57,#REF!,6,FALSE)","v":{"$error":"#REF!"}},{"$f":"T57-HLOOKUP(X57,#REF!,7,FALSE)","v":{"$error":"#REF!"}},{"$f":"T57-HLOOKUP(X57,#REF!,8,FALSE)","v":{"$error":"#REF!"}},{"$f":"T57-HLOOKUP(X57,#REF!,9,FALSE)","v":{"$error":"#REF!"}},null,null,null,null,null,null,null,{"$error":"#REF!"}]
["H","N","IDF",3,334661,"RASCLE","LENNY",2002,45.5,"VGA SAINT-MAUR ","F",25,27,29,56,37,39,41,80,136,253.51997065766662,90.5,null,{"$f":"IF(A58=\"F\",(IF(OR(H58>2001,H58<2004),VLOOKUP(I58,Feuil1!$G$11:$H$25,2))),IF(A58=\"H\",(IF(OR(H58>2001,H58<2004),VLOOKUP(I58,Feuil1!$A$11:$F$29,2)))))","v":"M50"},null,{"$f":"T58-HLOOKUP(X58,#REF!,2,FALSE)","v":{"$error":"#REF!"}},{"$f":"T58-HLOOKUP(X58,#REF!,3,FALSE)","v":{"$error":"#REF!"}},{"$f":"T58-HLOOKUP(X58,#REF!,4,FALSE)","v":{"$error":"#REF!"}},{"$f":"T58-HLOOKUP(X58,#REF!,5,FALSE)","v":{"$error":"#REF!"}},{"$f":"T58-HLOOKUP(X58,#REF!,6,FALSE)","v":{"$error":"#REF!"}},{"$f":"T58-HLOOKUP(X58,#REF!,7,FALSE)","v":{"$error":"#REF!"}},{"$f":"T58-HLOOKUP(X58,#REF!,8,FALSE)","v":{"$error":"#REF!"}},{"$f":"T58-HLOOKUP(X58,#REF!,9,FALSE)","v":{"$error":"#REF!"}},null,null,null,null,null,null,null,{"$error":"#REF!"}]
["H","SO","MPY",4,326262,"HAVET","Bastien",2002,49,"FIGEAC HC","F",31,33,35,68,31,33,35,68,136,237.13649550828112,87,null,{"$f":"IF(A59=\"F\",(IF(OR(H59>2001,H59<2004),VLOOKUP(I59,Feuil1!$G$11:$H$25,2))),IF(A59=\"H\",(IF(OR(H59>2001,H59<2004),VLOOKUP(I59,Feuil1!$A$11:$F$29,2)))))","v":"M50"},null,{"$f":"T59-HLOOKUP(X59,#REF!,2,FALSE)","v":{"$error":"#REF!"}},{"$f":"T59-HLOOKUP(X59,#REF!,3,FALSE)","v":{"$error":"#REF!"}},{"$f":"T59-HLOOKUP(X59,#REF!,4,FALSE)","v":{"$error":"#REF!"}},{"$f":"T59-HLOOKUP(X59,#REF!,5,FALSE)","v":{"$error":"#REF!"}},{"$f":"T59-HLOOKUP(X59,#REF!,6,FALSE)","v":{"$error":"#REF!"}},{"$f":"T59-HLOOKUP(X59,#REF!,7,FALSE)","v":{"$error":"#REF!"}},{"$f":"T59-HLOOKUP(X59,#REF!,8,FALSE)","v":{"$error":"#REF!"}},{"$f":"T59-HLOOKUP(X59,#REF!,9,FALSE)","v":{"$error":"#REF!"}},null,null,null,null,null,null,null,{"$error":"#REF!"}]
["H","SE","LAN",5,306124,"MARTINEZ","Léo",2003,49.6,"Clermont Sports","F",26,28,29,57,36,38,39,77,134,231.18346261805283,84.4,null,{"$f":"IF(A60=\"F\",(IF(OR(H60>2001,H60<2004),VLOOKUP(I60,Feuil1!$G$11:$H$25,2))),IF(A60=\"H\",(IF(OR(H60>2001,H60<2004),VLOOKUP(I60,Feuil1!$A$11:$F$29,2)))))","v":"M50"},null,{"$f":"T60-HLOOKUP(X60,#REF!,2,FALSE)","v":{"$error":"#REF!"}},{"$f":"T60-HLOOKUP(X60,#REF!,3,FALSE)","v":{"$error":"#REF!"}},{"$f":"T60-HLOOKUP(X60,#REF!,4,FALSE)","v":{"$error":"#REF!"}},{"$f":"T60-HLOOKUP(X60,#REF!,5,FALSE)","v":{"$error":"#REF!"}},{"$f":"T60-HLOOKUP(X60,#REF!,6,FALSE)","v":{"$error":"#REF!"}},{"$f":"T60-HLOOKUP(X60,#REF!,7,FALSE)","v":{"$error":"#REF!"}},{"$f":"T60-HLOOKUP(X60,#REF!,8,FALSE)","v":{"$error":"#REF!"}},{"$f":"T60-HLOOKUP(X60,#REF!,9,FALSE)","v":{"$error":"#REF!"}},null,null,null,null,null,null,null,{"$error":"#REF!"}]
["H","NORD","NPC",6,344407,"GALLOO","Martin",2002,45.4,"CHCD COMINES","F",23,25,27,52,34,36,38,74,126,235.35876098604211,80.599999999999994,null,{"$f":"IF(A61=\"F\",(IF(OR(H61>2001,H61<2004),VLOOKUP(I61,Feuil1!$G$11:$H$25,2))),IF(A61=\"H\",(IF(OR(H61>2001,H61<2004),VLOOKUP(I61,Feuil1!$A$11:$F$29,2)))))","v":"M50"},null,{"$f":"T61-HLOOKUP(X61,#REF!,2,FALSE)","v":{"$error":"#REF!"}},{"$f":"T61-HLOOKUP(X61,#REF!,3,FALSE)","v":{"$error":"#REF!"}},{"$f":"T61-HLOOKUP(X61,#REF!,4,FALSE)","v":{"$error":"#REF!"}},{"$f":"T61-HLOOKUP(X61,#REF!,5,FALSE)","v":{"$error":"#REF!"}},{"$f":"T61-HLOOKUP(X61,#REF!,6,FALSE)","v":{"$error":"#REF!"}},{"$f":"T61-HLOOKUP(X61,#REF!,7,FALSE)","v":{"$error":"#REF!"}},{"$f":"T61-HLOOKUP(X61,#REF!,8,FALSE)","v":{"$error":"#REF!"}},{"$f":"T61-HLOOKUP(X61,#REF!,9,FALSE)","v":{"$error":"#REF!"}},null,null,null,null,null,null,null,{"$error":"#REF!"}]
["H","SEST","RAL",7,378094,"DENIS","Thomas",2002,49.2,"CHAMBON FEUG","F",25,27,28,55,30,-32,32,62,117,203.28172109499883,67.8,null,{"$f":"IF(A62=\"F\",(IF(OR(H62>2001,H62<2004),VLOOKUP(I62,Feuil1!$G$11:$H$25,2))),IF(A62=\"H\",(IF(OR(H62>2001,H62<2004),VLOOKUP(I62,Feuil1!$A$11:$F$29,2)))))","v":"M50"},null,{"$f":"T62-HLOOKUP(X62,#REF!,2,FALSE)","v":{"$error":"#REF!"}},{"$f":"T62-HLOOKUP(X62,#REF!,3,FALSE)","v":{"$error":"#REF!"}},{"$f":"T62-HLOOKUP(X62,#REF!,4,FALSE)","v":{"$error":"#REF!"}},{"$f":"T62-HLOOKUP(X62,#REF!,5,FALSE)","v":{"$error":"#REF!"}},{"$f":"T62-HLOOKUP(X62,#REF!,6,FALSE)","v":{"$error":"#REF!"}},{"$f":"T62-HLOOKUP(X62,#REF!,7,FALSE)","v":{"$error":"#REF!"}},{"$f":"T62-HLOOKUP(X62,#REF!,8,FALSE)","v":{"$error":"#REF!"}},{"$f":"T62-HLOOKUP(X62,#REF!,9,FALSE)","v":{"$error":"#REF!"}},null,null,null,null,null,null,null,{"$error":"#REF!"}]
["H","SO","AQU",8,377643,"JACQUET","YOANN",2002,45.2,"BORDEAUX ASPOM","F",21,23,25,48,30,32,34,66,114,213.81985833412253,68.8,null,{"$f":"IF(A63=\"F\",(IF(OR(H63>2001,H63<2004),VLOOKUP(I63,Feuil1!$G$11:$H$25,2))),IF(A63=\"H\",(IF(OR(H63>2001,H63<2004),VLOOKUP(I63,Feuil1!$A$11:$F$29,2)))))","v":"M50"},null,{"$f":"T63-HLOOKUP(X63,#REF!,2,FALSE)","v":{"$error":"#REF!"}},{"$f":"T63-HLOOKUP(X63,#REF!,3,FALSE)","v":{"$error":"#REF!"}},{"$f":"T63-HLOOKUP(X63,#REF!,4,FALSE)","v":{"$error":"#REF!"}},{"$f":"T63-HLOOKUP(X63,#REF!,5,FALSE)","v":{"$error":"#REF!"}},{"$f":"T63-HLOOKUP(X63,#REF!,6,FALSE)","v":{"$error":"#REF!"}},{"$f":"T63-HLOOKUP(X63,#REF!,7,FALSE)","v":{"$error":"#REF!"}},{"$f":"T63-HLOOKUP(X63,#REF!,8,FALSE)","v":{"$error":"#REF!"}},{"$f":"T63-HLOOKUP(X63,#REF!,9,FALSE)","v":{"$error":"#REF!"}},null,null,null,null,null,null,null,{"$error":"#REF!"}]
["H","SO","POI",9,375640,"MONGIN","Hugo",2002,46.8,"Poitiers","F",21,23,25,48,28,30,32,62,110,199.82184951749426,63.2,null,{"$f":"IF(A64=\"F\",(IF(OR(H64>2001,H64<2004),VLOOKUP(I64,Feuil1!$G$11:$H$25,2))),IF(A64=\"H\",(IF(OR(H64>2001,H64<2004),VLOOKUP(I64,Feuil1!$A$11:$F$29,2)))))","v":"M50"},null,{"$f":"T64-HLOOKUP(X64,#REF!,2,FALSE)","v":{"$error":"#REF!"}},{"$f":"T64-HLOOKUP(X64,#REF!,3,FALSE)","v":{"$error":"#REF!"}},{"$f":"T64-HLOOKUP(X64,#REF!,4,FALSE)","v":{"$error":"#REF!"}},{"$f":"T64-HLOOKUP(X64,#REF!,5,FALSE)","v":{"$error":"#REF!"}},{"$f":"T64-HLOOKUP(X64,#REF!,6,FALSE)","v":{"$error":"#REF!"}},{"$f":"T64-HLOOKUP(X64,#REF!,7,FALSE)","v":{"$error":"#REF!"}},{"$f":"T64-HLOOKUP(X64,#REF!,8,FALSE)","v":{"$error":"#REF!"}},{"$f":"T64-HLOOKUP(X64,#REF!,9,FALSE)","v":{"$error":"#REF!"}},null,null,null,null,null,null,null,{"$error":"#REF!"}]
["H","NORD","NPC",10,376898,"MANGELLE","Kenzo",2003,47.6,"ST POL/MER","F",20,22,24,46,28,30,32,62,108,193.21289274336988,60.4,null,{"$f":"IF(A65=\"F\",(IF(OR(H65>2001,H65<2004),VLOOKUP(I65,Feuil1!$G$11:$H$25,2))),IF(A65=\"H\",(IF(OR(H65>2001,H65<2004),VLOOKUP(I65,Feuil1!$A$11:$F$29,2)))))","v":"M50"},null,{"$f":"T65-HLOOKUP(X65,#REF!,2,FALSE)","v":{"$error":"#REF!"}},{"$f":"T65-HLOOKUP(X65,#REF!,3,FALSE)","v":{"$error":"#REF!"}},{"$f":"T65-HLOOKUP(X65,#REF!,4,FALSE)","v":{"$error":"#REF!"}},{"$f":"T65-HLOOKUP(X65,#REF!,5,FALSE)","v":{"$error":"#REF!"}},{"$f":"T65-HLOOKUP(X65,#REF!,6,FALSE)","v":{"$error":"#REF!"}},{"$f":"T65-HLOOKUP(X65,#REF!,7,FALSE)","v":{"$error":"#REF!"}},{"$f":"T65-HLOOKUP(X65,#REF!,8,FALSE)","v":{"$error":"#REF!"}},{"$f":"T65-HLOOKUP(X65,#REF!,9,FALSE)","v":{"$error":"#REF!"}},null,null,null,null,null,null,null,{"$error":"#REF!"}]
["H","NORD","PIC",11,364932,"VICART","Mathéo",2002,49.3,"Saleux CHM","F",22,24,26,50,27,29,-31,56,106,183.84381990436867,56.7,null,{"$f":"IF(A66=\"F\",(IF(OR(H66>2001,H66<2004),VLOOKUP(I66,Feuil1!$G$11:$H$25,2))),IF(A66=\"H\",(IF(OR(H66>2001,H66<2004),VLOOKUP(I66,Feuil1!$A$11:$F$29,2)))))","v":"M50"},null,{"$f":"T66-HLOOKUP(X66,#REF!,2,FALSE)","v":{"$error":"#REF!"}},{"$f":"T66-HLOOKUP(X66,#REF!,3,FALSE)","v":{"$error":"#REF!"}},{"$f":"T66-HLOOKUP(X66,#REF!,4,FALSE)","v":{"$error":"#REF!"}},{"$f":"T66-HLOOKUP(X66,#REF!,5,FALSE)","v":{"$error":"#REF!"}},{"$f":"T66-HLOOKUP(X66,#REF!,6,FALSE)","v":{"$error":"#REF!"}},{"$f":"T66-HLOOKUP(X66,#REF!,7,FALSE)","v":{"$error":"#REF!"}},{"$f":"T66-HLOOKUP(X66,#REF!,8,FALSE)","v":{"$error":"#REF!"}},{"$f":"T66-HLOOKUP(X66,#REF!,9,FALSE)","v":{"$error":"#REF!"}},null,null,null,null,null,null,null,{"$error":"#REF!"}]
["H","SE","PRO",12,364002,"CHOMIENNE","Tristan",2002,50,"ISTRES SPORTS","F",20,22,24,46,26,28,30,58,104,178.18403804155196,54,null,{"$f":"IF(A67=\"F\",(IF(OR(H67>2001,H67<2004),VLOOKUP(I67,Feuil1!$G$11:$H$25,2))),IF(A67=\"H\",(IF(OR(H67>2001,H67<2004),VLOOKUP(I67,Feuil1!$A$11:$F$29,2)))))","v":"M50"},null,{"$f":"T67-HLOOKUP(X67,#REF!,2,FALSE)","v":{"$error":"#REF!"}},{"$f":"T67-HLOOKUP(X67,#REF!,3,FALSE)","v":{"$error":"#REF!"}},{"$f":"T67-HLOOKUP(X67,#REF!,4,FALSE)","v":{"$error":"#REF!"}},{"$f":"T67-HLOOKUP(X67,#REF!,5,FALSE)","v":{"$error":"#REF!"}},{"$f":"T67-HLOOKUP(X67,#REF!,6,FALSE)","v":{"$error":"#REF!"}},{"$f":"T67-HLOOKUP(X67,#REF!,7,FALSE)","v":{"$error":"#REF!"}},{"$f":"T67-HLOOKUP(X67,#REF!,8,FALSE)","v":{"$error":"#REF!"}},{"$f":"T67-HLOOKUP(X67,#REF!,9,FALSE)","v":{"$error":"#REF!"}},null,null,null,null,null,null,null,{"$error":"#REF!"}]
["H","N","IDF",13,377315,"CAGNY","RAFAEL",2003,48.8,"FRANCONVILLE","F",18,20,22,42,27,29,31,60,102,178.49169437224495,53.2,null,{"$f":"IF(A68=\"F\",(IF(OR(H68>2001,H68<2004),VLOOKUP(I68,Feuil1!$G$11:$H$25,2))),IF(A68=\"H\",(IF(OR(H68>2001,H68<2004),VLOOKUP(I68,Feuil1!$A$11:$F$29,2)))))","v":"M50"},null,{"$f":"T68-HLOOKUP(X68,#REF!,2,FALSE)","v":{"$error":"#REF!"}},{"$f":"T68-HLOOKUP(X68,#REF!,3,FALSE)","v":{"$error":"#REF!"}},{"$f":"T68-HLOOKUP(X68,#REF!,4,FALSE)","v":{"$error":"#REF!"}},{"$f":"T68-HLOOKUP(X68,#REF!,5,FALSE)","v":{"$error":"#REF!"}},{"$f":"T68-HLOOKUP(X68,#REF!,6,FALSE)","v":{"$error":"#REF!"}},{"$f":"T68-HLOOKUP(X68,#REF!,7,FALSE)","v":{"$error":"#REF!"}},{"$f":"T68-HLOOKUP(X68,#REF!,8,FALSE)","v":{"$error":"#REF!"}},{"$f":"T68-HLOOKUP(X68,#REF!,9,FALSE)","v":{"$error":"#REF!"}},null,null,null,null,null,null,null,{"$error":"#REF!"}]
["H","NE","ALS",14,355143,"DELORME","CYRIL",2003,49.5,"SR Obernai HM","F",17,19,21,40,26,28,30,58,98,169.37098320871596,48.5,null,{"$f":"IF(A69=\"F\",(IF(OR(H69>2001,H69<2004),VLOOKUP(I69,Feuil1!$G$11:$H$25,2))),IF(A69=\"H\",(IF(OR(H69>2001,H69<2004),VLOOKUP(I69,Feuil1!$A$11:$F$29,2)))))","v":"M50"},null,{"$f":"T69-HLOOKUP(X69,#REF!,2,FALSE)","v":{"$error":"#REF!"}},{"$f":"T69-HLOOKUP(X69,#REF!,3,FALSE)","v":{"$error":"#REF!"}},{"$f":"T69-HLOOKUP(X69,#REF!,4,FALSE)","v":{"$error":"#REF!"}},{"$f":"T69-HLOOKUP(X69,#REF!,5,FALSE)","v":{"$error":"#REF!"}},{"$f":"T69-HLOOKUP(X69,#REF!,6,FALSE)","v":{"$error":"#REF!"}},{"$f":"T69-HLOOKUP(X69,#REF!,7,FALSE)","v":{"$error":"#REF!"}},{"$f":"T69-HLOOKUP(X69,#REF!,8,FALSE)","v":{"$error":"#REF!"}},{"$f":"T69-HLOOKUP(X69,#REF!,9,FALSE)","v":{"$error":"#REF!"}},null,null,null,null,null,null,null,{"$error":"#REF!"}]
["H","N","IDF",15,380705,"BEKKOUCH","ILIES",2002,49.2,"CACHAN","F",16,18,20,38,27,29,30,59,97,168.53270894200756,47.8,null,{"$f":"IF(A70=\"F\",(IF(OR(H70>2001,H70<2004),VLOOKUP(I70,Feuil1!$G$11:$H$25,2))),IF(A70=\"H\",(IF(OR(H70>2001,H70<2004),VLOOKUP(I70,Feuil1!$A$11:$F$29,2)))))","v":"M50"},null,{"$f":"T70-HLOOKUP(X70,#REF!,2,FALSE)","v":{"$error":"#REF!"}},{"$f":"T70-HLOOKUP(X70,#REF!,3,FALSE)","v":{"$error":"#REF!"}},{"$f":"T70-HLOOKUP(X70,#REF!,4,FALSE)","v":{"$error":"#REF!"}},{"$f":"T70-HLOOKUP(X70,#REF!,5,FALSE)","v":{"$error":"#REF!"}},{"$f":"T70-HLOOKUP(X70,#REF!,6,FALSE)","v":{"$error":"#REF!"}},{"$f":"T70-HLOOKUP(X70,#REF!,7,FALSE)","v":{"$error":"#REF!"}},{"$f":"T70-HLOOKUP(X70,#REF!,8,FALSE)","v":{"$error":"#REF!"}},{"$f":"T70-HLOOKUP(X70,#REF!,9,FALSE)","v":{"$error":"#REF!"}},null,null,null,null,null,null,null,{"$error":"#REF!"}]
["H","CO","PDL",16,378550,"IHIHI","Ossama",2002,47.95,"CJF LAVAL - VOUTRÉ","F",20,22,24,46,22,24,25,49,95,168.84706147394635,47.05,null,{"$f":"IF(A71=\"F\",(IF(OR(H71>2001,H71<2004),VLOOKUP(I71,Feuil1!$G$11:$H$25,2))),IF(A71=\"H\",(IF(OR(H71>2001,H71<2004),VLOOKUP(I71,Feuil1!$A$11:$F$29,2)))))","v":"M50"},null,{"$f":"T71-HLOOKUP(X71,#REF!,2,FALSE)","v":{"$error":"#REF!"}},{"$f":"T71-HLOOKUP(X71,#REF!,3,FALSE)","v":{"$error":"#REF!"}},{"$f":"T71-HLOOKUP(X71,#REF!,4,FALSE)","v":{"$error":"#REF!"}},{"$f":"T71-HLOOKUP(X71,#REF!,5,FALSE)","v":{"$error":"#REF!"}},{"$f":"T71-HLOOKUP(X71,#REF!,6,FALSE)","v":{"$error":"#REF!"}},{"$f":"T71-HLOOKUP(X71,#REF!,7,FALSE)","v":{"$error":"#REF!"}},{"$f":"T71-HLOOKUP(X71,#REF!,8,FALSE)","v":{"$error":"#REF!"}},{"$f":"T71-HLOOKUP(X71,#REF!,9,FALSE)","v":{"$error":"#REF!"}},null,null,null,null,null,null,null,{"$error":"#REF!"}]
["H","SO","AQU",17,390374,"GANESHARAJAH","ABIESHEK",2002,45.7,"MONT DE MARSAN","SRL",15,18,19,37,25,27,30,57,94,174.51717199051413,48.3,null,{"$f":"IF(A72=\"F\",(IF(OR(H72>2001,H72<2004),VLOOKUP(I72,Feuil1!$G$11:$H$25,2))),IF(A72=\"H\",(IF(OR(H72>2001,H72<2004),VLOOKUP(I72,Feuil1!$A$11:$F$29,2)))))","v":"M50"},null,{"$f":"T72-HLOOKUP(X72,#REF!,2,FALSE)","v":{"$error":"#REF!"}},{"$f":"T72-HLOOKUP(X72,#REF!,3,FALSE)","v":{"$error":"#REF!"}},{"$f":"T72-HLOOKUP(X72,#REF!,4,FALSE)","v":{"$error":"#REF!"}},{"$f":"T72-HLOOKUP(X72,#REF!,5,FALSE)","v":{"$error":"#REF!"}},{"$f":"T72-HLOOKUP(X72,#REF!,6,FALSE)","v":{"$error":"#REF!"}},{"$f":"T72-HLOOKUP(X72,#REF!,7,FALSE)","v":{"$error":"#REF!"}},{"$f":"T72-HLOOKUP(X72,#REF!,8,FALSE)","v":{"$error":"#REF!"}},{"$f":"T72-HLOOKUP(X72,#REF!,9,FALSE)","v":{"$error":"#REF!"}},null,null,null,null,null,null,null,{"$error":"#REF!"}]
["H","CO","BRE",18,327176,"FETIVEAU","Brian",2003,48.7,"ES Saint-Avé","F",21,23,-25,44,22,24,26,50,94,164.78935497239854,45.3,null,{"$f":"IF(A73=\"F\",(IF(OR(H73>2001,H73<2004),VLOOKUP(I73,Feuil1!$G$11:$H$25,2))),IF(A73=\"H\",(IF(OR(H73>2001,H73<2004),VLOOKUP(I73,Feuil1!$A$11:$F$29,2)))))","v":"M50"},null,{"$f":"T73-HLOOKUP(X73,#REF!,2,FALSE)","v":{"$error":"#REF!"}},{"$f":"T73-HLOOKUP(X73,#REF!,3,FALSE)","v":{"$error":"#REF!"}},{"$f":"T73-HLOOKUP(X73,#REF!,4,FALSE)","v":{"$error":"#REF!"}},{"$f":"T73-HLOOKUP(X73,#REF!,5,FALSE)","v":{"$error":"#REF!"}},{"$f":"T73-HLOOKUP(X73,#REF!,6,FALSE)","v":{"$error":"#REF!"}},{"$f":"T73-HLOOKUP(X73,#REF!,7,FALSE)","v":{"$error":"#REF!"}},{"$f":"T73-HLOOKUP(X73,#REF!,8,FALSE)","v":{"$error":"#REF!"}},{"$f":"T73-HLOOKUP(X73,#REF!,9,FALSE)","v":{"$error":"#REF!"}},null,null,null,null,null,null,null,{"$error":"#REF!"}]
["H","CO","BRE",19,364030,"RAGOT","Antoine",2002,47.1,"HC Pleurtuit","F",16,18,20,38,26,28,-30,54,92,166.15965264590398,44.9,null,{"$f":"IF(A74=\"F\",(IF(OR(H74>2001,H74<2004),VLOOKUP(I74,Feuil1!$G$11:$H$25,2))),IF(A74=\"H\",(IF(OR(H74>2001,H74<2004),VLOOKUP(I74,Feuil1!$A$11:$F$29,2)))))","v":"M50"},null,{"$f":"T74-HLOOKUP(X74,#REF!,2,FALSE)","v":{"$error":"#REF!"}},{"$f":"T74-HLOOKUP(X74,#REF!,3,FALSE)","v":{"$error":"#REF!"}},{"$f":"T74-HLOOKUP(X74,#REF!,4,FALSE)","v":{"$error":"#REF!"}},{"$f":"T74-HLOOKUP(X74,#REF!,5,FALSE)","v":{"$error":"#REF!"}},{"$f":"T74-HLOOKUP(X74,#REF!,6,FALSE)","v":{"$error":"#REF!"}},{"$f":"T74-HLOOKUP(X74,#REF!,7,FALSE)","v":{"$error":"#REF!"}},{"$f":"T74-HLOOKUP(X74,#REF!,8,FALSE)","v":{"$error":"#REF!"}},{"$f":"T74-HLOOKUP(X74,#REF!,9,FALSE)","v":{"$error":"#REF!"}},null,null,null,null,null,null,null,{"$error":"#REF!"}]
["H","CO","BRE",20,378681,"OUDIN","Fabien",2003,46.4,"CHM Plouhinec","F",18,19,20,39,21,23,25,48,87,159.28101846510069,40.6,null,{"$f":"IF(A75=\"F\",(IF(OR(H75>2001,H75<2004),VLOOKUP(I75,Feuil1!$G$11:$H$25,2))),IF(A75=\"H\",(IF(OR(H75>2001,H75<2004),VLOOKUP(I75,Feuil1!$A$11:$F$29,2)))))","v":"M50"},null,{"$f":"T75-HLOOKUP(X75,#REF!,2,FALSE)","v":{"$error":"#REF!"}},{"$f":"T75-HLOOKUP(X75,#REF!,3,FALSE)","v":{"$error":"#REF!"}},{"$f":"T75-HLOOKUP(X75,#REF!,4,FALSE)","v":{"$error":"#REF!"}},{"$f":"T75-HLOOKUP(X75,#REF!,5,FALSE)","v":{"$error":"#REF!"}},{"$f":"T75-HLOOKUP(X75,#REF!,6,FALSE)","v":{"$error":"#REF!"}},{"$f":"T75-HLOOKUP(X75,#REF!,7,FALSE)","v":{"$error":"#REF!"}},{"$f":"T75-HLOOKUP(X75,#REF!,8,FALSE)","v":{"$error":"#REF!"}},{"$f":"T75-HLOOKUP(X75,#REF!,9,FALSE)","v":{"$error":"#REF!"}},null,null,null,null,null,null,null,{"$error":"#REF!"}]
["H","NE","ALS",21,383774,"VERGNAUD","JAROD",2003,45.4,"SHC Haguenau","F",13,15,-17,28,18,20,22,42,70,130.75486721446785,24.6,null,{"$f":"IF(A76=\"F\",(IF(OR(H76>2001,H76<2004),VLOOKUP(I76,Feuil1!$G$11:$H$25,2))),IF(A76=\"H\",(IF(OR(H76>2001,H76<2004),VLOOKUP(I76,Feuil1!$A$11:$F$29,2)))))","v":"M50"},null,{"$f":"T76-HLOOKUP(X76,#REF!,2,FALSE)","v":{"$error":"#REF!"}},{"$f":"T76-HLOOKUP(X76,#REF!,3,FALSE)","v":{"$error":"#REF!"}},{"$f":"T76-HLOOKUP(X76,#REF!,4,FALSE)","v":{"$error":"#REF!"}},{"$f":"T76-HLOOKUP(X76,#REF!,5,FALSE)","v":{"$error":"#REF!"}},{"$f":"T76-HLOOKUP(X76,#REF!,6,FALSE)","v":{"$error":"#REF!"}},{"$f":"T76-HLOOKUP(X76,#REF!,7,FALSE)","v":{"$error":"#REF!"}},{"$f":"T76-HLOOKUP(X76,#REF!,8,FALSE)","v":{"$error":"#REF!"}},{"$f":"T76-HLOOKUP(X76,#REF!,9,FALSE)","v":{"$error":"#REF!"}},null,null,null,null,null,null,null,{"$error":"#REF!"}]
["H","CO","BNO",22,377449,"Anquetil","Kilian",2002,45.3,"Giberville","F",12,13,14,27,16,17,19,36,63,117.92077918349175,17.700000000000003,null,{"$f":"IF(A77=\"F\",(IF(OR(H77>2001,H77<2004),VLOOKUP(I77,Feuil1!$G$11:$H$25,2))),IF(A77=\"H\",(IF(OR(H77>2001,H77<2004),VLOOKUP(I77,Feuil1!$A$11:$F$29,2)))))","v":"M50"},null,{"$f":"T77-HLOOKUP(X77,#REF!,2,FALSE)","v":{"$error":"#REF!"}},{"$f":"T77-HLOOKUP(X77,#REF!,3,FALSE)","v":{"$error":"#REF!"}},{"$f":"T77-HLOOKUP(X77,#REF!,4,FALSE)","v":{"$error":"#REF!"}},{"$f":"T77-HLOOKUP(X77,#REF!,5,FALSE)","v":{"$error":"#REF!"}},{"$f":"T77-HLOOKUP(X77,#REF!,6,FALSE)","v":{"$error":"#REF!"}},{"$f":"T77-HLOOKUP(X77,#REF!,7,FALSE)","v":{"$error":"#REF!"}},{"$f":"T77-HLOOKUP(X77,#REF!,8,FALSE)","v":{"$error":"#REF!"}},{"$f":"T77-HLOOKUP(X77,#REF!,9,FALSE)","v":{"$error":"#REF!"}},null,null,null,null,null,null,null,{"$error":"#REF!"}]
["H","SO","MPY",23,375974,"MIQUEL","Noah",2003,45.2,"MONTAUBAN HC","F",9,11,12,23,14,16,17,33,56,105.03431637465668,10.799999999999997,null,{"$f":"IF(A78=\"F\",(IF(OR(H78>2001,H78<2004),VLOOKUP(I78,Feuil1!$G$11:$H$25,2))),IF(A78=\"H\",(IF(OR(H78>2001,H78<2004),VLOOKUP(I78,Feuil1!$A$11:$F$29,2)))))","v":"M50"},null,{"$f":"T78-HLOOKUP(X78,#REF!,2,FALSE)","v":{"$error":"#REF!"}},{"$f":"T78-HLOOKUP(X78,#REF!,3,FALSE)","v":{"$error":"#REF!"}},{"$f":"T78-HLOOKUP(X78,#REF!,4,FALSE)","v":{"$error":"#REF!"}},{"$f":"T78-HLOOKUP(X78,#REF!,5,FALSE)","v":{"$error":"#REF!"}},{"$f":"T78-HLOOKUP(X78,#REF!,6,FALSE)","v":{"$error":"#REF!"}},{"$f":"T78-HLOOKUP(X78,#REF!,7,FALSE)","v":{"$error":"#REF!"}},{"$f":"T78-HLOOKUP(X78,#REF!,8,FALSE)","v":{"$error":"#REF!"}},{"$f":"T78-HLOOKUP(X78,#REF!,9,FALSE)","v":{"$error":"#REF!"}},null,null,null,null,null,null,null,{"$error":"#REF!"}]
["H","CO","CEN",24,386546,"CLAVIER","Mathéo",2002,47.4,"CHM CHATEAUROUX","F",11,-12,12,23,14,15,16,31,54,96.972153042738526,6.6000000000000014,null,{"$f":"IF(A79=\"F\",(IF(OR(H79>2001,H79<2004),VLOOKUP(I79,Feuil1!$G$11:$H$25,2))),IF(A79=\"H\",(IF(OR(H79>2001,H79<2004),VLOOKUP(I79,Feuil1!$A$11:$F$29,2)))))","v":"M50"},null,{"$f":"T79-HLOOKUP(X79,#REF!,2,FALSE)","v":{"$error":"#REF!"}},{"$f":"T79-HLOOKUP(X79,#REF!,3,FALSE)","v":{"$error":"#REF!"}},{"$f":"T79-HLOOKUP(X79,#REF!,4,FALSE)","v":{"$error":"#REF!"}},{"$f":"T79-HLOOKUP(X79,#REF!,5,FALSE)","v":{"$error":"#REF!"}},{"$f":"T79-HLOOKUP(X79,#REF!,6,FALSE)","v":{"$error":"#REF!"}},{"$f":"T79-HLOOKUP(X79,#REF!,7,FALSE)","v":{"$error":"#REF!"}},{"$f":"T79-HLOOKUP(X79,#REF!,8,FALSE)","v":{"$error":"#REF!"}},{"$f":"T79-HLOOKUP(X79,#REF!,9,FALSE)","v":{"$error":"#REF!"}},null,null,null,null,null,null,null,{"$error":"#REF!"}]
["H","CO","BRE",25,378685,"AUTRET ","Ian ",2003,45.4,"CHM Plouhinec","F",12,13,14,27,11,12,13,25,52,97.132187073604683,6.6000000000000014,null,{"$f":"IF(A80=\"F\",(IF(OR(H80>2001,H80<2004),VLOOKUP(I80,Feuil1!$G$11:$H$25,2))),IF(A80=\"H\",(IF(OR(H80>2001,H80<2004),VLOOKUP(I80,Feuil1!$A$11:$F$29,2)))))","v":"M50"},null,{"$f":"T80-HLOOKUP(X80,#REF!,2,FALSE)","v":{"$error":"#REF!"}},{"$f":"T80-HLOOKUP(X80,#REF!,3,FALSE)","v":{"$error":"#REF!"}},{"$f":"T80-HLOOKUP(X80,#REF!,4,FALSE)","v":{"$error":"#REF!"}},{"$f":"T80-HLOOKUP(X80,#REF!,5,FALSE)","v":{"$error":"#REF!"}},{"$f":"T80-HLOOKUP(X80,#REF!,6,FALSE)","v":{"$error":"#REF!"}},{"$f":"T80-HLOOKUP(X80,#REF!,7,FALSE)","v":{"$error":"#REF!"}},{"$f":"T80-HLOOKUP(X80,#REF!,8,FALSE)","v":{"$error":"#REF!"}},{"$f":"T80-HLOOKUP(X80,#REF!,9,FALSE)","v":{"$error":"#REF!"}},null,null,null,null,null,null,null,{"$error":"#REF!"}]
[null,null,null,null,null,null,null,null,null,null,null,null,null,null,null,null,null,null,null,null,null,null,null,null,null,{"$f":"T81-HLOOKUP(X81,#REF!,2,FALSE)","v":{"$error":"#REF!"}},{"$f":"T81-HLOOKUP(X81,#REF!,3,FALSE)","v":{"$error":"#REF!"}},{"$f":"T81-HLOOKUP(X81,#REF!,4,FALSE)","v":{"$error":"#REF!"}},{"$f":"T81-HLOOKUP(X81,#REF!,5,FALSE)","v":{"$error":"#REF!"}},{"$f":"T81-HLOOKUP(X81,#REF!,6,FALSE)","v":{"$error":"#REF!"}},{"$f":"T81-HLOOKUP(X81,#REF!,7,FALSE)","v":{"$error":"#REF!"}},{"$f":"T81-HLOOKUP(X81,#REF!,8,FALSE)","v":{"$error":"#REF!"}},{"$f":"T81-HLOOKUP(X81,#REF!,9,FALSE)","v":{"$error":"#REF!"}},null,null,null,null,null,null,null,{"$f":"IF(AG81>=0,$AG$4,IF(AF81>=0,$AF$4,IF(AE81>=0,$AE$4,IF(AD81>=0,$AD$4,IF(AC81>=0,$AC$4,IF(AB81>=0,$AB$4,IF(AA81>=0,$AA$4,IF(Z81>=0,$Z$4,$AH$4))))))))","v":{"$error":"#REF!"}}]
["H","NE","ALS",1,324091,"SPAGNULO","GIACONO",2002,53.4,"SHC Haguenau","F",44,46,-48,{"$f":"IF(MAXA(L82+M82,M82+N82,L82+N82,L82,M82,N82)<=0,0,MAXA(L82+M82,M82+N82,L82+N82,L82,M82,N82))","v":90},54,56,58,{"$f":"IF(MAXA(P82+Q82,Q82+R82,P82+R82,P82,Q82,R82)<=0,0,MAXA(P82+Q82,Q82+R82,P82+R82,P82,Q82,R82))","v":114},{"$f":"IF(H82=\"\",\"\",IF(OR(O82=0,S82=0),0,O82+S82))","v":204},{"$f":"IF(I82=\"\",\"\",IF(A82=\"H\",10^(0.794358141*LOG(I82/174.393)^2)*T82,IF(A82=\"F\",10^(0.89726074 * LOG(I82/148.026)^2)*T82,\"\")))","v":330.73978644277565},{"$f":"SUM(T82-I82)","v":150.6},null,{"$f":"IF(A82=\"F\",(IF(OR(H82>2001,H82<2004),VLOOKUP(I82,Feuil1!$G$11:$H$25,2))),IF(A82=\"H\",(IF(OR(H82>2001,H82<2004),VLOOKUP(I82,Feuil1!$A$11:$F$29,2)))))","v":"M56"},null,{"$f":"T82-HLOOKUP(X82,#REF!,2,FALSE)","v":{"$error":"#REF!"}},{"$f":"T82-HLOOKUP(X82,#REF!,3,FALSE)","v":{"$error":"#REF!"}},{"$f":"T82-HLOOKUP(X82,#REF!,4,FALSE)","v":{"$error":"#REF!"}},{"$f":"T82-HLOOKUP(X82,#REF!,5,FALSE)","v":{"$error":"#REF!"}},{"$f":"T82-HLOOKUP(X82,#REF!,6,FALSE)","v":{"$error":"#REF!"}},{"$f":"T82-HLOOKUP(X82,#REF!,7,FALSE)","v":{"$error":"#REF!"}},{"$f":"T82-HLOOKUP(X82,#REF!,8,FALSE)","v":{"$error":"#REF!"}},{"$f":"T82-HLOOKUP(X82,#REF!,9,FALSE)","v":{"$error":"#REF!"}},null,null,null,null,null,null,null,{"$f":"IF(AG82>=0,$AG$4,IF(AF82>=0,$AF$4,IF(AE82>=0,$AE$4,IF(AD82>=0,$AD$4,IF(AC82>=0,$AC$4,IF(AB82>=0,$AB$4,IF(AA82>=0,$AA$4,IF(Z82>=0,$Z$4,$AH$4))))))))","v":{"$error":"#REF!"}}]
["H","DOM","REU",2,321684,"ROUGET","TIZZIANO",2002,53,"LES DEUX PETITS NANOS","F",40,42,44,86,54,56,58,114,200,326.25801723010704,147,null,{"$f":"IF(A83=\"F\",(IF(OR(H83>2001,H83<2004),VLOOKUP(I83,Feuil1!$G$11:$H$25,2))),IF(A83=\"H\",(IF(OR(H83>2001,H83<2004),VLOOKUP(I83,Feuil1!$A$11:$F$29,2)))))","v":"M56"},null,{"$f":"T83-HLOOKUP(X83,#REF!,2,FALSE)","v":{"$error":"#REF!"}},{"$f":"T83-HLOOKUP(X83,#REF!,3,FALSE)","v":{"$error":"#REF!"}},{"$f":"T83-HLOOKUP(X83,#REF!,4,FALSE)","v":{"$error":"#REF!"}},{"$f":"T83-HLOOKUP(X83,#REF!,5,FALSE)","v":{"$error":"#REF!"}},{"$f":"T83-HLOOKUP(X83,#REF!,6,FALSE)","v":{"$error":"#REF!"}},{"$f":"T83-HLOOKUP(X83,#REF!,7,FALSE)","v":{"$error":"#REF!"}},{"$f":"T83-HLOOKUP(X83,#REF!,8,FALSE)","v":{"$error":"#REF!"}},{"$f":"T83-HLOOKUP(X83,#REF!,9,FALSE)","v":{"$error":"#REF!"}},null,null,null,null,null,null,null,{"$error":"#REF!"}]
["H","SO","MPY",3,356782,"CANCE","Quentin",2002,55.62,"FIGEAC HC","F",36,38,40,78,56,-58,58,114,192,301.27353773952814,136.38,null,{"$f":"IF(A84=\"F\",(IF(OR(H84>2001,H84<2004),VLOOKUP(I84,Feuil1!$G$11:$H$25,2))),IF(A84=\"H\",(IF(OR(H84>2001,H84<2004),VLOOKUP(I84,Feuil1!$A$11:$F$29,2)))))","v":"M56"},null,{"$f":"T84-HLOOKUP(X84,#REF!,2,FALSE)","v":{"$error":"#REF!"}},{"$f":"T84-HLOOKUP(X84,#REF!,3,FALSE)","v":{"$error":"#REF!"}},{"$f":"T84-HLOOKUP(X84,#REF!,4,FALSE)","v":{"$error":"#REF!"}},{"$f":"T84-HLOOKUP(X84,#REF!,5,FALSE)","v":{"$error":"#REF!"}},{"$f":"T84-HLOOKUP(X84,#REF!,6,FALSE)","v":{"$error":"#REF!"}},{"$f":"T84-HLOOKUP(X84,#REF!,7,FALSE)","v":{"$error":"#REF!"}},{"$f":"T84-HLOOKUP(X84,#REF!,8,FALSE)","v":{"$error":"#REF!"}},{"$f":"T84-HLOOKUP(X84,#REF!,9,FALSE)","v":{"$error":"#REF!"}},null,null,null,null,null,null,null,{"$error":"#REF!"}]
["H","CO","CEN",4,346360,"PINIAU","Mathis",2002,55.8,"CM ORLEANS","F",27,29,31,60,37,39,41,80,140,219.12047277577267,84.2,null,{"$f":"IF(A85=\"F\",(IF(OR(H85>2001,H85<2004),VLOOKUP(I85,Feuil1!$G$11:$H$25,2))),IF(A85=\"H\",(IF(OR(H85>2001,H85<2004),VLOOKUP(I85,Feuil1!$A$11:$F$29,2)))))","v":"M56"},null,{"$f":"T85-HLOOKUP(X85,#REF!,2,FALSE)","v":{"$error":"#REF!"}},{"$f":"T85-HLOOKUP(X85,#REF!,3,FALSE)","v":{"$error":"#REF!"}},{"$f":"T85-HLOOKUP(X85,#REF!,4,FALSE)","v":{"$error":"#REF!"}},{"$f":"T85-HLOOKUP(X85,#REF!,5,FALSE)","v":{"$error":"#REF!"}},{"$f":"T85-HLOOKUP(X85,#REF!,6,FALSE)","v":{"$error":"#REF!"}},{"$f":"T85-HLOOKUP(X85,#REF!,7,FALSE)","v":{"$error":"#REF!"}},{"$f":"T85-HLOOKUP(X85,#REF!,8,FALSE)","v":{"$error":"#REF!"}},{"$f":"T85-HLOOKUP(X85,#REF!,9,FALSE)","v":{"$error":"#REF!"}},null,null,null,null,null,null,null,{"$error":"#REF!"}]
["H","NORD","NPC",5,359647,"PARANTHOEN","Jason",2002,50.1,"C.A.ROSENDAEL","F",24,-26,26,50,40,42,44,86,136,232.60926657686593,85.9,null,{"$f":"IF(A86=\"F\",(IF(OR(H86>2001,H86<2004),VLOOKUP(I86,Feuil1!$G$11:$H$25,2))),IF(A86=\"H\",(IF(OR(H86>2001,H86<2004),VLOOKUP(I86,Feuil1!$A$11:$F$29,2)))))","v":"M56"},null,{"$f":"T86-HLOOKUP(X86,#REF!,2,FALSE)","v":{"$error":"#REF!"}},{"$f":"T86-HLOOKUP(X86,#REF!,3,FALSE)","v":{"$error":"#REF!"}},{"$f":"T86-HLOOKUP(X86,#REF!,4,FALSE)","v":{"$error":"#REF!"}},{"$f":"T86-HLOOKUP(X86,#REF!,5,FALSE)","v":{"$error":"#REF!"}},{"$f":"T86-HLOOKUP(X86,#REF!,6,FALSE)","v":{"$error":"#REF!"}},{"$f":"T86-HLOOKUP(X86,#REF!,7,FALSE)","v":{"$error":"#REF!"}},{"$f":"T86-HLOOKUP(X86,#REF!,8,FALSE)","v":{"$error":"#REF!"}},{"$f":"T86-HLOOKUP(X86,#REF!,9,FALSE)","v":{"$error":"#REF!"}},null,null,null,null,null,null,null,{"$error":"#REF!"}]
["H","SE","LAN",6,306124,"MARTINEZ","Léo",2003,52.9,"Clermont Sports","F",26,28,29,57,36,38,40,78,135,220.56647995778295,82.1,null,{"$f":"IF(A87=\"F\",(IF(OR(H87>2001,H87<2004),VLOOKUP(I87,Feuil1!$G$11:$H$25,2))),IF(A87=\"H\",(IF(OR(H87>2001,H87<2004),VLOOKUP(I87,Feuil1!$A$11:$F$29,2)))))","v":"M56"},null,{"$f":"T87-HLOOKUP(X87,#REF!,2,FALSE)","v":{"$error":"#REF!"}},{"$f":"T87-HLOOKUP(X87,#REF!,3,FALSE)","v":{"$error":"#REF!"}},{"$f":"T87-HLOOKUP(X87,#REF!,4,FALSE)","v":{"$error":"#REF!"}},{"$f":"T87-HLOOKUP(X87,#REF!,5,FALSE)","v":{"$error":"#REF!"}},{"$f":"T87-HLOOKUP(X87,#REF!,6,FALSE)","v":{"$error":"#REF!"}},{"$f":"T87-HLOOKUP(X87,#REF!,7,FALSE)","v":{"$error":"#REF!"}},{"$f":"T87-HLOOKUP(X87,#REF!,8,FALSE)","v":{"$error":"#REF!"}},{"$f":"T87-HLOOKUP(X87,#REF!,9,FALSE)","v":{"$error":"#REF!"}},null,null,null,null,null,null,null,{"$error":"#REF!"}]
["H","NE","ALS",7,375708,"DELUCCHI","MATTEO",2002,52.5,"SHC Haguenau","F",27,29,31,60,33,35,37,72,132,217.02084691692846,79.5,null,{"$f":"IF(A88=\"F\",(IF(OR(H88>2001,H88<2004),VLOOKUP(I88,Feuil1!$G$11:$H$25,2))),IF(A88=\"H\",(IF(OR(H88>2001,H88<2004),VLOOKUP(I88,Feuil1!$A$11:$F$29,2)))))","v":"M56"},null,{"$f":"T88-HLOOKUP(X88,#REF!,2,FALSE)","v":{"$error":"#REF!"}},{"$f":"T88-HLOOKUP(X88,#REF!,3,FALSE)","v":{"$error":"#REF!"}},{"$f":"T88-HLOOKUP(X88,#REF!,4,FALSE)","v":{"$error":"#REF!"}},{"$f":"T88-HLOOKUP(X88,#REF!,5,FALSE)","v":{"$error":"#REF!"}},{"$f":"T88-HLOOKUP(X88,#REF!,6,FALSE)","v":{"$error":"#REF!"}},{"$f":"T88-HLOOKUP(X88,#REF!,7,FALSE)","v":{"$error":"#REF!"}},{"$f":"T88-HLOOKUP(X88,#REF!,8,FALSE)","v":{"$error":"#REF!"}},{"$f":"T88-HLOOKUP(X88,#REF!,9,FALSE)","v":{"$error":"#REF!"}},null,null,null,null,null,null,null,{"$error":"#REF!"}]
["H","SE","LAN",8,374525,"DELLACHI","Yann",2002,56,"HC Grand Combe","F",28,30,32,62,32,34,36,70,132,206.01985456334876,76,null,{"$f":"IF(A89=\"F\",(IF(OR(H89>2001,H89<2004),VLOOKUP(I89,Feuil1!$G$11:$H$25,2))),IF(A89=\"H\",(IF(OR(H89>2001,H89<2004),VLOOKUP(I89,Feuil1!$A$11:$F$29,2)))))","v":"M56"},null,{"$f":"T89-HLOOKUP(X89,#REF!,2,FALSE)","v":{"$error":"#REF!"}},{"$f":"T89-HLOOKUP(X89,#REF!,3,FALSE)","v":{"$error":"#REF!"}},{"$f":"T89-HLOOKUP(X89,#REF!,4,FALSE)","v":{"$error":"#REF!"}},{"$f":"T89-HLOOKUP(X89,#REF!,5,FALSE)","v":{"$error":"#REF!"}},{"$f":"T89-HLOOKUP(X89,#REF!,6,FALSE)","v":{"$error":"#REF!"}},{"$f":"T89-HLOOKUP(X89,#REF!,7,FALSE)","v":{"$error":"#REF!"}},{"$f":"T89-HLOOKUP(X89,#REF!,8,FALSE)","v":{"$error":"#REF!"}},{"$f":"T89-HLOOKUP(X89,#REF!,9,FALSE)","v":{"$error":"#REF!"}},null,null,null,null,null,null,null,{"$error":"#REF!"}]
["H","NE","ALS",9,378213,"LAPP","EWANN",2003,55.6,"CHM Andlau","F",28,-30,30,58,32,34,36,70,128,200.90599771304892,72.400000000000006,null,{"$f":"IF(A90=\"F\",(IF(OR(H90>2001,H90<2004),VLOOKUP(I90,Feuil1!$G$11:$H$25,2))),IF(A90=\"H\",(IF(OR(H90>2001,H90<2004),VLOOKUP(I90,Feuil1!$A$11:$F$29,2)))))","v":"M56"},null,{"$f":"T90-HLOOKUP(X90,#REF!,2,FALSE)","v":{"$error":"#REF!"}},{"$f":"T90-HLOOKUP(X90,#REF!,3,FALSE)","v":{"$error":"#REF!"}},{"$f":"T90-HLOOKUP(X90,#REF!,4,FALSE)","v":{"$error":"#REF!"}},{"$f":"T90-HLOOKUP(X90,#REF!,5,FALSE)","v":{"$error":"#REF!"}},{"$f":"T90-HLOOKUP(X90,#REF!,6,FALSE)","v":{"$error":"#REF!"}},{"$f":"T90-HLOOKUP(X90,#REF!,7,FALSE)","v":{"$error":"#REF!"}},{"$f":"T90-HLOOKUP(X90,#REF!,8,FALSE)","v":{"$error":"#REF!"}},{"$f":"T90-HLOOKUP(X90,#REF!,9,FALSE)","v":{"$error":"#REF!"}},null,null,null,null,null,null,null,{"$error":"#REF!"}]
["H","SEST","RAL",10,377320,"SERRANO","Dimitri",2002,51.5,"CHAMBON FEUG","F",25,27,28,55,31,33,35,68,123,205.49731007645997,71.5,null,{"$f":"IF(A91=\"F\",(IF(OR(H91>2001,H91<2004),VLOOKUP(I91,Feuil1!$G$11:$H$25,2))),IF(A91=\"H\",(IF(OR(H91>2001,H91<2004),VLOOKUP(I91,Feuil1!$A$11:$F$29,2)))))","v":"M56"},null,{"$f":"T91-HLOOKUP(X91,#REF!,2,FALSE)","v":{"$error":"#REF!"}},{"$f":"T91-HLOOKUP(X91,#REF!,3,FALSE)","v":{"$error":"#REF!"}},{"$f":"T91-HLOOKUP(X91,#REF!,4,FALSE)","v":{"$error":"#REF!"}},{"$f":"T91-HLOOKUP(X91,#REF!,5,FALSE)","v":{"$error":"#REF!"}},{"$f":"T91-HLOOKUP(X91,#REF!,6,FALSE)","v":{"$error":"#REF!"}},{"$f":"T91-HLOOKUP(X91,#REF!,7,FALSE)","v":{"$error":"#REF!"}},{"$f":"T91-HLOOKUP(X91,#REF!,8,FALSE)","v":{"$error":"#REF!"}},{"$f":"T91-HLOOKUP(X91,#REF!,9,FALSE)","v":{"$error":"#REF!"}},null,null,null,null,null,null,null,{"$error":"#REF!"}]
["H","N","IDF",11,380705,"BEKKOUCH","ILIES",2002,54.3,"CACHAN","F",22,24,26,50,33,35,37,72,122,195.13301116266209,67.7,null,{"$f":"IF(A92=\"F\",(IF(OR(H92>2001,H92<2004),VLOOKUP(I92,Feuil1!$G$11:$H$25,2))),IF(A92=\"H\",(IF(OR(H92>2001,H92<2004),VLOOKUP(I92,Feuil1!$A$11:$F$29,2)))))","v":"M56"},null,{"$f":"T92-HLOOKUP(X92,#REF!,2,FALSE)","v":{"$error":"#REF!"}},{"$f":"T92-HLOOKUP(X92,#REF!,3,FALSE)","v":{"$error":"#REF!"}},{"$f":"T92-HLOOKUP(X92,#REF!,4,FALSE)","v":{"$error":"#REF!"}},{"$f":"T92-HLOOKUP(X92,#REF!,5,FALSE)","v":{"$error":"#REF!"}},{"$f":"T92-HLOOKUP(X92,#REF!,6,FALSE)","v":{"$error":"#REF!"}},{"$f":"T92-HLOOKUP(X92,#REF!,7,FALSE)","v":{"$error":"#REF!"}},{"$f":"T92-HLOOKUP(X92,#REF!,8,FALSE)","v":{"$error":"#REF!"}},{"$f":"T92-HLOOKUP(X92,#REF!,9,FALSE)","v":{"$error":"#REF!"}},null,null,null,null,null,null,null,{"$error":"#REF!"}]
["H","NE","LOR",12,378967,"MARROCCO","Nathan",2003,54.1,"H.VALLEROY-AUBOUÉ","F",21,22,23,45,26,27,28,55,100,160.42169421725788,45.9,null,{"$f":"IF(A93=\"F\",(IF(OR(H93>2001,H93<2004),VLOOKUP(I93,Feuil1!$G$11:$H$25,2))),IF(A93=\"H\",(IF(OR(H93>2001,H93<2004),VLOOKUP(I93,Feuil1!$A$11:$F$29,2)))))","v":"M56"},null,{"$f":"T93-HLOOKUP(X93,#REF!,2,FALSE)","v":{"$error":"#REF!"}},{"$f":"T93-HLOOKUP(X93,#REF!,3,FALSE)","v":{"$error":"#REF!"}},{"$f":"T93-HLOOKUP(X93,#REF!,4,FALSE)","v":{"$error":"#REF!"}},{"$f":"T93-HLOOKUP(X93,#REF!,5,FALSE)","v":{"$error":"#REF!"}},{"$f":"T93-HLOOKUP(X93,#REF!,6,FALSE)","v":{"$error":"#REF!"}},{"$f":"T93-HLOOKUP(X93,#REF!,7,FALSE)","v":{"$error":"#REF!"}},{"$f":"T93-HLOOKUP(X93,#REF!,8,FALSE)","v":{"$error":"#REF!"}},{"$f":"T93-HLOOKUP(X93,#REF!,9,FALSE)","v":{"$error":"#REF!"}},null,null,null,null,null,null,null,{"$error":"#REF!"}]
["H","SE","LAN",13,383010,"GARIDEL","Théo",2002,56,"HC Grand Combe","F",-18,18,20,38,24,26,28,54,92,143.58959560475822,36,null,{"$f":"IF(A94=\"F\",(IF(OR(H94>2001,H94<2004),VLOOKUP(I94,Feuil1!$G$11:$H$25,2))),IF(A94=\"H\",(IF(OR(H94>2001,H94<2004),VLOOKUP(I94,Feuil1!$A$11:$F$29,2)))))","v":"M56"},null,{"$f":"T94-HLOOKUP(X94,#REF!,2,FALSE)","v":{"$error":"#REF!"}},{"$f":"T94-HLOOKUP(X94,#REF!,3,FALSE)","v":{"$error":"#REF!"}},{"$f":"T94-HLOOKUP(X94,#REF!,4,FALSE)","v":{"$error":"#REF!"}},{"$f":"T94-HLOOKUP(X94,#REF!,5,FALSE)","v":{"$error":"#REF!"}},{"$f":"T94-HLOOKUP(X94,#REF!,6,FALSE)","v":{"$error":"#REF!"}},{"$f":"T94-HLOOKUP(X94,#REF!,7,FALSE)","v":{"$error":"#REF!"}},{"$f":"T94-HLOOKUP(X94,#REF!,8,FALSE)","v":{"$error":"#REF!"}},{"$f":"T94-HLOOKUP(X94,#REF!,9,FALSE)","v":{"$error":"#REF!"}},null,null,null,null,null,null,null,{"$error":"#REF!"}]
["H","SEST","CAZ",14,378543,"GATEAU","Raphael",2002,51.7,"ASPTT DRAGUIGNAN","F",16,17,19,36,23,25,27,52,88,146.54442913172784,36.299999999999997,null,{"$f":"IF(A95=\"F\",(IF(OR(H95>2001,H95<2004),VLOOKUP(I95,Feuil1!$G$11:$H$25,2))),IF(A95=\"H\",(IF(OR(H95>2001,H95<2004),VLOOKUP(I95,Feuil1!$A$11:$F$29,2)))))","v":"M56"},null,{"$f":"T95-HLOOKUP(X95,#REF!,2,FALSE)","v":{"$error":"#REF!"}},{"$f":"T95-HLOOKUP(X95,#REF!,3,FALSE)","v":{"$error":"#REF!"}},{"$f":"T95-HLOOKUP(X95,#REF!,4,FALSE)","v":{"$error":"#REF!"}},{"$f":"T95-HLOOKUP(X95,#REF!,5,FALSE)","v":{"$error":"#REF!"}},{"$f":"T95-HLOOKUP(X95,#REF!,6,FALSE)","v":{"$error":"#REF!"}},{"$f":"T95-HLOOKUP(X95,#REF!,7,FALSE)","v":{"$error":"#REF!"}},{"$f":"T95-HLOOKUP(X95,#REF!,8,FALSE)","v":{"$error":"#REF!"}},{"$f":"T95-HLOOKUP(X95,#REF!,9,FALSE)","v":{"$error":"#REF!"}},null,null,null,null,null,null,null,{"$error":"#REF!"}]
["H","N","IDF",15,386891,"PHILIBERT","MAEDÏN",2002,55.9,"FRANCONVILLE","F",15,17,19,36,21,23,25,48,84,131.28747442749838,28.1,null,{"$f":"IF(A96=\"F\",(IF(OR(H96>2001,H96<2004),VLOOKUP(I96,Feuil1!$G$11:$H$25,2))),IF(A96=\"H\",(IF(OR(H96>2001,H96<2004),VLOOKUP(I96,Feuil1!$A$11:$F$29,2)))))","v":"M56"},null,{"$f":"T96-HLOOKUP(X96,#REF!,2,FALSE)","v":{"$error":"#REF!"}},{"$f":"T96-HLOOKUP(X96,#REF!,3,FALSE)","v":{"$error":"#REF!"}},{"$f":"T96-HLOOKUP(X96,#REF!,4,FALSE)","v":{"$error":"#REF!"}},{"$f":"T96-HLOOKUP(X96,#REF!,5,FALSE)","v":{"$error":"#REF!"}},{"$f":"T96-HLOOKUP(X96,#REF!,6,FALSE)","v":{"$error":"#REF!"}},{"$f":"T96-HLOOKUP(X96,#REF!,7,FALSE)","v":{"$error":"#REF!"}},{"$f":"T96-HLOOKUP(X96,#REF!,8,FALSE)","v":{"$error":"#REF!"}},{"$f":"T96-HLOOKUP(X96,#REF!,9,FALSE)","v":{"$error":"#REF!"}},null,null,null,null,null,null,null,{"$error":"#REF!"}]
["H","CO","CEN",16,381199,"AUBRY","Tanguy",2003,53.7,"AAJ BLOIS","F",15,17,19,36,20,22,24,46,82,132.33906576915706,28.299999999999997,null,{"$f":"IF(A97=\"F\",(IF(OR(H97>2001,H97<2004),VLOOKUP(I97,Feuil1!$G$11:$H$25,2))),IF(A97=\"H\",(IF(OR(H97>2001,H97<2004),VLOOKUP(I97,Feuil1!$A$11:$F$29,2)))))","v":"M56"},null,{"$f":"T97-HLOOKUP(X97,#REF!,2,FALSE)","v":{"$error":"#REF!"}},{"$f":"T97-HLOOKUP(X97,#REF!,3,FALSE)","v":{"$error":"#REF!"}},{"$f":"T97-HLOOKUP(X97,#REF!,4,FALSE)","v":{"$error":"#REF!"}},{"$f":"T97-HLOOKUP(X97,#REF!,5,FALSE)","v":{"$error":"#REF!"}},{"$f":"T97-HLOOKUP(X97,#REF!,6,FALSE)","v":{"$error":"#REF!"}},{"$f":"T97-HLOOKUP(X97,#REF!,7,FALSE)","v":{"$error":"#REF!"}},{"$f":"T97-HLOOKUP(X97,#REF!,8,FALSE)","v":{"$error":"#REF!"}},{"$f":"T97-HLOOKUP(X97,#REF!,9,FALSE)","v":{"$error":"#REF!"}},null,null,null,null,null,null,null,{"$error":"#REF!"}]
["H","N","IDF",17,377315,"CAGNY","RAFAEL",2003,50.7,"FRANCONVILLE","F",21,-23,-23,21,20,22,23,45,66,111.73874837601387,15.299999999999997,null,{"$f":"IF(A98=\"F\",(IF(OR(H98>2001,H98<2004),VLOOKUP(I98,Feuil1!$G$11:$H$25,2))),IF(A98=\"H\",(IF(OR(H98>2001,H98<2004),VLOOKUP(I98,Feuil1!$A$11:$F$29,2)))))","v":"M56"},null,{"$f":"T98-HLOOKUP(X98,#REF!,2,FALSE)","v":{"$error":"#REF!"}},{"$f":"T98-HLOOKUP(X98,#REF!,3,FALSE)","v":{"$error":"#REF!"}},{"$f":"T98-HLOOKUP(X98,#REF!,4,FALSE)","v":{"$error":"#REF!"}},{"$f":"T98-HLOOKUP(X98,#REF!,5,FALSE)","v":{"$error":"#REF!"}},{"$f":"T98-HLOOKUP(X98,#REF!,6,FALSE)","v":{"$error":"#REF!"}},{"$f":"T98-HLOOKUP(X98,#REF!,7,FALSE)","v":{"$error":"#REF!"}},{"$f":"T98-HLOOKUP(X98,#REF!,8,FALSE)","v":{"$error":"#REF!"}},{"$f":"T98-HLOOKUP(X98,#REF!,9,FALSE)","v":{"$error":"#REF!"}},null,null,null,null,null,null,null,{"$error":"#REF!"}]
["H","CO","HNO",18,375036,"Dubuisson","florian",2002,50.4,"CHM Le Trait","F",8,10,12,22,15,17,19,36,58,98.693847649150044,7.6000000000000014,null,{"$f":"IF(A99=\"F\",(IF(OR(H99>2001,H99<2004),VLOOKUP(I99,Feuil1!$G$11:$H$25,2))),IF(A99=\"H\",(IF(OR(H99>2001,H99<2004),VLOOKUP(I99,Feuil1!$A$11:$F$29,2)))))","v":"M56"},null,{"$f":"T99-HLOOKUP(X99,#REF!,2,FALSE)","v":{"$error":"#REF!"}},{"$f":"T99-HLOOKUP(X99,#REF!,3,FALSE)","v":{"$error":"#REF!"}},{"$f":"T99-HLOOKUP(X99,#REF!,4,FALSE)","v":{"$error":"#REF!"}},{"$f":"T99-HLOOKUP(X99,#REF!,5,FALSE)","v":{"$error":"#REF!"}},{"$f":"T99-HLOOKUP(X99,#REF!,6,FALSE)","v":{"$error":"#REF!"}},{"$f":"T99-HLOOKUP(X99,#REF!,7,FALSE)","v":{"$error":"#REF!"}},{"$f":"T99-HLOOKUP(X99,#REF!,8,FALSE)","v":{"$error":"#REF!"}},{"$f":"T99-HLOOKUP(X99,#REF!,9,FALSE)","v":{"$error":"#REF!"}},null,null,null,null,null,null,null,{"$error":"#REF!"}]
[null,null,null,null,null,null,null,null,null,null,null,null,null,null,null,null,null,null,null,null,null,null,null,null,null,{"$f":"T100-HLOOKUP(X100,#REF!,2,FALSE)","v":{"$error":"#REF!"}},{"$f":"T100-HLOOKUP(X100,#REF!,3,FALSE)","v":{"$error":"#REF!"}},{"$f":"T100-HLOOKUP(X100,#REF!,4,FALSE)","v":{"$error":"#REF!"}},{"$f":"T100-HLOOKUP(X100,#REF!,5,FALSE)","v":{"$error":"#REF!"}},{"$f":"T100-HLOOKUP(X100,#REF!,6,FALSE)","v":{"$error":"#REF!"}},{"$f":"T100-HLOOKUP(X100,#REF!,7,FALSE)","v":{"$error":"#REF!"}},{"$f":"T100-HLOOKUP(X100,#REF!,8,FALSE)","v":{"$error":"#REF!"}},{"$f":"T100-HLOOKUP(X100,#REF!,9,FALSE)","v":{"$error":"#REF!"}},null,null,null,null,null,null,null,{"$f":"IF(AG100>=0,$AG$4,IF(AF100>=0,$AF$4,IF(AE100>=0,$AE$4,IF(AD100>=0,$AD$4,IF(AC100>=0,$AC$4,IF(AB100>=0,$AB$4,IF(AA100>=0,$AA$4,IF(Z100>=0,$Z$4,$AH$4))))))))","v":{"$error":"#REF!"}}]
["H","NE","BOU",1,363266,"GRAILLOT","Jessy",2003,58.4,"HMDB21","F",36,38,40,{"$f":"IF(MAXA(L101+M101,M101+N101,L101+N101,L101,M101,N101)<=0,0,MAXA(L101+M101,M101+N101,L101+N101,L101,M101,N101))","v":78},46,48,50,{"$f":"IF(MAXA(P101+Q101,Q101+R101,P101+R101,P101,Q101,R101)<=0,0,MAXA(P101+Q101,Q101+R101,P101+R101,P101,Q101,R101))","v":98},{"$f":"IF(H101=\"\",\"\",IF(OR(O101=0,S101=0),0,O101+S101))","v":176},{"$f":"IF(I101=\"\",\"\",IF(A101=\"H\",10^(0.794358141*LOG(I101/174.393)^2)*T101,IF(A101=\"F\",10^(0.89726074 * LOG(I101/148.026)^2)*T101,\"\")))","v":265.96679781129546},{"$f":"SUM(T101-I101)","v":117.6},null,{"$f":"IF(A101=\"F\",(IF(OR(H101>2001,H101<2004),VLOOKUP(I101,Feuil1!$G$11:$H$25,2))),IF(A101=\"H\",(IF(OR(H101>2001,H101<2004),VLOOKUP(I101,Feuil1!$A$11:$F$29,2)))))","v":"M62"},null,{"$f":"T101-HLOOKUP(X101,#REF!,2,FALSE)","v":{"$error":"#REF!"}},{"$f":"T101-HLOOKUP(X101,#REF!,3,FALSE)","v":{"$error":"#REF!"}},{"$f":"T101-HLOOKUP(X101,#REF!,4,FALSE)","v":{"$error":"#REF!"}},{"$f":"T101-HLOOKUP(X101,#REF!,5,FALSE)","v":{"$error":"#REF!"}},{"$f":"T101-HLOOKUP(X101,#REF!,6,FALSE)","v":{"$error":"#REF!"}},{"$f":"T101-HLOOKUP(X101,#REF!,7,FALSE)","v":{"$error":"#REF!"}},{"$f":"T101-HLOOKUP(X101,#REF!,8,FALSE)","v":{"$error":"#REF!"}},{"$f":"T101-HLOOKUP(X101,#REF!,9,FALSE)","v":{"$error":"#REF!"}},null,null,null,null,null,null,null,{"$f":"IF(AG101>=0,$AG$4,IF(AF101>=0,$AF$4,IF(AE101>=0,$AE$4,IF(AD101>=0,$AD$4,IF(AC101>=0,$AC$4,IF(AB101>=0,$AB$4,IF(AA101>=0,$AA$4,IF(Z101>=0,$Z$4,$AH$4))))))))","v":{"$error":"#REF!"}}]
["H","CO","BRE",2,360832,"BERTHE","Thibaut",2002,59.75,"AL QUIMPER","F",36,38,40,78,44,46,48,94,172,255.52286575715945,112.25,null,{"$f":"IF(A102=\"F\",(IF(OR(H102>2001,H102<2004),VLOOKUP(I102,Feuil1!$G$11:$H$25,2))),IF(A102=\"H\",(IF(OR(H102>2001,H102<2004),VLOOKUP(I102,Feuil1!$A$11:$F$29,2)))))","v":"M62"},null,{"$f":"T102-HLOOKUP(X102,#REF!,2,FALSE)","v":{"$error":"#REF!"}},{"$f":"T102-HLOOKUP(X102,#REF!,3,FALSE)","v":{"$error":"#REF!"}},{"$f":"T102-HLOOKUP(X102,#REF!,4,FALSE)","v":{"$error":"#REF!"}},{"$f":"T102-HLOOKUP(X102,#REF!,5,FALSE)","v":{"$error":"#REF!"}},{"$f":"T102-HLOOKUP(X102,#REF!,6,FALSE)","v":{"$error":"#REF!"}},{"$f":"T102-HLOOKUP(X102,#REF!,7,FALSE)","v":{"$error":"#REF!"}},{"$f":"T102-HLOOKUP(X102,#REF!,8,FALSE)","v":{"$error":"#REF!"}},{"$f":"T102-HLOOKUP(X102,#REF!,9,FALSE)","v":{"$error":"#REF!"}},null,null,null,null,null,null,null,{"$error":"#REF!"}]
["H","NORD","PIC",3,376294,"HULOT","Charles",2002,61.7,"Roisel CHFM","F",27,28,29,57,32,33,34,67,124,179.95740364442889,62.3,null,{"$f":"IF(A103=\"F\",(IF(OR(H103>2001,H103<2004),VLOOKUP(I103,Feuil1!$G$11:$H$25,2))),IF(A103=\"H\",(IF(OR(H103>2001,H103<2004),VLOOKUP(I103,Feuil1!$A$11:$F$29,2)))))","v":"M62"},null,{"$f":"T103-HLOOKUP(X103,#REF!,2,FALSE)","v":{"$error":"#REF!"}},{"$f":"T103-HLOOKUP(X103,#REF!,3,FALSE)","v":{"$error":"#REF!"}},{"$f":"T103-HLOOKUP(X103,#REF!,4,FALSE)","v":{"$error":"#REF!"}},{"$f":"T103-HLOOKUP(X103,#REF!,5,FALSE)","v":{"$error":"#REF!"}},{"$f":"T103-HLOOKUP(X103,#REF!,6,FALSE)","v":{"$error":"#REF!"}},{"$f":"T103-HLOOKUP(X103,#REF!,7,FALSE)","v":{"$error":"#REF!"}},{"$f":"T103-HLOOKUP(X103,#REF!,8,FALSE)","v":{"$error":"#REF!"}},{"$f":"T103-HLOOKUP(X103,#REF!,9,FALSE)","v":{"$error":"#REF!"}},null,null,null,null,null,null,null,{"$error":"#REF!"}]
["H","DOM","REU",4,374356,"BARDEUR","JULIEN",2002,56.23,"CH TAMPON","F",23,25,27,52,30,32,34,66,118,183.57963354684307,61.77,null,{"$f":"IF(A104=\"F\",(IF(OR(H104>2001,H104<2004),VLOOKUP(I104,Feuil1!$G$11:$H$25,2))),IF(A104=\"H\",(IF(OR(H104>2001,H104<2004),VLOOKUP(I104,Feuil1!$A$11:$F$29,2)))))","v":"M62"},null,{"$f":"T104-HLOOKUP(X104,#REF!,2,FALSE)","v":{"$error":"#REF!"}},{"$f":"T104-HLOOKUP(X104,#REF!,3,FALSE)","v":{"$error":"#REF!"}},{"$f":"T104-HLOOKUP(X104,#REF!,4,FALSE)","v":{"$error":"#REF!"}},{"$f":"T104-HLOOKUP(X104,#REF!,5,FALSE)","v":{"$error":"#REF!"}},{"$f":"T104-HLOOKUP(X104,#REF!,6,FALSE)","v":{"$error":"#REF!"}},{"$f":"T104-HLOOKUP(X104,#REF!,7,FALSE)","v":{"$error":"#REF!"}},{"$f":"T104-HLOOKUP(X104,#REF!,8,FALSE)","v":{"$error":"#REF!"}},{"$f":"T104-HLOOKUP(X104,#REF!,9,FALSE)","v":{"$error":"#REF!"}},null,null,null,null,null,null,null,{"$error":"#REF!"}]
["H","SO","MPY",5,368450,"DURETELLE DE ST SAUVEUR","Valentin",2003,57.2,"ALBI HC","F",23,25,27,52,28,30,-32,58,110,168.87997034772019,52.8,null,{"$f":"IF(A105=\"F\",(IF(OR(H105>2001,H105<2004),VLOOKUP(I105,Feuil1!$G$11:$H$25,2))),IF(A105=\"H\",(IF(OR(H105>2001,H105<2004),VLOOKUP(I105,Feuil1!$A$11:$F$29,2)))))","v":"M62"},null,{"$f":"T105-HLOOKUP(X105,#REF!,2,FALSE)","v":{"$error":"#REF!"}},{"$f":"T105-HLOOKUP(X105,#REF!,3,FALSE)","v":{"$error":"#REF!"}},{"$f":"T105-HLOOKUP(X105,#REF!,4,FALSE)","v":{"$error":"#REF!"}},{"$f":"T105-HLOOKUP(X105,#REF!,5,FALSE)","v":{"$error":"#REF!"}},{"$f":"T105-HLOOKUP(X105,#REF!,6,FALSE)","v":{"$error":"#REF!"}},{"$f":"T105-HLOOKUP(X105,#REF!,7,FALSE)","v":{"$error":"#REF!"}},{"$f":"T105-HLOOKUP(X105,#REF!,8,FALSE)","v":{"$error":"#REF!"}},{"$f":"T105-HLOOKUP(X105,#REF!,9,FALSE)","v":{"$error":"#REF!"}},null,null,null,null,null,null,null,{"$error":"#REF!"}]
["H","NORD","PIC",6,376940,"LEVIONNOIS","Nicolas",2002,61.9,"La Ferté Milon CMHM","F",20,22,24,46,25,27,29,56,102,147.68697134133424,40.1,null,{"$f":"IF(A106=\"F\",(IF(OR(H106>2001,H106<2004),VLOOKUP(I106,Feuil1!$G$11:$H$25,2))),IF(A106=\"H\",(IF(OR(H106>2001,H106<2004),VLOOKUP(I106,Feuil1!$A$11:$F$29,2)))))","v":"M62"},null,{"$f":"T106-HLOOKUP(X106,#REF!,2,FALSE)","v":{"$error":"#REF!"}},{"$f":"T106-HLOOKUP(X106,#REF!,3,FALSE)","v":{"$error":"#REF!"}},{"$f":"T106-HLOOKUP(X106,#REF!,4,FALSE)","v":{"$error":"#REF!"}},{"$f":"T106-HLOOKUP(X106,#REF!,5,FALSE)","v":{"$error":"#REF!"}},{"$f":"T106-HLOOKUP(X106,#REF!,6,FALSE)","v":{"$error":"#REF!"}},{"$f":"T106-HLOOKUP(X106,#REF!,7,FALSE)","v":{"$error":"#REF!"}},{"$f":"T106-HLOOKUP(X106,#REF!,8,FALSE)","v":{"$error":"#REF!"}},{"$f":"T106-HLOOKUP(X106,#REF!,9,FALSE)","v":{"$error":"#REF!"}},null,null,null,null,null,null,null,{"$error":"#REF!"}]
["H","N","IDF",7,335746,"FAOUZI","BASSAM",2002,61.8,"CACHAN","F",18,20,22,42,26,28,30,58,100,144.9586793921076,38.200000000000003,null,{"$f":"IF(A107=\"F\",(IF(OR(H107>2001,H107<2004),VLOOKUP(I107,Feuil1!$G$11:$H$25,2))),IF(A107=\"H\",(IF(OR(H107>2001,H107<2004),VLOOKUP(I107,Feuil1!$A$11:$F$29,2)))))","v":"M62"},null,{"$f":"T107-HLOOKUP(X107,#REF!,2,FALSE)","v":{"$error":"#REF!"}},{"$f":"T107-HLOOKUP(X107,#REF!,3,FALSE)","v":{"$error":"#REF!"}},{"$f":"T107-HLOOKUP(X107,#REF!,4,FALSE)","v":{"$error":"#REF!"}},{"$f":"T107-HLOOKUP(X107,#REF!,5,FALSE)","v":{"$error":"#REF!"}},{"$f":"T107-HLOOKUP(X107,#REF!,6,FALSE)","v":{"$error":"#REF!"}},{"$f":"T107-HLOOKUP(X107,#REF!,7,FALSE)","v":{"$error":"#REF!"}},{"$f":"T107-HLOOKUP(X107,#REF!,8,FALSE)","v":{"$error":"#REF!"}},{"$f":"T107-HLOOKUP(X107,#REF!,9,FALSE)","v":{"$error":"#REF!"}},null,null,null,null,null,null,null,{"$error":"#REF!"}]
["H","NORD","PIC",8,379759,"MARCHANDISE","Timéo",2002,61.6,"La Vaillante Saint Quentin","F",18,20,22,42,24,26,28,54,96,139.48409252360611,34.4,null,{"$f":"IF(A108=\"F\",(IF(OR(H108>2001,H108<2004),VLOOKUP(I108,Feuil1!$G$11:$H$25,2))),IF(A108=\"H\",(IF(OR(H108>2001,H108<2004),VLOOKUP(I108,Feuil1!$A$11:$F$29,2)))))","v":"M62"},null,{"$f":"T108-HLOOKUP(X108,#REF!,2,FALSE)","v":{"$error":"#REF!"}},{"$f":"T108-HLOOKUP(X108,#REF!,3,FALSE)","v":{"$error":"#REF!"}},{"$f":"T108-HLOOKUP(X108,#REF!,4,FALSE)","v":{"$error":"#REF!"}},{"$f":"T108-HLOOKUP(X108,#REF!,5,FALSE)","v":{"$error":"#REF!"}},{"$f":"T108-HLOOKUP(X108,#REF!,6,FALSE)","v":{"$error":"#REF!"}},{"$f":"T108-HLOOKUP(X108,#REF!,7,FALSE)","v":{"$error":"#REF!"}},{"$f":"T108-HLOOKUP(X108,#REF!,8,FALSE)","v":{"$error":"#REF!"}},{"$f":"T108-HLOOKUP(X108,#REF!,9,FALSE)","v":{"$error":"#REF!"}},null,null,null,null,null,null,null,{"$error":"#REF!"}]
["H","CO","CEN",9,381199,"AUBRY","Tanguy",2003,57.9,"AAJ BLOIS","F",17,18,21,39,25,27,28,55,94,142.97905337164084,36.1,null,{"$f":"IF(A109=\"F\",(IF(OR(H109>2001,H109<2004),VLOOKUP(I109,Feuil1!$G$11:$H$25,2))),IF(A109=\"H\",(IF(OR(H109>2001,H109<2004),VLOOKUP(I109,Feuil1!$A$11:$F$29,2)))))","v":"M62"},null,{"$f":"T109-HLOOKUP(X109,#REF!,2,FALSE)","v":{"$error":"#REF!"}},{"$f":"T109-HLOOKUP(X109,#REF!,3,FALSE)","v":{"$error":"#REF!"}},{"$f":"T109-HLOOKUP(X109,#REF!,4,FALSE)","v":{"$error":"#REF!"}},{"$f":"T109-HLOOKUP(X109,#REF!,5,FALSE)","v":{"$error":"#REF!"}},{"$f":"T109-HLOOKUP(X109,#REF!,6,FALSE)","v":{"$error":"#REF!"}},{"$f":"T109-HLOOKUP(X109,#REF!,7,FALSE)","v":{"$error":"#REF!"}},{"$f":"T109-HLOOKUP(X109,#REF!,8,FALSE)","v":{"$error":"#REF!"}},{"$f":"T109-HLOOKUP(X109,#REF!,9,FALSE)","v":{"$error":"#REF!"}},null,null,null,null,null,null,null,{"$error":"#REF!"}]
["H","CO","BRE",10,380250,"RATON","Killian",2002,58.5,"AL QUIMPER","F",18,20,22,42,24,-26,26,50,92,138.84881364620151,33.5,null,{"$f":"IF(A110=\"F\",(IF(OR(H110>2001,H110<2004),VLOOKUP(I110,Feuil1!$G$11:$H$25,2))),IF(A110=\"H\",(IF(OR(H110>2001,H110<2004),VLOOKUP(I110,Feuil1!$A$11:$F$29,2)))))","v":"M62"},null,{"$f":"T110-HLOOKUP(X110,#REF!,2,FALSE)","v":{"$error":"#REF!"}},{"$f":"T110-HLOOKUP(X110,#REF!,3,FALSE)","v":{"$error":"#REF!"}},{"$f":"T110-HLOOKUP(X110,#REF!,4,FALSE)","v":{"$error":"#REF!"}},{"$f":"T110-HLOOKUP(X110,#REF!,5,FALSE)","v":{"$error":"#REF!"}},{"$f":"T110-HLOOKUP(X110,#REF!,6,FALSE)","v":{"$error":"#REF!"}},{"$f":"T110-HLOOKUP(X110,#REF!,7,FALSE)","v":{"$error":"#REF!"}},{"$f":"T110-HLOOKUP(X110,#REF!,8,FALSE)","v":{"$error":"#REF!"}},{"$f":"T110-HLOOKUP(X110,#REF!,9,FALSE)","v":{"$error":"#REF!"}},null,null,null,null,null,null,null,{"$error":"#REF!"}]
["H","SEST","RAL",11,380145,"DUFFEZ","Quentin",2002,59.5,"L'ARBRESLE","F",15,17,19,36,25,27,29,56,92,137.10003472884048,32.5,null,{"$f":"IF(A111=\"F\",(IF(OR(H111>2001,H111<2004),VLOOKUP(I111,Feuil1!$G$11:$H$25,2))),IF(A111=\"H\",(IF(OR(H111>2001,H111<2004),VLOOKUP(I111,Feuil1!$A$11:$F$29,2)))))","v":"M62"},null,{"$f":"T111-HLOOKUP(X111,#REF!,2,FALSE)","v":{"$error":"#REF!"}},{"$f":"T111-HLOOKUP(X111,#REF!,3,FALSE)","v":{"$error":"#REF!"}},{"$f":"T111-HLOOKUP(X111,#REF!,4,FALSE)","v":{"$error":"#REF!"}},{"$f":"T111-HLOOKUP(X111,#REF!,5,FALSE)","v":{"$error":"#REF!"}},{"$f":"T111-HLOOKUP(X111,#REF!,6,FALSE)","v":{"$error":"#REF!"}},{"$f":"T111-HLOOKUP(X111,#REF!,7,FALSE)","v":{"$error":"#REF!"}},{"$f":"T111-HLOOKUP(X111,#REF!,8,FALSE)","v":{"$error":"#REF!"}},{"$f":"T111-HLOOKUP(X111,#REF!,9,FALSE)","v":{"$error":"#REF!"}},null,null,null,null,null,null,null,{"$error":"#REF!"}]
["H","SE","PRO",12,377629,"CEBE","Albin",2003,56.9,"EEAR MONTEUX","F",20,20,20,40,22,23,25,48,88,135.6528210870149,31.1,null,{"$f":"IF(A112=\"F\",(IF(OR(H112>2001,H112<2004),VLOOKUP(I112,Feuil1!$G$11:$H$25,2))),IF(A112=\"H\",(IF(OR(H112>2001,H112<2004),VLOOKUP(I112,Feuil1!$A$11:$F$29,2)))))","v":"M62"},null,{"$f":"T112-HLOOKUP(X112,#REF!,2,FALSE)","v":{"$error":"#REF!"}},{"$f":"T112-HLOOKUP(X112,#REF!,3,FALSE)","v":{"$error":"#REF!"}},{"$f":"T112-HLOOKUP(X112,#REF!,4,FALSE)","v":{"$error":"#REF!"}},{"$f":"T112-HLOOKUP(X112,#REF!,5,FALSE)","v":{"$error":"#REF!"}},{"$f":"T112-HLOOKUP(X112,#REF!,6,FALSE)","v":{"$error":"#REF!"}},{"$f":"T112-HLOOKUP(X112,#REF!,7,FALSE)","v":{"$error":"#REF!"}},{"$f":"T112-HLOOKUP(X112,#REF!,8,FALSE)","v":{"$error":"#REF!"}},{"$f":"T112-HLOOKUP(X112,#REF!,9,FALSE)","v":{"$error":"#REF!"}},null,null,null,null,null,null,null,{"$error":"#REF!"}]
["H","SE","PRO",13,374428,"BOGUCKI","Vicent",2002,60.7,"ISTRES SPORTS","F",15,17,18,35,20,22,24,46,81,118.94892106987177,20.299999999999997,null,{"$f":"IF(A113=\"F\",(IF(OR(H113>2001,H113<2004),VLOOKUP(I113,Feuil1!$G$11:$H$25,2))),IF(A113=\"H\",(IF(OR(H113>2001,H113<2004),VLOOKUP(I113,Feuil1!$A$11:$F$29,2)))))","v":"M62"},null,{"$f":"T113-HLOOKUP(X113,#REF!,2,FALSE)","v":{"$error":"#REF!"}},{"$f":"T113-HLOOKUP(X113,#REF!,3,FALSE)","v":{"$error":"#REF!"}},{"$f":"T113-HLOOKUP(X113,#REF!,4,FALSE)","v":{"$error":"#REF!"}},{"$f":"T113-HLOOKUP(X113,#REF!,5,FALSE)","v":{"$error":"#REF!"}},{"$f":"T113-HLOOKUP(X113,#REF!,6,FALSE)","v":{"$error":"#REF!"}},{"$f":"T113-HLOOKUP(X113,#REF!,7,FALSE)","v":{"$error":"#REF!"}},{"$f":"T113-HLOOKUP(X113,#REF!,8,FALSE)","v":{"$error":"#REF!"}},{"$f":"T113-HLOOKUP(X113,#REF!,9,FALSE)","v":{"$error":"#REF!"}},null,null,null,null,null,null,null,{"$error":"#REF!"}]
["H","NORD","PIC",14,361096,"ROUSSEAU","Benjamin",2002,59.9,"La Vaillante Saint Quentin","F",9,11,12,23,11,13,15,28,51,75.625397835271784,-8.8999999999999986,null,{"$f":"IF(A114=\"F\",(IF(OR(H114>2001,H114<2004),VLOOKUP(I114,Feuil1!$G$11:$H$25,2))),IF(A114=\"H\",(IF(OR(H114>2001,H114<2004),VLOOKUP(I114,Feuil1!$A$11:$F$29,2)))))","v":"M62"},null,{"$f":"T114-HLOOKUP(X114,#REF!,2,FALSE)","v":{"$error":"#REF!"}},{"$f":"T114-HLOOKUP(X114,#REF!,3,FALSE)","v":{"$error":"#REF!"}},{"$f":"T114-HLOOKUP(X114,#REF!,4,FALSE)","v":{"$error":"#REF!"}},{"$f":"T114-HLOOKUP(X114,#REF!,5,FALSE)","v":{"$error":"#REF!"}},{"$f":"T114-HLOOKUP(X114,#REF!,6,FALSE)","v":{"$error":"#REF!"}},{"$f":"T114-HLOOKUP(X114,#REF!,7,FALSE)","v":{"$error":"#REF!"}},{"$f":"T114-HLOOKUP(X114,#REF!,8,FALSE)","v":{"$error":"#REF!"}},{"$f":"T114-HLOOKUP(X114,#REF!,9,FALSE)","v":{"$error":"#REF!"}},null,null,null,null,null,null,null,{"$error":"#REF!"}]
["H","SEST","CAZ",15,392293,"ABDOU LATIOFO","Dayane",2002,60.55,"HC NICE","F",-20,-20,-20,0,30,-32,-32,30,0,0,-60.55,null,{"$f":"IF(A115=\"F\",(IF(OR(H115>2001,H115<2004),VLOOKUP(I115,Feuil1!$G$11:$H$25,2))),IF(A115=\"H\",(IF(OR(H115>2001,H115<2004),VLOOKUP(I115,Feuil1!$A$11:$F$29,2)))))","v":"M62"},null,{"$f":"T115-HLOOKUP(X115,#REF!,2,FALSE)","v":{"$error":"#REF!"}},{"$f":"T115-HLOOKUP(X115,#REF!,3,FALSE)","v":{"$error":"#REF!"}},{"$f":"T115-HLOOKUP(X115,#REF!,4,FALSE)","v":{"$error":"#REF!"}},{"$f":"T115-HLOOKUP(X115,#REF!,5,FALSE)","v":{"$error":"#REF!"}},{"$f":"T115-HLOOKUP(X115,#REF!,6,FALSE)","v":{"$error":"#REF!"}},{"$f":"T115-HLOOKUP(X115,#REF!,7,FALSE)","v":{"$error":"#REF!"}},{"$f":"T115-HLOOKUP(X115,#REF!,8,FALSE)","v":{"$error":"#REF!"}},{"$f":"T115-HLOOKUP(X115,#REF!,9,FALSE)","v":{"$error":"#REF!"}},null,null,null,null,null,null,null,{"$error":"#REF!"}]
[null,null,null,null,null,null,null,null,null,null,null,null,null,null,null,null,null,null,null,null,null,null,null,null,null,{"$f":"T116-HLOOKUP(X116,#REF!,2,FALSE)","v":{"$error":"#REF!"}},{"$f":"T116-HLOOKUP(X116,#REF!,3,FALSE)","v":{"$error":"#REF!"}},{"$f":"T116-HLOOKUP(X116,#REF!,4,FALSE)","v":{"$error":"#REF!"}},{"$f":"T116-HLOOKUP(X116,#REF!,5,FALSE)","v":{"$error":"#REF!"}},{"$f":"T116-HLOOKUP(X116,#REF!,6,FALSE)","v":{"$error":"#REF!"}},{"$f":"T116-HLOOKUP(X116,#REF!,7,FALSE)","v":{"$error":"#REF!"}},{"$f":"T116-HLOOKUP(X116,#REF!,8,FALSE)","v":{"$error":"#REF!"}},{"$f":"T116-HLOOKUP(X116,#REF!,9,FALSE)","v":{"$error":"#REF!"}},null,null,null,null,null,null,null,{"$f":"IF(AG116>=0,$AG$4,IF(AF116>=0,$AF$4,IF(AE116>=0,$AE$4,IF(AD116>=0,$AD$4,IF(AC116>=0,$AC$4,IF(AB116>=0,$AB$4,IF(AA116>=0,$AA$4,IF(Z116>=0,$Z$4,$AH$4))))))))","v":{"$error":"#REF!"}}]
["H","CO","BRE",1,360255,"BERTHE","Maxence",2003,62.45,"AL QUIMPER","F",35,37,-38,{"$f":"IF(MAXA(L117+M117,M117+N117,L117+N117,L117,M117,N117)<=0,0,MAXA(L117+M117,M117+N117,L117+N117,L117,M117,N117))","v":72},44,46,47,{"$f":"IF(MAXA(P117+Q117,Q117+R117,P117+R117,P117,Q117,R117)<=0,0,MAXA(P117+Q117,Q117+R117,P117+R117,P117,Q117,R117))","v":93},{"$f":"IF(H117=\"\",\"\",IF(OR(O117=0,S117=0),0,O117+S117))","v":165},{"$f":"IF(I117=\"\",\"\",IF(A117=\"H\",10^(0.794358141*LOG(I117/174.393)^2)*T117,IF(A117=\"F\",10^(0.89726074 * LOG(I117/148.026)^2)*T117,\"\")))","v":237.40621459370828},{"$f":"SUM(T117-I117)","v":102.55},null,{"$f":"IF(A117=\"F\",(IF(OR(H117>2001,H117<2004),VLOOKUP(I117,Feuil1!$G$11:$H$25,2))),IF(A117=\"H\",(IF(OR(H117>2001,H117<2004),VLOOKUP(I117,Feuil1!$A$11:$F$29,2)))))","v":"M69"},null,{"$f":"T117-HLOOKUP(X117,#REF!,2,FALSE)","v":{"$error":"#REF!"}},{"$f":"T117-HLOOKUP(X117,#REF!,3,FALSE)","v":{"$error":"#REF!"}},{"$f":"T117-HLOOKUP(X117,#REF!,4,FALSE)","v":{"$error":"#REF!"}},{"$f":"T117-HLOOKUP(X117,#REF!,5,FALSE)","v":{"$error":"#REF!"}},{"$f":"T117-HLOOKUP(X117,#REF!,6,FALSE)","v":{"$error":"#REF!"}},{"$f":"T117-HLOOKUP(X117,#REF!,7,FALSE)","v":{"$error":"#REF!"}},{"$f":"T117-HLOOKUP(X117,#REF!,8,FALSE)","v":{"$error":"#REF!"}},{"$f":"T117-HLOOKUP(X117,#REF!,9,FALSE)","v":{"$error":"#REF!"}},null,null,null,null,null,null,null,{"$f":"IF(AG117>=0,$AG$4,IF(AF117>=0,$AF$4,IF(AE117>=0,$AE$4,IF(AD117>=0,$AD$4,IF(AC117>=0,$AC$4,IF(AB117>=0,$AB$4,IF(AA117>=0,$AA$4,IF(Z117>=0,$Z$4,$AH$4))))))))","v":{"$error":"#REF!"}}]
["H","NE","BOU",2,339088,"CONNAN","Killyan",2003,67.2,"Mont de Rême","F",28,30,32,62,38,40,42,82,144,197.06859001560275,76.8,null,{"$f":"IF(A118=\"F\",(IF(OR(H118>2001,H118<2004),VLOOKUP(I118,Feuil1!$G$11:$H$25,2))),IF(A118=\"H\",(IF(OR(H118>2001,H118<2004),VLOOKUP(I118,Feuil1!$A$11:$F$29,2)))))","v":"M69"},null,{"$f":"T118-HLOOKUP(X118,#REF!,2,FALSE)","v":{"$error":"#REF!"}},{"$f":"T118-HLOOKUP(X118,#REF!,3,FALSE)","v":{"$error":"#REF!"}},{"$f":"T118-HLOOKUP(X118,#REF!,4,FALSE)","v":{"$error":"#REF!"}},{"$f":"T118-HLOOKUP(X118,#REF!,5,FALSE)","v":{"$error":"#REF!"}},{"$f":"T118-HLOOKUP(X118,#REF!,6,FALSE)","v":{"$error":"#REF!"}},{"$f":"T118-HLOOKUP(X118,#REF!,7,FALSE)","v":{"$error":"#REF!"}},{"$f":"T118-HLOOKUP(X118,#REF!,8,FALSE)","v":{"$error":"#REF!"}},{"$f":"T118-HLOOKUP(X118,#REF!,9,FALSE)","v":{"$error":"#REF!"}},null,null,null,null,null,null,null,{"$error":"#REF!"}]
["H","SEST","RAL",3,356458,"REYNAUD","Quentin",2002,66.900000000000006,"HF Péageois","F",28,30,32,62,38,40,-42,78,140,192.16067438546142,73.099999999999994,null,{"$f":"IF(A119=\"F\",(IF(OR(H119>2001,H119<2004),VLOOKUP(I119,Feuil1!$G$11:$H$25,2))),IF(A119=\"H\",(IF(OR(H119>2001,H119<2004),VLOOKUP(I119,Feuil1!$A$11:$F$29,2)))))","v":"M69"},null,{"$f":"T119-HLOOKUP(X119,#REF!,2,FALSE)","v":{"$error":"#REF!"}},{"$f":"T119-HLOOKUP(X119,#REF!,3,FALSE)","v":{"$error":"#REF!"}},{"$f":"T119-HLOOKUP(X119,#REF!,4,FALSE)","v":{"$error":"#REF!"}},{"$f":"T119-HLOOKUP(X119,#REF!,5,FALSE)","v":{"$error":"#REF!"}},{"$f":"T119-HLOOKUP(X119,#REF!,6,FALSE)","v":{"$error":"#REF!"}},{"$f":"T119-HLOOKUP(X119,#REF!,7,FALSE)","v":{"$error":"#REF!"}},{"$f":"T119-HLOOKUP(X119,#REF!,8,FALSE)","v":{"$error":"#REF!"}},{"$f":"T119-HLOOKUP(X119,#REF!,9,FALSE)","v":{"$error":"#REF!"}},null,null,null,null,null,null,null,{"$error":"#REF!"}]
["H","NORD","PIC",4,376294,"HULOT","Charles",2002,63.8,"Roisel CHFM","F",22,24,26,50,30,32,34,66,116,164.41951656225859,52.2,null,{"$f":"IF(A120=\"F\",(IF(OR(H120>2001,H120<2004),VLOOKUP(I120,Feuil1!$G$11:$H$25,2))),IF(A120=\"H\",(IF(OR(H120>2001,H120<2004),VLOOKUP(I120,Feuil1!$A$11:$F$29,2)))))","v":"M69"},null,{"$f":"T120-HLOOKUP(X120,#REF!,2,FALSE)","v":{"$error":"#REF!"}},{"$f":"T120-HLOOKUP(X120,#REF!,3,FALSE)","v":{"$error":"#REF!"}},{"$f":"T120-HLOOKUP(X120,#REF!,4,FALSE)","v":{"$error":"#REF!"}},{"$f":"T120-HLOOKUP(X120,#REF!,5,FALSE)","v":{"$error":"#REF!"}},{"$f":"T120-HLOOKUP(X120,#REF!,6,FALSE)","v":{"$error":"#REF!"}},{"$f":"T120-HLOOKUP(X120,#REF!,7,FALSE)","v":{"$error":"#REF!"}},{"$f":"T120-HLOOKUP(X120,#REF!,8,FALSE)","v":{"$error":"#REF!"}},{"$f":"T120-HLOOKUP(X120,#REF!,9,FALSE)","v":{"$error":"#REF!"}},null,null,null,null,null,null,null,{"$error":"#REF!"}]
["H","N","IDF",5,335746,"FAOUZI","BASSAM",2002,63.2,"CACHAN","F",21,23,25,48,30,32,34,66,114,162.65248658032669,50.8,null,{"$f":"IF(A121=\"F\",(IF(OR(H121>2001,H121<2004),VLOOKUP(I121,Feuil1!$G$11:$H$25,2))),IF(A121=\"H\",(IF(OR(H121>2001,H121<2004),VLOOKUP(I121,Feuil1!$A$11:$F$29,2)))))","v":"M69"},null,{"$f":"T121-HLOOKUP(X121,#REF!,2,FALSE)","v":{"$error":"#REF!"}},{"$f":"T121-HLOOKUP(X121,#REF!,3,FALSE)","v":{"$error":"#REF!"}},{"$f":"T121-HLOOKUP(X121,#REF!,4,FALSE)","v":{"$error":"#REF!"}},{"$f":"T121-HLOOKUP(X121,#REF!,5,FALSE)","v":{"$error":"#REF!"}},{"$f":"T121-HLOOKUP(X121,#REF!,6,FALSE)","v":{"$error":"#REF!"}},{"$f":"T121-HLOOKUP(X121,#REF!,7,FALSE)","v":{"$error":"#REF!"}},{"$f":"T121-HLOOKUP(X121,#REF!,8,FALSE)","v":{"$error":"#REF!"}},{"$f":"T121-HLOOKUP(X121,#REF!,9,FALSE)","v":{"$error":"#REF!"}},null,null,null,null,null,null,null,{"$error":"#REF!"}]
["H","N","IDF",6,383960,"KAADOUD","ADAM",2002,68.099999999999994,"CACHAN","F",12,14,16,30,17,19,-20,36,66,89.541353528204283,-2.0999999999999943,null,{"$f":"IF(A122=\"F\",(IF(OR(H122>2001,H122<2004),VLOOKUP(I122,Feuil1!$G$11:$H$25,2))),IF(A122=\"H\",(IF(OR(H122>2001,H122<2004),VLOOKUP(I122,Feuil1!$A$11:$F$29,2)))))","v":"M69"},null,{"$f":"T122-HLOOKUP(X122,#REF!,2,FALSE)","v":{"$error":"#REF!"}},{"$f":"T122-HLOOKUP(X122,#REF!,3,FALSE)","v":{"$error":"#REF!"}},{"$f":"T122-HLOOKUP(X122,#REF!,4,FALSE)","v":{"$error":"#REF!"}},{"$f":"T122-HLOOKUP(X122,#REF!,5,FALSE)","v":{"$error":"#REF!"}},{"$f":"T122-HLOOKUP(X122,#REF!,6,FALSE)","v":{"$error":"#REF!"}},{"$f":"T122-HLOOKUP(X122,#REF!,7,FALSE)","v":{"$error":"#REF!"}},{"$f":"T122-HLOOKUP(X122,#REF!,8,FALSE)","v":{"$error":"#REF!"}},{"$f":"T122-HLOOKUP(X122,#REF!,9,FALSE)","v":{"$error":"#REF!"}},null,null,null,null,null,null,null,{"$error":"#REF!"}]
["H","NORD","PIC",7,379759,"MARCHANDISE","Timéo",2002,62.9,"La Vaillante Saint Quentin","F",10,12,14,26,15,17,19,36,62,88.75607983049936,-0.89999999999999858,null,{"$f":"IF(A123=\"F\",(IF(OR(H123>2001,H123<2004),VLOOKUP(I123,Feuil1!$G$11:$H$25,2))),IF(A123=\"H\",(IF(OR(H123>2001,H123<2004),VLOOKUP(I123,Feuil1!$A$11:$F$29,2)))))","v":"M69"},null,{"$f":"T123-HLOOKUP(X123,#REF!,2,FALSE)","v":{"$error":"#REF!"}},{"$f":"T123-HLOOKUP(X123,#REF!,3,FALSE)","v":{"$error":"#REF!"}},{"$f":"T123-HLOOKUP(X123,#REF!,4,FALSE)","v":{"$error":"#REF!"}},{"$f":"T123-HLOOKUP(X123,#REF!,5,FALSE)","v":{"$error":"#REF!"}},{"$f":"T123-HLOOKUP(X123,#REF!,6,FALSE)","v":{"$error":"#REF!"}},{"$f":"T123-HLOOKUP(X123,#REF!,7,FALSE)","v":{"$error":"#REF!"}},{"$f":"T123-HLOOKUP(X123,#REF!,8,FALSE)","v":{"$error":"#REF!"}},{"$f":"T123-HLOOKUP(X123,#REF!,9,FALSE)","v":{"$error":"#REF!"}},null,null,null,null,null,null,null,{"$error":"#REF!"}]
[null,null,null,null,null,null,null,null,null,null,null,null,null,null,null,null,null,null,null,null,null,null,null,null,null,{"$f":"T124-HLOOKUP(X124,#REF!,2,FALSE)","v":{"$error":"#REF!"}},{"$f":"T124-HLOOKUP(X124,#REF!,3,FALSE)","v":{"$error":"#REF!"}},{"$f":"T124-HLOOKUP(X124,#REF!,4,FALSE)","v":{"$error":"#REF!"}},{"$f":"T124-HLOOKUP(X124,#REF!,5,FALSE)","v":{"$error":"#REF!"}},{"$f":"T124-HLOOKUP(X124,#REF!,6,FALSE)","v":{"$error":"#REF!"}},{"$f":"T124-HLOOKUP(X124,#REF!,7,FALSE)","v":{"$error":"#REF!"}},{"$f":"T124-HLOOKUP(X124,#REF!,8,FALSE)","v":{"$error":"#REF!"}},{"$f":"T124-HLOOKUP(X124,#REF!,9,FALSE)","v":{"$error":"#REF!"}},null,null,null,null,null,null,null,{"$f":"IF(AG124>=0,$AG$4,IF(AF124>=0,$AF$4,IF(AE124>=0,$AE$4,IF(AD124>=0,$AD$4,IF(AC124>=0,$AC$4,IF(AB124>=0,$AB$4,IF(AA124>=0,$AA$4,IF(Z124>=0,$Z$4,$AH$4))))))))","v":{"$error":"#REF!"}}]
["H","CO","BRE",1,357284,"BEGHAIN","Flavien",2002,71.7,"AL QUIMPER","F",40,42,44,{"$f":"IF(MAXA(L125+M125,M125+N125,L125+N125,L125,M125,N125)<=0,0,MAXA(L125+M125,M125+N125,L125+N125,L125,M125,N125))","v":86},50,52,54,{"$f":"IF(MAXA(P125+Q125,Q125+R125,P125+R125,P125,Q125,R125)<=0,0,MAXA(P125+Q125,Q125+R125,P125+R125,P125,Q125,R125))","v":106},{"$f":"IF(H125=\"\",\"\",IF(OR(O125=0,S125=0),0,O125+S125))","v":192},{"$f":"IF(I125=\"\",\"\",IF(A125=\"H\",10^(0.794358141*LOG(I125/174.393)^2)*T125,IF(A125=\"F\",10^(0.89726074 * LOG(I125/148.026)^2)*T125,\"\")))","v":252.15261775709604},{"$f":"SUM(T125-I125)","v":120.3},null,{"$f":"IF(A125=\"F\",(IF(OR(H125>2001,H125<2004),VLOOKUP(I125,Feuil1!$G$11:$H$25,2))),IF(A125=\"H\",(IF(OR(H125>2001,H125<2004),VLOOKUP(I125,Feuil1!$A$11:$F$29,2)))))","v":"M77"},null,{"$f":"T125-HLOOKUP(X125,#REF!,2,FALSE)","v":{"$error":"#REF!"}},{"$f":"T125-HLOOKUP(X125,#REF!,3,FALSE)","v":{"$error":"#REF!"}},{"$f":"T125-HLOOKUP(X125,#REF!,4,FALSE)","v":{"$error":"#REF!"}},{"$f":"T125-HLOOKUP(X125,#REF!,5,FALSE)","v":{"$error":"#REF!"}},{"$f":"T125-HLOOKUP(X125,#REF!,6,FALSE)","v":{"$error":"#REF!"}},{"$f":"T125-HLOOKUP(X125,#REF!,7,FALSE)","v":{"$error":"#REF!"}},{"$f":"T125-HLOOKUP(X125,#REF!,8,FALSE)","v":{"$error":"#REF!"}},{"$f":"T125-HLOOKUP(X125,#REF!,9,FALSE)","v":{"$error":"#REF!"}},null,null,null,null,null,null,null,{"$error":"#REF!"}]
["H","NORD","NPC",2,375845,"MAQUAIRE-MILLE","Gordon",2003,75.400000000000006,"CHCD COMINES","F",15,17,19,36,27,29,-31,56,92,117.25417673420851,16.599999999999994,null,{"$f":"IF(A126=\"F\",(IF(OR(H126>2001,H126<2004),VLOOKUP(I126,Feuil1!$G$11:$H$25,2))),IF(A126=\"H\",(IF(OR(H126>2001,H126<2004),VLOOKUP(I126,Feuil1!$A$11:$F$29,2)))))","v":"M77"},null,{"$f":"T126-HLOOKUP(X126,#REF!,2,FALSE)","v":{"$error":"#REF!"}},{"$f":"T126-HLOOKUP(X126,#REF!,3,FALSE)","v":{"$error":"#REF!"}},{"$f":"T126-HLOOKUP(X126,#REF!,4,FALSE)","v":{"$error":"#REF!"}},{"$f":"T126-HLOOKUP(X126,#REF!,5,FALSE)","v":{"$error":"#REF!"}},{"$f":"T126-HLOOKUP(X126,#REF!,6,FALSE)","v":{"$error":"#REF!"}},{"$f":"T126-HLOOKUP(X126,#REF!,7,FALSE)","v":{"$error":"#REF!"}},{"$f":"T126-HLOOKUP(X126,#REF!,8,FALSE)","v":{"$error":"#REF!"}},{"$f":"T126-HLOOKUP(X126,#REF!,9,FALSE)","v":{"$error":"#REF!"}},null,null,null,null,null,null,null,{"$error":"#REF!"}]
["H","N","IDF",3,383960,"KAADOUD","ADAM",2002,70.3,"CACHAN","F",15,17,19,{"$f":"IF(MAXA(L127+M127,M127+N127,L127+N127,L127,M127,N127)<=0,0,MAXA(L127+M127,M127+N127,L127+N127,L127,M127,N127))","v":36},20,22,24,{"$f":"IF(MAXA(P127+Q127,Q127+R127,P127+R127,P127,Q127,R127)<=0,0,MAXA(P127+Q127,Q127+R127,P127+R127,P127,Q127,R127))","v":46},{"$f":"IF(H127=\"\",\"\",IF(OR(O127=0,S127=0),0,O127+S127))","v":82},{"$f":"IF(I127=\"\",\"\",IF(A127=\"H\",10^(0.794358141*LOG(I127/174.393)^2)*T127,IF(A127=\"F\",10^(0.89726074 * LOG(I127/148.026)^2)*T127,\"\")))","v":109.01498992492911},{"$f":"SUM(T127-I127)","v":11.700000000000003},null,{"$f":"IF(A127=\"F\",(IF(OR(H127>2001,H127<2004),VLOOKUP(I127,Feuil1!$G$11:$H$25,2))),IF(A127=\"H\",(IF(OR(H127>2001,H127<2004),VLOOKUP(I127,Feuil1!$A$11:$F$29,2)))))","v":"M77"},null,{"$f":"T127-HLOOKUP(X127,#REF!,2,FALSE)","v":{"$error":"#REF!"}},{"$f":"T127-HLOOKUP(X127,#REF!,3,FALSE)","v":{"$error":"#REF!"}},{"$f":"T127-HLOOKUP(X127,#REF!,4,FALSE)","v":{"$error":"#REF!"}},{"$f":"T127-HLOOKUP(X127,#REF!,5,FALSE)","v":{"$error":"#REF!"}},{"$f":"T127-HLOOKUP(X127,#REF!,6,FALSE)","v":{"$error":"#REF!"}},{"$f":"T127-HLOOKUP(X127,#REF!,7,FALSE)","v":{"$error":"#REF!"}},{"$f":"T127-HLOOKUP(X127,#REF!,8,FALSE)","v":{"$error":"#REF!"}},{"$f":"T127-HLOOKUP(X127,#REF!,9,FALSE)","v":{"$error":"#REF!"}},null,null,null,null,null,null,null,{"$f":"IF(AG127>=0,$AG$4,IF(AF127>=0,$AF$4,IF(AE127>=0,$AE$4,IF(AD127>=0,$AD$4,IF(AC127>=0,$AC$4,IF(AB127>=0,$AB$4,IF(AA127>=0,$AA$4,IF(Z127>=0,$Z$4,$AH$4))))))))","v":{"$error":"#REF!"}}]
[null,null,null,null,null,null,null,null,null,null,null,null,null,null,null,null,null,null,null,null,null,null,null,null,null,{"$f":"T128-HLOOKUP(X128,#REF!,2,FALSE)","v":{"$error":"#REF!"}},{"$f":"T128-HLOOKUP(X128,#REF!,3,FALSE)","v":{"$error":"#REF!"}},{"$f":"T128-HLOOKUP(X128,#REF!,4,FALSE)","v":{"$error":"#REF!"}},{"$f":"T128-HLOOKUP(X128,#REF!,5,FALSE)","v":{"$error":"#REF!"}},{"$f":"T128-HLOOKUP(X128,#REF!,6,FALSE)","v":{"$error":"#REF!"}},{"$f":"T128-HLOOKUP(X128,#REF!,7,FALSE)","v":{"$error":"#REF!"}},{"$f":"T128-HLOOKUP(X128,#REF!,8,FALSE)","v":{"$error":"#REF!"}},{"$f":"T128-HLOOKUP(X128,#REF!,9,FALSE)","v":{"$error":"#REF!"}},null,null,null,null,null,null,null,{"$error":"#REF!"}]
["H","NE","ALS",1,375934,"BARD","AXEL",2002,82,"SHC Haguenau","F",33,35,37,{"$f":"IF(MAXA(L129+M129,M129+N129,L129+N129,L129,M129,N129)<=0,0,MAXA(L129+M129,M129+N129,L129+N129,L129,M129,N129))","v":72},42,44,-46,{"$f":"IF(MAXA(P129+Q129,Q129+R129,P129+R129,P129,Q129,R129)<=0,0,MAXA(P129+Q129,Q129+R129,P129+R129,P129,Q129,R129))","v":86},{"$f":"IF(H129=\"\",\"\",IF(OR(O129=0,S129=0),0,O129+S129))","v":158},{"$f":"IF(I129=\"\",\"\",IF(A129=\"H\",10^(0.794358141*LOG(I129/174.393)^2)*T129,IF(A129=\"F\",10^(0.89726074 * LOG(I129/148.026)^2)*T129,\"\")))","v":192.29543159532193},{"$f":"SUM(T129-I129)","v":76},null,{"$f":"IF(A129=\"F\",(IF(OR(H129>2001,H129<2004),VLOOKUP(I129,Feuil1!$G$11:$H$25,2))),IF(A129=\"H\",(IF(OR(H129>2001,H129<2004),VLOOKUP(I129,Feuil1!$A$11:$F$29,2)))))","v":"M+77"},null,{"$f":"T129-HLOOKUP(X129,#REF!,2,FALSE)","v":{"$error":"#REF!"}},{"$f":"T129-HLOOKUP(X129,#REF!,3,FALSE)","v":{"$error":"#REF!"}},{"$f":"T129-HLOOKUP(X129,#REF!,4,FALSE)","v":{"$error":"#REF!"}},{"$f":"T129-HLOOKUP(X129,#REF!,5,FALSE)","v":{"$error":"#REF!"}},{"$f":"T129-HLOOKUP(X129,#REF!,6,FALSE)","v":{"$error":"#REF!"}},{"$f":"T129-HLOOKUP(X129,#REF!,7,FALSE)","v":{"$error":"#REF!"}},{"$f":"T129-HLOOKUP(X129,#REF!,8,FALSE)","v":{"$error":"#REF!"}},{"$f":"T129-HLOOKUP(X129,#REF!,9,FALSE)","v":{"$error":"#REF!"}},null,null,null,null,null,null,null,{"$f":"IF(AG129>=0,$AG$4,IF(AF129>=0,$AF$4,IF(AE129>=0,$AE$4,IF(AD129>=0,$AD$4,IF(AC129>=0,$AC$4,IF(AB129>=0,$AB$4,IF(AA129>=0,$AA$4,IF(Z129>=0,$Z$4,$AH$4))))))))","v":{"$error":"#REF!"}}]
["H","CO","CEN",2,327171,"BENBOUCHTA","Nassim",2002,93.8,"AAJ BLOIS","F",30,32,34,{"$f":"IF(MAXA(L130+M130,M130+N130,L130+N130,L130,M130,N130)<=0,0,MAXA(L130+M130,M130+N130,L130+N130,L130,M130,N130))","v":66},40,42,44,{"$f":"IF(MAXA(P130+Q130,Q130+R130,P130+R130,P130,Q130,R130)<=0,0,MAXA(P130+Q130,Q130+R130,P130+R130,P130,Q130,R130))","v":86},{"$f":"IF(H130=\"\",\"\",IF(OR(O130=0,S130=0),0,O130+S130))","v":152},{"$f":"IF(I130=\"\",\"\",IF(A130=\"H\",10^(0.794358141*LOG(I130/174.393)^2)*T130,IF(A130=\"F\",10^(0.89726074 * LOG(I130/148.026)^2)*T130,\"\")))","v":173.56559149819941},{"$f":"SUM(T130-I130)","v":58.2},null,{"$f":"IF(A130=\"F\",(IF(OR(H130>2001,H130<2004),VLOOKUP(I130,Feuil1!$G$11:$H$25,2))),IF(A130=\"H\",(IF(OR(H130>2001,H130<2004),VLOOKUP(I130,Feuil1!$A$11:$F$29,2)))))","v":"M+77"},null,{"$f":"T130-HLOOKUP(X130,#REF!,2,FALSE)","v":{"$error":"#REF!"}},{"$f":"T130-HLOOKUP(X130,#REF!,3,FALSE)","v":{"$error":"#REF!"}},{"$f":"T130-HLOOKUP(X130,#REF!,4,FALSE)","v":{"$error":"#REF!"}},{"$f":"T130-HLOOKUP(X130,#REF!,5,FALSE)","v":{"$error":"#REF!"}},{"$f":"T130-HLOOKUP(X130,#REF!,6,FALSE)","v":{"$error":"#REF!"}},{"$f":"T130-HLOOKUP(X130,#REF!,7,FALSE)","v":{"$error":"#REF!"}},{"$f":"T130-HLOOKUP(X130,#REF!,8,FALSE)","v":{"$error":"#REF!"}},{"$f":"T130-HLOOKUP(X130,#REF!,9,FALSE)","v":{"$error":"#REF!"}},null,null,null,null,null,null,null,{"$f":"IF(AG130>=0,$AG$4,IF(AF130>=0,$AF$4,IF(AE130>=0,$AE$4,IF(AD130>=0,$AD$4,IF(AC130>=0,$AC$4,IF(AB130>=0,$AB$4,IF(AA130>=0,$AA$4,IF(Z130>=0,$Z$4,$AH$4))))))))","v":{"$error":"#REF!"}}]
["H","NORD","NPC",3,385701,"BAILLEUL","Maxime",2002,78.8,"ST POL/MER","F",24,26,28,{"$f":"IF(MAXA(L131+M131,M131+N131,L131+N131,L131,M131,N131)<=0,0,MAXA(L131+M131,M131+N131,L131+N131,L131,M131,N131))","v":54},40,42,44,{"$f":"IF(MAXA(P131+Q131,Q131+R131,P131+R131,P131,Q131,R131)<=0,0,MAXA(P131+Q131,Q131+R131,P131+R131,P131,Q131,R131))","v":86},{"$f":"IF(H131=\"\",\"\",IF(OR(O131=0,S131=0),0,O131+S131))","v":140},{"$f":"IF(I131=\"\",\"\",IF(A131=\"H\",10^(0.794358141*LOG(I131/174.393)^2)*T131,IF(A131=\"F\",10^(0.89726074 * LOG(I131/148.026)^2)*T131,\"\")))","v":174.05161813786458},{"$f":"SUM(T131-I131)","v":61.2},null,{"$f":"IF(A131=\"F\",(IF(OR(H131>2001,H131<2004),VLOOKUP(I131,Feuil1!$G$11:$H$25,2))),IF(A131=\"H\",(IF(OR(H131>2001,H131<2004),VLOOKUP(I131,Feuil1!$A$11:$F$29,2)))))","v":"M+77"},null,{"$f":"T131-HLOOKUP(X131,#REF!,2,FALSE)","v":{"$error":"#REF!"}},{"$f":"T131-HLOOKUP(X131,#REF!,3,FALSE)","v":{"$error":"#REF!"}},{"$f":"T131-HLOOKUP(X131,#REF!,4,FALSE)","v":{"$error":"#REF!"}},{"$f":"T131-HLOOKUP(X131,#REF!,5,FALSE)","v":{"$error":"#REF!"}},{"$f":"T131-HLOOKUP(X131,#REF!,6,FALSE)","v":{"$error":"#REF!"}},{"$f":"T131-HLOOKUP(X131,#REF!,7,FALSE)","v":{"$error":"#REF!"}},{"$f":"T131-HLOOKUP(X131,#REF!,8,FALSE)","v":{"$error":"#REF!"}},{"$f":"T131-HLOOKUP(X131,#REF!,9,FALSE)","v":{"$error":"#REF!"}},null,null,null,null,null,null,null,{"$f":"IF(AG131>=0,$AG$4,IF(AF131>=0,$AF$4,IF(AE131>=0,$AE$4,IF(AD131>=0,$AD$4,IF(AC131>=0,$AC$4,IF(AB131>=0,$AB$4,IF(AA131>=0,$AA$4,IF(Z131>=0,$Z$4,$AH$4))))))))","v":{"$error":"#REF!"}}]
["H","NE","ALS",4,327057,"LAEMLIN","JULES",2003,80.599999999999994,"US Wittenheim","F",27,29,31,{"$f":"IF(MAXA(L132+M132,M132+N132,L132+N132,L132,M132,N132)<=0,0,MAXA(L132+M132,M132+N132,L132+N132,L132,M132,N132))","v":60},31,33,35,{"$f":"IF(MAXA(P132+Q132,Q132+R132,P132+R132,P132,Q132,R132)<=0,0,MAXA(P132+Q132,Q132+R132,P132+R132,P132,Q132,R132))","v":68},{"$f":"IF(H132=\"\",\"\",IF(OR(O132=0,S132=0),0,O132+S132))","v":128},{"$f":"IF(I132=\"\",\"\",IF(A132=\"H\",10^(0.794358141*LOG(I132/174.393)^2)*T132,IF(A132=\"F\",10^(0.89726074 * LOG(I132/148.026)^2)*T132,\"\")))","v":157.20273452002519},{"$f":"SUM(T132-I132)","v":47.400000000000006},null,{"$f":"IF(A132=\"F\",(IF(OR(H132>2001,H132<2004),VLOOKUP(I132,Feuil1!$G$11:$H$25,2))),IF(A132=\"H\",(IF(OR(H132>2001,H132<2004),VLOOKUP(I132,Feuil1!$A$11:$F$29,2)))))","v":"M+77"},null,{"$f":"T132-HLOOKUP(X132,#REF!,2,FALSE)","v":{"$error":"#REF!"}},{"$f":"T132-HLOOKUP(X132,#REF!,3,FALSE)","v":{"$error":"#REF!"}},{"$f":"T132-HLOOKUP(X132,#REF!,4,FALSE)","v":{"$error":"#REF!"}},{"$f":"T132-HLOOKUP(X132,#REF!,5,FALSE)","v":{"$error":"#REF!"}},{"$f":"T132-HLOOKUP(X132,#REF!,6,FALSE)","v":{"$error":"#REF!"}},{"$f":"T132-HLOOKUP(X132,#REF!,7,FALSE)","v":{"$error":"#REF!"}},{"$f":"T132-HLOOKUP(X132,#REF!,8,FALSE)","v":{"$error":"#REF!"}},{"$f":"T132-HLOOKUP(X132,#REF!,9,FALSE)","v":{"$error":"#REF!"}},null,null,null,null,null,null,null,{"$f":"IF(AG132>=0,$AG$4,IF(AF132>=0,$AF$4,IF(AE132>=0,$AE$4,IF(AD132>=0,$AD$4,IF(AC132>=0,$AC$4,IF(AB132>=0,$AB$4,IF(AA132>=0,$AA$4,IF(Z132>=0,$Z$4,$AH$4))))))))","v":{"$error":"#REF!"}}]
["H","CO","BRE",5,380277,"COATMEN","Maxime",2002,82.65,"AL QUIMPER","F",18,20,21,{"$f":"IF(MAXA(L133+M133,M133+N133,L133+N133,L133,M133,N133)<=0,0,MAXA(L133+M133,M133+N133,L133+N133,L133,M133,N133))","v":41},25,27,28,{"$f":"IF(MAXA(P133+Q133,Q133+R133,P133+R133,P133,Q133,R133)<=0,0,MAXA(P133+Q133,Q133+R133,P133+R133,P133,Q133,R133))","v":55},{"$f":"IF(H133=\"\",\"\",IF(OR(O133=0,S133=0),0,O133+S133))","v":96},{"$f":"IF(I133=\"\",\"\",IF(A133=\"H\",10^(0.794358141*LOG(I133/174.393)^2)*T133,IF(A133=\"F\",10^(0.89726074 * LOG(I133/148.026)^2)*T133,\"\")))","v":116.36092188026043},{"$f":"SUM(T133-I133)","v":13.349999999999994},null,{"$f":"IF(A133=\"F\",(IF(OR(H133>2001,H133<2004),VLOOKUP(I133,Feuil1!$G$11:$H$25,2))),IF(A133=\"H\",(IF(OR(H133>2001,H133<2004),VLOOKUP(I133,Feuil1!$A$11:$F$29,2)))))","v":"M+77"},null,{"$f":"T133-HLOOKUP(X133,#REF!,2,FALSE)","v":{"$error":"#REF!"}},{"$f":"T133-HLOOKUP(X133,#REF!,3,FALSE)","v":{"$error":"#REF!"}},{"$f":"T133-HLOOKUP(X133,#REF!,4,FALSE)","v":{"$error":"#REF!"}},{"$f":"T133-HLOOKUP(X133,#REF!,5,FALSE)","v":{"$error":"#REF!"}},{"$f":"T133-HLOOKUP(X133,#REF!,6,FALSE)","v":{"$error":"#REF!"}},{"$f":"T133-HLOOKUP(X133,#REF!,7,FALSE)","v":{"$error":"#REF!"}},{"$f":"T133-HLOOKUP(X133,#REF!,8,FALSE)","v":{"$error":"#REF!"}},{"$f":"T133-HLOOKUP(X133,#REF!,9,FALSE)","v":{"$error":"#REF!"}},null,null,null,null,null,null,null,{"$f":"IF(AG133>=0,$AG$4,IF(AF133>=0,$AF$4,IF(AE133>=0,$AE$4,IF(AD133>=0,$AD$4,IF(AC133>=0,$AC$4,IF(AB133>=0,$AB$4,IF(AA133>=0,$AA$4,IF(Z133>=0,$Z$4,$AH$4))))))))","v":{"$error":"#REF!"}}]
[null,null,null,null,null,null,null,null,null,null,null,null,null,null,null,null,null,null,null,null,null,null,null,null,null,{"$f":"T134-HLOOKUP(X134,#REF!,2,FALSE)","v":{"$error":"#REF!"}},{"$f":"T134-HLOOKUP(X134,#REF!,3,FALSE)","v":{"$error":"#REF!"}},{"$f":"T134-HLOOKUP(X134,#REF!,4,FALSE)","v":{"$error":"#REF!"}},{"$f":"T134-HLOOKUP(X134,#REF!,5,FALSE)","v":{"$error":"#REF!"}},{"$f":"T134-HLOOKUP(X134,#REF!,6,FALSE)","v":{"$error":"#REF!"}},{"$f":"T134-HLOOKUP(X134,#REF!,7,FALSE)","v":{"$error":"#REF!"}},{"$f":"T134-HLOOKUP(X134,#REF!,8,FALSE)","v":{"$error":"#REF!"}},{"$f":"T134-HLOOKUP(X134,#REF!,9,FALSE)","v":{"$error":"#REF!"}},null,null,null,null,null,null,null,{"$error":"#REF!"}]
[null,null,null,null,null,null,null,null,null,null,null,null,null," "]
[]
[null,null,null,null,null,null,null,null,null,null,null,null," "," "]
[]
[]
[]
[]
[]
[]
[]
[]
[]
[]
[]
[]
[]
[]
[]
[]
[]
[]
[]
[]
[]
[]
[]
[]
[]
[]
[]
[]
[]
[]
[]
[]
[]
[]
[]
[]
[]
[]
[]
[]
[]
[]
[]
[]
[]
[]
[]
[]
[]
[]
[]
[]
[]
[]
[]
[]
[]
[]
[]
[]
[]
[]
[]
[]
[]
[]
[]
[]
[]
[]
[]
[]
[]
[]
[]
[]
[]
[]
[]
[]
[]
[]
[]
[]
[]
[]
[]
[]
[]
[]
[]
[]
[]
[]
[]
[]
[]
[]
[]
[]
[]
[]
[]
[]
[]
[]
[]
[]
[]
[]
[]
[]
[]
[]
[]
[]
[]
[]
[]
[]
[]
[]
[]
[]
[]
[]
[]
[]
[]
[]
[]
[]
[]
[]
[]
[]
[]
[]
[]
[]
[]
[]
[]
[]
[]
[]
[]
[]
[]
[]
[]
[]
[]
[]
[]
[]
[]
[]
[]
[]
[]
[]
[]
[]
[]
[]
[]
[]
[]
[]
[]
[]
[]
[]
[]
[]
[]
[]
[]
[]
[]
[]
[]
[]
[]
[]
[]
[]
[]
[]
[]
[]
[]
[]
[]
[]
[]
[]
[]
[]
[]
[]
[]
[]
[]
[]
[]
[]
[]
[]
[]
[]
[]
[]
[]
[]
[]
[]
[]
[]
[]
[]
[]
[]
[]
[]
[]
[]
[]
[]
[]
[]
[]
[]
[]
[]
[]
[]
[]
[]
[]
[]
[]
[]
[]
[]
[]
[]
[]
[]
[]
[]
[]
[]
[]
[]
[]
[]
[]
[]
[]
[]
[]
[]
[]
[]
[]
[]
[]
[]
[]
[]
[]
[]
[]
[]
[]
[]
[]
[]
[]
[]
[]
[]
[]
[]
[]
[]
[]
[]
[]
[]
[]
[]
[]
[]
[]
[]
[]
[]
[]
[]
[]
[]
[]
[]
[]
[]
[]
[]
[]
[]
[]
[]
[]
[]
[]
[]
[]
[]
[]
[]
[]
[]
[]
[]
[]
[]
[]
[]
[]
[]
[]
[]
[]
[]
[]
[]
[]
[]
[]
[]
[]
[]
[]
[]
[]
[]
[]
[]
[]
[]
[]
[]
[]
[]
[]
[]
[]
[]
[]
[]
[]
[]
[]
[]
[]
[]
[]
[]
[]
[]
[]
[]
[]
[]
[]
[]
[]
[]
[]
[]
[]
[]
[]
[]
[]
[]
[]
[]
[]
[]
[]
[]
[]
[]
[]
[]
[]
[]
[]
[]
[]
[]
[]
[]
[]
[]
[]
[]
[]
[]
[]
[]
[]
[]
[]
[]
[]
[]
[]
[]
[]
[]
[]
[]
[]
[]
[]
[]
[]
[]
[]
[]
[]
[]
[]
[]
[]
[]
[]
[]
[]
[]
[]
[]
[]
[]
[]
[]
[]
[]
[]
[]
[]
[]
[]
[]
[]
[]
[]
[]
[]
[]
[]
[]
[]
[]
[]
[]
[]
[]
[]
[]
[]
[]
[]
[]
[]
[]
[]
[]
[]
[]
[]
[]
[]
[]
[]
[]
[]
[]
[]
[]
[]
[]
[]
[]
[]
[]
[null,null,null,null,null,null,null,null,null,null,null,null,null,null,null,null,null,null,null,null,null,null,null,null,"J69","J77","J85","J94","J105","J+105",null,"J56","J62","J69","J77","J85","J94","J105","J+105",null,"S56","S62","S69","S77","S85","S94","S105","S+105"]
[null,null,null,null,null,null,null,null,null,null,null,null,null,null,null,null,null,null,null,null,null,null,null,null,130,145,160,170,180,190,null,100,115,130,145,160,170,180,190,null,115,135,150,165,180,190,200,210]
[null,null,null,null,null,null,null,null,null,null,null,null,null,null,null,null,null,null,null,null,null,null,null,null,150,165,180,190,200,210,null,115,135,150,165,180,190,200,210,null,130,150,165,185,200,210,220,230]
[null,null,null,null,null,null,null,null,null,null,null,null,null,null,null,null,null,null,null,null,null,null,null,null,165,185,200,210,220,230,null,130,150,165,185,200,210,220,230,null,145,165,180,200,220,230,240,250]
[null,null,null,null,null,null,null,null,null,null,null,null,null,null,null,null,null,null,null,null,null,null,null,null,180,200,220,230,240,250,null,145,165,180,200,220,230,240,250,null,175,195,215,235,250,260,275,280]
[null,null,null,null,null,null,null,null,null,null,null,null,null,null,null,null,null,null,null,null,null,null,null,null,215,235,250,260,275,280,null,175,195,215,235,250,260,275,280,null,210,230,250,270,290,300,310,325]
[null,null,null,null,null,null,null,null,null,null,null,null,null,null,null,null,null,null,null,null,null,null,null,null,250,270,290,300,310,325,null,210,230,250,270,290,300,310,325,null,230,255,275,300,315,335,345,355]
[null,null,null,null,null,null,null,null,null,null,null,null,null,null,null,null,null,null,null,null,null,null,null,null,295,320,335,355,370,380,null,245,270,295,320,335,355,370,380,null,245,270,295,320,335,355,370,380]

{"sheet":"Feuil1","index":2,"n_rows":29,"n_cols":62,"rows_kept":29,"cut":false,"hidden":true,"merged":[]}
[null,null,"FC1 44","FC1 48","FC1 53","FC1 58","FC1 63","FC1 69","FC1 +69","FC2 44","FC2 48","FC2 53","FC2 58","FC2 63","FC2 69","FC2 +69","FJ48","FJ53","FJ58","FJ63","FJ69","FJ75","FJ+75","FS48","FS53","FS58","FS63","FS69","FS75","FS+75","C1 50","C1 56","C1 62","C1 69","C1 77","C1 85","C1 94","C1 +94","C2 50","C2 56","C2 62","C2 69","C2 77","C2 85","C2 94","C2 +94","J56","J62","J69","J77","J85","J94","J105","J+105","S56","S62","S69","S77","S85","S94","S105","S+105"]
[null,"DEBUTANT",25,25,35,40,45,50,60,30,35,45,40,55,60,70,45,55,60,65,70,80,90,55,65,70,75,80,95,100,40,50,75,85,90,100,110,120,45,65,85,95,110,120,125,135,80,90,110,130,145,150,155,165,95,120,130,150,165,170,175,185]
[null,"DEPARTEMENTAL",35,35,45,50,55,60,70,40,45,55,50,65,70,80,55,65,70,75,80,95,100,65,75,80,85,90,105,110,55,70,95,105,110,120,130,140,65,85,105,115,130,140,145,155,100,120,130,150,165,170,175,185,115,135,150,170,185,190,195,205]
[null,"REGIONAL",40,45,55,60,65,70,80,50,55,65,60,75,80,95,65,75,80,85,90,105,110,75,85,90,95,105,115,125,65,85,105,115,130,140,145,155,80,100,120,130,150,160,165,175,115,135,150,170,185,190,195,205,130,150,170,190,205,215,220,225]
[null,"INTERREGIONAL",50,55,65,70,75,80,95,60,65,75,70,85,90,105,75,85,90,95,105,115,125,85,95,100,110,120,130,140,80,100,120,130,150,160,165,175,95,115,135,150,170,180,185,195,130,150,170,190,205,215,220,225,145,170,190,210,225,235,245,250]
[null,"FEDERAL",60,65,75,80,85,90,105,70,75,85,80,95,105,115,85,95,100,110,120,130,140,95,105,115,125,135,145,150,95,115,135,150,170,180,185,195,110,130,150,170,185,200,210,220,145,170,190,210,225,235,245,250,170,190,220,240,250,260,270,280]
[null,"NATIONAL",70,75,85,90,95,105,115,80,85,95,90,110,120,130,95,105,115,125,135,145,150,110,120,130,140,150,160,170,110,130,150,170,185,200,210,220,120,145,170,190,200,220,225,235,170,190,220,240,250,260,270,280,190,210,240,265,280,290,300,310]
[null,"INTERNATIONAL B",80,85,95,100,110,120,130,90,95,105,100,125,135,145,110,120,130,140,150,160,170,125,140,150,160,170,180,190,120,145,170,190,200,220,225,235,135,170,190,210,220,240,250,260,190,210,240,260,280,290,300,310,210,230,260,285,300,310,325,330]
[null,"INTERNATIONAL A",90,95,105,115,125,135,145,100,110,120,115,140,150,160,125,135,150,160,170,180,190,140,160,170,180,190,195,210,135,170,190,210,220,240,250,260,150,190,210,230,250,260,280,280,210,230,250,285,300,310,325,330,225,255,275,305,325,330,345,355]
[null,"OLYMPIQUE",1000,1000,1000,1000,1000,1000,1000,1000,1000,1000,1000,1000,1000,1000,1000,1000,1000,1000,1000,1000,1000,155,175,190,200,205,210,225,1000,1000,1000,1000,1000,10000,1000,1000,1000,1000,1000,1000,1000,10000,1000,1000,1000,1000,1000,10000,1000,1000,1000,10000,240,270,290,320,345,355,365,375]
[null,"MINIME","CADET","CADET","JUNIOR","SENIOR",null,"MINIME","CADETTE","CADETTE","JUNIOR","SENIOR"]
[20.010000000000002,"M40","C1 50","C2 50","J56","S56",20.010000000000002,"FM36","FC1 44","FC2 44","FJ48","FS48"]
[34.01,"M40","C1 50","C2 50","J56","S56",30.01,"FM36","FC1 44","FC2 45","FJ48","FS48"]
[38.01,"M40","C1 50","C2 50","J56","S56",35.01,"FM36","FC1 44","FC2 46","FJ48","FS48"]
[40.01,"M45","C1 50","C2 50","J56","S56",36.01,"FM40","FC1 44","FC2 47","FJ48","FS48"]
[45.01,"M50","C1 50","C2 50","J56","S56",40.01,"FM44","FC1 44","FC2 48","FJ48","FS48"]
[50.01,"M56","C1 56","C2 56","J56","S56",44.01,"FM48","FC1 48","FC2 48","FJ48","FS48"]
[52.05,"M56","C1 56","C2 56","J56","S56",48.01,"FM53","FC1 53","FC2 53","FJ53","FS53"]
[56.01,"M62","C1 62","C2 62","J62","S62",53.01,"FM58","FC1 58","FC2 58","FJ58","FS58"]
[62.01,"M69","C1 69","C2 69","J69","S69",58.01,"FM+58","FC1 63","FC2 63","FJ63","FS63"]
[69.010000000000005,"M77","C1 77","C2 77","J77","S77",63.01,"FM+58","FC1 69","FC2 69","FJ69","FS69"]
[77.010000000000005,"M+77","C1 85","C2 85","J85","S85",69.010000000000005,"FM+58","FC1 +69","FC2 +69","FJ75","FS75"]
[85.01,"M+77","C1 94","C2 94","J94","S94",75.010000000000005,"FM+58","FC1 +69","FC2 +69","FJ+75","FS+75"]
[94.01,"M+77","C1 +94","C2 +94","J105","S105",110,"FM+58","FC1 +69","FC2 +69","FJ+75","FS+75"]
[105.01,"M+77","C1 +94","C2 +94","J+105","S+105",140,"FM+58","FC1 +69","FC2 +69","FJ+75","FS+75"]
[110,"M+77","C1 +94","C2 +94","J+105","S+105"]
[120,"M+77","C1 +94","C2 +94","J+105","S+105"]
[130,"M+77","C1 +94","C2 +94","J+105","S+105"]
[140,"M+77","C1 +94","C2 +94","J+105","S+105",null,null,null,null,null,null,null,null,null,null,null,null,null,null,null,null,null,null,null,null,null,null,null,null,null," "]