{"text_format":"1","workbook":"xlsx","n_sheets":3,"sheets":["MINIMES FILLES","MINIMES GARCONS","Feuil1"],"not_rendered":{"charts":0,"images":0,"macros":1,"external_links":0,"defined_names":4,"comments":2,"pivot_tables":0},"unopened":[],"bounds":{"document_bytes":16777216,"sheet_cells":100000,"rows_first":2000,"rows_last":500,"rows_between":2000,"halvings":0,"cell_chars":16384,"cell_head_chars":4096},"cells_cut":0,"cells_raw":0,"read":"whole","date_system":"1900"}

{"sheet":"MINIMES FILLES","index":0,"n_rows":551,"n_cols":48,"rows_kept":551,"cut":false,"hidden":false,"merged":[[0,6,0,14],[0,18,0,21],[1,5,1,10],[1,11,1,13],[1,14,1,17],[1,18,1,19],[1,21,1,22]]}
[null,null,null,"LISTING NATIONAL",null,null,"MINIMES FILLES",null,null,null,null,null,null,null,null,null,"DATE :",null,"2015-03-08"]
[null,null,null," ",null,null,null,null,null,null,null,"2° TRIMESTRE"]
[]
["SEXE","ZONE","REG.","Place","LICENCE","NOMS","Prénoms","AN","POIDS","CLUB","NAT",1,2,3,"ARR",1,2,3,"EP-J","TOTAL","IWF","Points",null,"Catég"," ","DEP +","REG +","IRG +","FED +","NAT +","INTB +","INTA +","OLY +","NCL"]
[null,null,null,null,null,null,null,null,null,null,null,null,null,null,null,null,null,null,null,null,null,null,null,null,null,{"$f":"T5-HLOOKUP(X5,#REF!,2,FALSE)","v":{"$error":"#REF!"}},{"$f":"T5-HLOOKUP(X5,#REF!,3,FALSE)","v":{"$error":"#REF!"}},{"$f":"T5-HLOOKUP(X5,#REF!,4,FALSE)","v":{"$error":"#REF!"}},{"$f":"T5-HLOOKUP(X5,#REF!,5,FALSE)","v":{"$error":"#REF!"}},{"$f":"T5-HLOOKUP(X5,#REF!,6,FALSE)","v":{"$error":"#REF!"}},{"$f":"T5-HLOOKUP(X5,#REF!,7,FALSE)","v":{"$error":"#REF!"}},{"$f":"T5-HLOOKUP(X5,#REF!,8,FALSE)","v":{"$error":"#REF!"}},{"$f":"T5-HLOOKUP(X5,#REF!,9,FALSE)","v":{"$error":"#REF!"}},null,null,null,null,null,null,null,{"$f":"IF(AG5>=0,$AG$4,IF(AF5>=0,$AF$4,IF(AE5>=0,$AE$4,IF(AD5>=0,$AD$4,IF(AC5>=0,$AC$4,IF(AB5>=0,$AB$4,IF(AA5>=0,$AA$4,IF(Z5>=0,$Z$4,$AH$4))))))))","v":{"$error":"#REF!"}}]
["F","NORD","PIC",1,386173,"POTARD","Cindy",2002,31.04,"Péronne AAEEP","F",14,16,-18,{"$f":"IF(MAXA(L6+M6,M6+N6,L6+N6,L6,M6,N6)<=0,0,MAXA(L6+M6,M6+N6,L6+N6,L6,M6,N6))","v":30},20,22,24,{"$f":"IF(MAXA(P6+Q6,Q6+R6,P6+R6,P6,Q6,R6)<=0,0,MAXA(P6+Q6,Q6+R6,P6+R6,P6,Q6,R6))","v":46},{"$f":"IF(H6=\"\",\"\",IF(OR(O6=0,S6=0),0,O6+S6))","v":76},{"$f":"IF(I6=\"\",\"\",IF(A6=\"H\",10^(0.794358141*LOG(I6/174.393)^2)*T6,IF(A6=\"F\",10^(0.89726074 * LOG(I6/148.026)^2)*T6,\"\")))","v":196.68744967316121},{"$f":"SUM(T6-I6)","v":44.96},null,{"$f":"IF(A6=\"F\",(IF(OR(H6>2001,H6<2004),VLOOKUP(I6,Feuil1!$G$11:$H$25,2))),IF(A6=\"H\",(IF(OR(H6>2001,H6<2004),VLOOKUP(I6,Feuil1!$A$11:$F$29,2)))))","v":"FM36"},null,{"$f":"T6-HLOOKUP(X6,#REF!,2,FALSE)","v":{"$error":"#REF!"}},{"$f":"T6-HLOOKUP(X6,#REF!,3,FALSE)","v":{"$error":"#REF!"}},{"$f":"T6-HLOOKUP(X6,#REF!,4,FALSE)","v":{"$error":"#REF!"}},{"$f":"T6-HLOOKUP(X6,#REF!,5,FALSE)","v":{"$error":"#REF!"}},{"$f":"T6-HLOOKUP(X6,#REF!,6,FALSE)","v":{"$error":"#REF!"}},{"$f":"T6-HLOOKUP(X6,#REF!,7,FALSE)","v":{"$error":"#REF!"}},{"$f":"T6-HLOOKUP(X6,#REF!,8,FALSE)","v":{"$error":"#REF!"}},{"$f":"T6-HLOOKUP(X6,#REF!,9,FALSE)","v":{"$error":"#REF!"}},null,null,null,null,null,null,null,{"$error":"#REF!"}]
["F","SEST","RAL",2,352111,"PICOT","Zianne",2003,34.54,"CH Saint Baldoph","F",10,12,14,{"$f":"IF(MAXA(L7+M7,M7+N7,L7+N7,L7,M7,N7)<=0,0,MAXA(L7+M7,M7+N7,L7+N7,L7,M7,N7))","v":26},16,18,-20,{"$f":"IF(MAXA(P7+Q7,Q7+R7,P7+R7,P7,Q7,R7)<=0,0,MAXA(P7+Q7,Q7+R7,P7+R7,P7,Q7,R7))","v":34},{"$f":"IF(H7=\"\",\"\",IF(OR(O7=0,S7=0),0,O7+S7))","v":60},{"$f":"IF(I7=\"\",\"\",IF(A7=\"H\",10^(0.794358141*LOG(I7/174.393)^2)*T7,IF(A7=\"F\",10^(0.89726074 * LOG(I7/148.026)^2)*T7,\"\")))","v":136.9482531154643},{"$f":"SUM(T7-I7)","v":25.46},null,{"$f":"IF(A7=\"F\",(IF(OR(H7>2001,H7<2004),VLOOKUP(I7,Feuil1!$G$11:$H$25,2))),IF(A7=\"H\",(IF(OR(H7>2001,H7<2004),VLOOKUP(I7,Feuil1!$A$11:$F$29,2)))))","v":"FM36"},null,{"$f":"T7-HLOOKUP(X7,#REF!,2,FALSE)","v":{"$error":"#REF!"}},{"$f":"T7-HLOOKUP(X7,#REF!,3,FALSE)","v":{"$error":"#REF!"}},{"$f":"T7-HLOOKUP(X7,#REF!,4,FALSE)","v":{"$error":"#REF!"}},{"$f":"T7-HLOOKUP(X7,#REF!,5,FALSE)","v":{"$error":"#REF!"}},{"$f":"T7-HLOOKUP(X7,#REF!,6,FALSE)","v":{"$error":"#REF!"}},{"$f":"T7-HLOOKUP(X7,#REF!,7,FALSE)","v":{"$error":"#REF!"}},{"$f":"T7-HLOOKUP(X7,#REF!,8,FALSE)","v":{"$error":"#REF!"}},{"$f":"T7-HLOOKUP(X7,#REF!,9,FALSE)","v":{"$error":"#REF!"}},null,null,null,null,null,null,null,{"$error":"#REF!"}]
["F","NORD","PIC",3,377089,"THIERRY","Charlotte",2003,23.2,"La Ferté Milon CMHM","F",10,12,-14,{"$f":"IF(MAXA(L8+M8,M8+N8,L8+N8,L8,M8,N8)<=0,0,MAXA(L8+M8,M8+N8,L8+N8,L8,M8,N8))","v":22},15,16,17,{"$f":"IF(MAXA(P8+Q8,Q8+R8,P8+R8,P8,Q8,R8)<=0,0,MAXA(P8+Q8,Q8+R8,P8+R8,P8,Q8,R8))","v":33},{"$f":"IF(H8=\"\",\"\",IF(OR(O8=0,S8=0),0,O8+S8))","v":55},{"$f":"IF(I8=\"\",\"\",IF(A8=\"H\",10^(0.794358141*LOG(I8/174.393)^2)*T8,IF(A8=\"F\",10^(0.89726074 * LOG(I8/148.026)^2)*T8,\"\")))","v":209.69759005613093},{"$f":"SUM(T8-I8)","v":31.8},null,{"$f":"IF(A8=\"F\",(IF(OR(H8>2001,H8<2004),VLOOKUP(I8,Feuil1!$G$11:$H$25,2))),IF(A8=\"H\",(IF(OR(H8>2001,H8<2004),VLOOKUP(I8,Feuil1!$A$11:$F$29,2)))))","v":"FM36"},null,{"$f":"T8-HLOOKUP(X8,#REF!,2,FALSE)","v":{"$error":"#REF!"}},{"$f":"T8-HLOOKUP(X8,#REF!,3,FALSE)","v":{"$error":"#REF!"}},{"$f":"T8-HLOOKUP(X8,#REF!,4,FALSE)","v":{"$error":"#REF!"}},{"$f":"T8-HLOOKUP(X8,#REF!,5,FALSE)","v":{"$error":"#REF!"}},{"$f":"T8-HLOOKUP(X8,#REF!,6,FALSE)","v":{"$error":"#REF!"}},{"$f":"T8-HLOOKUP(X8,#REF!,7,FALSE)","v":{"$error":"#REF!"}},{"$f":"T8-HLOOKUP(X8,#REF!,8,FALSE)","v":{"$error":"#REF!"}},{"$f":"T8-HLOOKUP(X8,#REF!,9,FALSE)","v":{"$error":"#REF!"}},null,null,null,null,null,null,null,{"$f":"IF(AG8>=0,$AG$4,IF(AF8>=0,$AF$4,IF(AE8>=0,$AE$4,IF(AD8>=0,$AD$4,IF(AC8>=0,$AC$4,IF(AB8>=0,$AB$4,IF(AA8>=0,$AA$4,IF(Z8>=0,$Z$4,$AH$4))))))))","v":{"$error":"#REF!"}}]
[null,null,null,null,null,null,null,null,null,null,null,null,null,null,null,null,null,null,null,null,null,null,null,null,null,{"$f":"T9-HLOOKUP(X9,#REF!,2,FALSE)","v":{"$error":"#REF!"}},{"$f":"T9-HLOOKUP(X9,#REF!,3,FALSE)","v":{"$error":"#REF!"}},{"$f":"T9-HLOOKUP(X9,#REF!,4,FALSE)","v":{"$error":"#REF!"}},{"$f":"T9-HLOOKUP(X9,#REF!,5,FALSE)","v":{"$error":"#REF!"}},{"$f":"T9-HLOOKUP(X9,#REF!,6,FALSE)","v":{"$error":"#REF!"}},{"$f":"T9-HLOOKUP(X9,#REF!,7,FALSE)","v":{"$error":"#REF!"}},{"$f":"T9-HLOOKUP(X9,#REF!,8,FALSE)","v":{"$error":"#REF!"}},{"$f":"T9-HLOOKUP(X9,#REF!,9,FALSE)","v":{"$error":"#REF!"}},null,null,null,null,null,null,null,{"$error":"#REF!"}]
["F","NE","ALS",1,354663,"SCHULTZ","LEANE",2003,38.35,"US Wittenheim","F",17,19,21,{"$f":"IF(MAXA(L10+M10,M10+N10,L10+N10,L10,M10,N10)<=0,0,MAXA(L10+M10,M10+N10,L10+N10,L10,M10,N10))","v":40},25,27,29,{"$f":"IF(MAXA(P10+Q10,Q10+R10,P10+R10,P10,Q10,R10)<=0,0,MAXA(P10+Q10,Q10+R10,P10+R10,P10,Q10,R10))","v":56},{"$f":"IF(H10=\"\",\"\",IF(OR(O10=0,S10=0),0,O10+S10))","v":96},{"$f":"IF(I10=\"\",\"\",IF(A10=\"H\",10^(0.794358141*LOG(I10/174.393)^2)*T10,IF(A10=\"F\",10^(0.89726074 * LOG(I10/148.026)^2)*T10,\"\")))","v":195.42919978501948},{"$f":"SUM(T10-I10)","v":57.65},null,{"$f":"IF(A10=\"F\",(IF(OR(H10>2001,H10<2004),VLOOKUP(I10,Feuil1!$G$11:$H$25,2))),IF(A10=\"H\",(IF(OR(H10>2001,H10<2004),VLOOKUP(I10,Feuil1!$A$11:$F$29,2)))))","v":"FM40"},null,{"$f":"T10-HLOOKUP(X10,#REF!,2,FALSE)","v":{"$error":"#REF!"}},{"$f":"T10-HLOOKUP(X10,#REF!,3,FALSE)","v":{"$error":"#REF!"}},{"$f":"T10-HLOOKUP(X10,#REF!,4,FALSE)","v":{"$error":"#REF!"}},{"$f":"T10-HLOOKUP(X10,#REF!,5,FALSE)","v":{"$error":"#REF!"}},{"$f":"T10-HLOOKUP(X10,#REF!,6,FALSE)","v":{"$error":"#REF!"}},{"$f":"T10-HLOOKUP(X10,#REF!,7,FALSE)","v":{"$error":"#REF!"}},{"$f":"T10-HLOOKUP(X10,#REF!,8,FALSE)","v":{"$error":"#REF!"}},{"$f":"T10-HLOOKUP(X10,#REF!,9,FALSE)","v":{"$error":"#REF!"}},null,null,null,null,null,null,null,{"$f":"IF(AG10>=0,$AG$4,IF(AF10>=0,$AF$4,IF(AE10>=0,$AE$4,IF(AD10>=0,$AD$4,IF(AC10>=0,$AC$4,IF(AB10>=0,$AB$4,IF(AA10>=0,$AA$4,IF(Z10>=0,$Z$4,$AH$4))))))))","v":{"$error":"#REF!"}}]
{"$rows_left_out":542}
{"sheet":"MINIMES GARCONS","index":1,"n_rows":645,"n_cols":48,"rows_kept":645,"cut":false,"hidden":false,"merged":[[0,6,0,14],[0,18,0,21],[1,5,1,10],[1,11,1,13],[1,14,1,17],[1,18,1,19],[1,21,1,22]]}
[null,null,null,"LISTING NATIONAL",null,null,"MINIMES GARCONS",null,null,null,null,null,null,null,null,null,"DATE :",null,"2015-03-08"]
[null,null,null," ",null,null,null,null,null,null,null,"2° TRIMESTRE"]
[]
["SEXE","ZONE","REG.","Place","LICENCE","NOMS","Prénoms","AN","POIDS","CLUB","NAT",1,2,3,"ARR",1,2,3,"EP-J","TOTAL","IWF","Points",null,"Catég"," ","DEP +","REG +","IRG +","FED +","NAT +","INTB +","INTA +","OLY +","NCL"]
[null,null,null,null,null,null,null,null,null,null,null,null,null,null,null,null,null,null,null,null,null,null,null,null,null,{"$f":"T5-HLOOKUP(X5,#REF!,2,FALSE)","v":{"$error":"#REF!"}},{"$f":"T5-HLOOKUP(X5,#REF!,3,FALSE)","v":{"$error":"#REF!"}},{"$f":"T5-HLOOKUP(X5,#REF!,4,FALSE)","v":{"$error":"#REF!"}},{"$f":"T5-HLOOKUP(X5,#REF!,5,FALSE)","v":{"$error":"#REF!"}},{"$f":"T5-HLOOKUP(X5,#REF!,6,FALSE)","v":{"$error":"#REF!"}},{"$f":"T5-HLOOKUP(X5,#REF!,7,FALSE)","v":{"$error":"#REF!"}},{"$f":"T5-HLOOKUP(X5,#REF!,8,FALSE)","v":{"$error":"#REF!"}},{"$f":"T5-HLOOKUP(X5,#REF!,9,FALSE)","v":{"$error":"#REF!"}},null,null,null,null,null,null,null,{"$f":"IF(AG5>=0,$AG$4,IF(AF5>=0,$AF$4,IF(AE5>=0,$AE$4,IF(AD5>=0,$AD$4,IF(AC5>=0,$AC$4,IF(AB5>=0,$AB$4,IF(AA5>=0,$AA$4,IF(Z5>=0,$Z$4,$AH$4))))))))","v":{"$error":"#REF!"}}]
["H","CO","PDL",1,355921,"COGNON","Théo",2002,40,"CJF LAVAL - VOUTRÉ","F",36,38,40,{"$f":"IF(MAXA(L6+M6,M6+N6,L6+N6,L6,M6,N6)<=0,0,MAXA(L6+M6,M6+N6,L6+N6,L6,M6,N6))","v":78},46,48,50,{"$f":"IF(MAXA(P6+Q6,Q6+R6,P6+R6,P6,Q6,R6)<=0,0,MAXA(P6+Q6,Q6+R6,P6+R6,P6,Q6,R6))","v":98},{"$f":"IF(H6=\"\",\"\",IF(OR(O6=0,S6=0),0,O6+S6))","v":176},{"$f":"IF(I6=\"\",\"\",IF(A6=\"H\",10^(0.794358141*LOG(I6/174.393)^2)*T6,IF(A6=\"F\",10^(0.89726074 * LOG(I6/148.026)^2)*T6,\"\")))","v":371.82803824702239},{"$f":"SUM(T6-I6)","v":136},null,{"$f":"IF(A6=\"F\",(IF(OR(H6>2001,H6<2004),VLOOKUP(I6,Feuil1!$G$11:$H$25,2))),IF(A6=\"H\",(IF(OR(H6>2001,H6<2004),VLOOKUP(I6,Feuil1!$A$11:$F$29,2)))))","v":"M40"},null,{"$f":"T6-HLOOKUP(X6,#REF!,2,FALSE)","v":{"$error":"#REF!"}},{"$f":"T6-HLOOKUP(X6,#REF!,3,FALSE)","v":{"$error":"#REF!"}},{"$f":"T6-HLOOKUP(X6,#REF!,4,FALSE)","v":{"$error":"#REF!"}},{"$f":"T6-HLOOKUP(X6,#REF!,5,FALSE)","v":{"$error":"#REF!"}},{"$f":"T6-HLOOKUP(X6,#REF!,6,FALSE)","v":{"$error":"#REF!"}},{"$f":"T6-HLOOKUP(X6,#REF!,7,FALSE)","v":{"$error":"#REF!"}},{"$f":"T6-HLOOKUP(X6,#REF!,8,FALSE)","v":{"$error":"#REF!"}},{"$f":"T6-HLOOKUP(X6,#REF!,9,FALSE)","v":{"$error":"#REF!"}},null,null,null,null,null,null,null,{"$f":"IF(AG6>=0,$AG$4,IF(AF6>=0,$AF$4,IF(AE6>=0,$AE$4,IF(AD6>=0,$AD$4,IF(AC6>=0,$AC$4,IF(AB6>=0,$AB$4,IF(AA6>=0,$AA$4,IF(Z6>=0,$Z$4,$AH$4))))))))","v":{"$error":"#REF!"}}]
["H","NORD","NPC",2,248952,"BUYSSCHAERT","Tristan",2003,35.1,"CHCD COMINES","F",30,32,-34,62,40,42,-44,82,144,349.4682500302215,108.9,null,{"$f":"IF(A7=\"F\",(IF(OR(H7>2001,H7<2004),VLOOKUP(I7,Feuil1!$G$11:$H$25,2))),IF(A7=\"H\",(IF(OR(H7>2001,H7<2004),VLOOKUP(I7,Feuil1!$A$11:$F$29,2)))))","v":"M40"},null,{"$f":"T7-HLOOKUP(X7,#REF!,2,FALSE)","v":{"$error":"#REF!"}},{"$f":"T7-HLOOKUP(X7,#REF!,3,FALSE)","v":{"$error":"#REF!"}},{"$f":"T7-HLOOKUP(X7,#REF!,4,FALSE)","v":{"$error":"#REF!"}},{"$f":"T7-HLOOKUP(X7,#REF!,5,FALSE)","v":{"$error":"#REF!"}},{"$f":"T7-HLOOKUP(X7,#REF!,6,FALSE)","v":{"$error":"#REF!"}},{"$f":"T7-HLOOKUP(X7,#REF!,7,FALSE)","v":{"$error":"#REF!"}},{"$f":"T7-HLOOKUP(X7,#REF!,8,FALSE)","v":{"$error":"#REF!"}},{"$f":"T7-HLOOKUP(X7,#REF!,9,FALSE)","v":{"$error":"#REF!"}},null,null,null,null,null,null,null,{"$error":"#REF!"}]
["H","CO","BRE",3,355330,"OLLIVIER","Leny",2003,35.799999999999997,"AL QUIMPER","F",-26,26,28,54,35,37,38,75,129,306.34271625703104,93.2,null,{"$f":"IF(A8=\"F\",(IF(OR(H8>2001,H8<2004),VLOOKUP(I8,Feuil1!$G$11:$H$25,2))),IF(A8=\"H\",(IF(OR(H8>2001,H8<2004),VLOOKUP(I8,Feuil1!$A$11:$F$29,2)))))","v":"M40"},null,{"$f":"T8-HLOOKUP(X8,#REF!,2,FALSE)","v":{"$error":"#REF!"}},{"$f":"T8-HLOOKUP(X8,#REF!,3,FALSE)","v":{"$error":"#REF!"}},{"$f":"T8-HLOOKUP(X8,#REF!,4,FALSE)","v":{"$error":"#REF!"}},{"$f":"T8-HLOOKUP(X8,#REF!,5,FALSE)","v":{"$error":"#REF!"}},{"$f":"T8-HLOOKUP(X8,#REF!,6,FALSE)","v":{"$error":"#REF!"}},{"$f":"T8-HLOOKUP(X8,#REF!,7,FALSE)","v":{"$error":"#REF!"}},{"$f":"T8-HLOOKUP(X8,#REF!,8,FALSE)","v":{"$error":"#REF!"}},{"$f":"T8-HLOOKUP(X8,#REF!,9,FALSE)","v":{"$error":"#REF!"}},null,null,null,null,null,null,null,{"$error":"#REF!"}]
["H","SEST","RAL",4,359944,"CHABERT","Lucas",2003,38.5,"La Ricamarie","F",24,26,28,54,32,-34,34,66,120,263.6898157984445,81.5,null,{"$f":"IF(A9=\"F\",(IF(OR(H9>2001,H9<2004),VLOOKUP(I9,Feuil1!$G$11:$H$25,2))),IF(A9=\"H\",(IF(OR(H9>2001,H9<2004),VLOOKUP(I9,Feuil1!$A$11:$F$29,2)))))","v":"M40"},null,{"$f":"T9-HLOOKUP(X9,#REF!,2,FALSE)","v":{"$error":"#REF!"}},{"$f":"T9-HLOOKUP(X9,#REF!,3,FALSE)","v":{"$error":"#REF!"}},{"$f":"T9-HLOOKUP(X9,#REF!,4,FALSE)","v":{"$error":"#REF!"}},{"$f":"T9-HLOOKUP(X9,#REF!,5,FALSE)","v":{"$error":"#REF!"}},{"$f":"T9-HLOOKUP(X9,#REF!,6,FALSE)","v":{"$error":"#REF!"}},{"$f":"T9-HLOOKUP(X9,#REF!,7,FALSE)","v":{"$error":"#REF!"}},{"$f":"T9-HLOOKUP(X9,#REF!,8,FALSE)","v":{"$error":"#REF!"}},{"$f":"T9-HLOOKUP(X9,#REF!,9,FALSE)","v":{"$error":"#REF!"}},null,null,null,null,null,null,null,{"$error":"#REF!"}]
["H","SO","MPY",5,378627,"VALEAN","Andrei",2003,39.9,"FIGEAC HC","R",23,25,27,52,31,33,35,68,120,254.16519033566215,80.099999999999994,null,{"$f":"IF(A10=\"F\",(IF(OR(H10>2001,H10<2004),VLOOKUP(I10,Feuil1!$G$11:$H$25,2))),IF(A10=\"H\",(IF(OR(H10>2001,H10<2004),VLOOKUP(I10,Feuil1!$A$11:$F$29,2)))))","v":"M40"},null,{"$f":"T10-HLOOKUP(X10,#REF!,2,FALSE)","v":{"$error":"#REF!"}},{"$f":"T10-HLOOKUP(X10,#REF!,3,FALSE)","v":{"$error":"#REF!"}},{"$f":"T10-HLOOKUP(X10,#REF!,4,FALSE)","v":{"$error":"#REF!"}},{"$f":"T10-HLOOKUP(X10,#REF!,5,FALSE)","v":{"$error":"#REF!"}},{"$f":"T10-HLOOKUP(X10,#REF!,6,FALSE)","v":{"$error":"#REF!"}},{"$f":"T10-HLOOKUP(X10,#REF!,7,FALSE)","v":{"$error":"#REF!"}},{"$f":"T10-HLOOKUP(X10,#REF!,8,FALSE)","v":{"$error":"#REF!"}},{"$f":"T10-HLOOKUP(X10,#REF!,9,FALSE)","v":{"$error":"#REF!"}},null,null,null,null,null,null,null,{"$error":"#REF!"}]
{"$rows_left_out":636}
{"sheet":"Feuil1","index":2,"n_rows":29,"n_cols":62,"rows_kept":29,"cut":false,"hidden":true,"merged":[]}
[null,null,"FC1 44","FC1 48","FC1 53","FC1 58","FC1 63","FC1 69","FC1 +69","FC2 44","FC2 48","FC2 53","FC2 58","FC2 63","FC2 69","FC2 +69","FJ48","FJ53","FJ58","FJ63","FJ69","FJ75","FJ+75","FS48","FS53","FS58","FS63","FS69","FS75","FS+75","C1 50","C1 56","C1 62","C1 69","C1 77","C1 85","C1 94","C1 +94","C2 50","C2 56","C2 62","C2 69","C2 77","C2 85","C2 94","C2 +94","J56","J62","J69","J77","J85","J94","J105","J+105","S56","S62","S69","S77","S85","S94","S105","S+105"]
[null,"DEBUTANT",25,25,35,40,45,50,60,30,35,45,40,55,60,70,45,55,60,65,70,80,90,55,65,70,75,80,95,100,40,50,75,85,90,100,110,120,45,65,85,95,110,120,125,135,80,90,110,130,145,150,155,165,95,120,130,150,165,170,175,185]
[null,"DEPARTEMENTAL",35,35,45,50,55,60,70,40,45,55,50,65,70,80,55,65,70,75,80,95,100,65,75,80,85,90,105,110,55,70,95,105,110,120,130,140,65,85,105,115,130,140,145,155,100,120,130,150,165,170,175,185,115,135,150,170,185,190,195,205]
[null,"REGIONAL",40,45,55,60,65,70,80,50,55,65,60,75,80,95,65,75,80,85,90,105,110,75,85,90,95,105,115,125,65,85,105,115,130,140,145,155,80,100,120,130,150,160,165,175,115,135,150,170,185,190,195,205,130,150,170,190,205,215,220,225]
[null,"INTERREGIONAL",50,55,65,70,75,80,95,60,65,75,70,85,90,105,75,85,90,95,105,115,125,85,95,100,110,120,130,140,80,100,120,130,150,160,165,175,95,115,135,150,170,180,185,195,130,150,170,190,205,215,220,225,145,170,190,210,225,235,245,250]
[null,"FEDERAL",60,65,75,80,85,90,105,70,75,85,80,95,105,115,85,95,100,110,120,130,140,95,105,115,125,135,145,150,95,115,135,150,170,180,185,195,110,130,150,170,185,200,210,220,145,170,190,210,225,235,245,250,170,190,220,240,250,260,270,280]
[null,"NATIONAL",70,75,85,90,95,105,115,80,85,95,90,110,120,130,95,105,115,125,135,145,150,110,120,130,140,150,160,170,110,130,150,170,185,200,210,220,120,145,170,190,200,220,225,235,170,190,220,240,250,260,270,280,190,210,240,265,280,290,300,310]
[null,"INTERNATIONAL B",80,85,95,100,110,120,130,90,95,105,100,125,135,145,110,120,130,140,150,160,170,125,140,150,160,170,180,190,120,145,170,190,200,220,225,235,135,170,190,210,220,240,250,260,190,210,240,260,280,290,300,310,210,230,260,285,300,310,325,330]
[null,"INTERNATIONAL A",90,95,105,115,125,135,145,100,110,120,115,140,150,160,125,135,150,160,170,180,190,140,160,170,180,190,195,210,135,170,190,210,220,240,250,260,150,190,210,230,250,260,280,280,210,230,250,285,300,310,325,330,225,255,275,305,325,330,345,355]
[null,"OLYMPIQUE",1000,1000,1000,1000,1000,1000,1000,1000,1000,1000,1000,1000,1000,1000,1000,1000,1000,1000,1000,1000,1000,155,175,190,200,205,210,225,1000,1000,1000,1000,1000,10000,1000,1000,1000,1000,1000,1000,1000,10000,1000,1000,1000,1000,1000,10000,1000,1000,1000,10000,240,270,290,320,345,355,365,375]
{"$rows_left_out":19}