{"text_format":"1","workbook":"xlsx","n_sheets":3,"sheets":["HOM","Feuil1","Feuil2"],"not_rendered":{"charts":0,"images":1,"macros":1,"external_links":0,"defined_names":3,"comments":1,"pivot_tables":0},"unopened":[],"bounds":{"document_bytes":16777216,"sheet_cells":100000,"rows_first":2000,"rows_last":500,"rows_between":2000,"halvings":0,"cell_chars":16384,"cell_head_chars":4096},"cells_cut":0,"cells_raw":0,"read":"whole","date_system":"1900"}

{"sheet":"HOM","index":0,"n_rows":541,"n_cols":49,"rows_kept":541,"cut":false,"hidden":false,"merged":[[0,5,0,14],[4,21,4,22],[2,7,2,13],[2,18,2,22],[0,18,0,21],[1,15,1,17]]}
[null,null,null,null,null,"LISTING  pour les MASTERS HOMMES",null,null,null,null,null,null,null,null,null,null,"DATE :",null," "]
[null,null,null,null,null," "," "," ",null,null,null,null,null,null,null," ",null,null," "]
[null,null,null,null,null," "," "," ",null,null,null,null,null,null,null,null,null,null," "]
[]
["SEXE","ZONE","REG.","Cl.","LICENCE","NOMS","Prénoms","AN","POIDS","CLUB","NAT",1,2,3,"ARR",1,2,3,"EP-J","Total","IWF SMM","SERIE",null,"Caté","Catég",null,"N.CL.","REG +","FRA +","EUR +","MON +","INTB +","INTA +","OLY +","NCL"]
["H"," "," ",null,null," "," ",1982,85," ","F",null,null,102,{"$f":"IF(I6=\"\",\"\",IF(MAXA(L6:N6)<=0,0,MAXA(L6:N6)))","v":102},133,null,null,{"$f":"IF(I6=\"\",\"\",IF(MAXA(P6:R6)<=0,0,MAXA(P6:R6)))","v":133},{"$f":"IF(I6=\"\",\"\",IF(OR(O6=0,S6=0),0,O6+S6))","v":235},{"$f":"IF(I6=\"\",\"\",IF(A6=\"H\",10^(0.794358141*LOG(I6/174.393)^2)*T6*AS6,IF(A6=\"F\",10^(0.89726074 * LOG(I6/148.026)^2)*T6*AS6,\"\")))","v":301.05319584674669},{"$f":"IF(I6=\"\",\"\",AP6)","v":"MON +"},{"$f":"IF(I6=\"\",\"\",IF(AH6>=0,AH6,IF(AG6>=0,AG6,IF(AF6>=0,AF6,IF(AE6>=0,AE6,IF(AD6>=0,AD6,IF(AC6>=0,AC6,IF(AB6>=0,AB6,AA6))))))))","v":20},{"$f":"IF(AQ6<95,IF(AQ6<=90,VLOOKUP(AQ6,$AQ$255:$AR$444,2)))","v":"V1 H35"},{"$f":"IF(AND(H6<1920),VLOOKUP(I6,Feuil2!$F$10:$P$28,11),IF(AND(H6>=1920,H6<1939),VLOOKUP(I6,Feuil2!$F$10:$P$28,11),IF(AND(H6>=1938,H6<1943),VLOOKUP(I6,Feuil2!$F$10:$P$28,10),IF(AND(H6>=1943,H6<1948),VLOOKUP(I6,Feuil2!$F$10:$P$28,9),IF(AND(H6>=1948,H6<1953),VLOOKUP(I6,Feuil2!$F$10:$P$28,8),IF(AND(H6>=1953,H6<1958),VLOOKUP(I6,Feuil2!$F$10:$P$28,7),IF(AND(H6>=1958,H6<1963),VLOOKUP(I6,Feuil2!$F$10:$P$28,6),IF(AND(H6>=1963,H6<1968),VLOOKUP(I6,Feuil2!$F$10:$P$28,5),IF(AND(H6>=1968,H6<1973),VLOOKUP(I6,Feuil2!$F$10:$P$28,4),IF(AND(H6>=1973,H6<1978),VLOOKUP(I6,Feuil2!$F$10:$P$28,3),IF(AND(H6>=1978,H6<1983),VLOOKUP(I6,Feuil2!$F$10:$P$28,2),VLOOKUP(I6,Feuil2!$F$10:$P$28,2))))))))))))","v":"VH35-85"},null,{"$f":"T6-HLOOKUP(Y6,Feuil2!$C$1:$CD$9,2,FALSE)","v":235},{"$f":"T6-HLOOKUP(Y6,Feuil2!$C$1:$CD$9,3,FALSE)","v":63},{"$f":"T6-HLOOKUP(Y6,Feuil2!$C$1:$CD$9,4,FALSE)","v":53},{"$f":"T6-HLOOKUP(Y6,Feuil2!$C$1:$CD$9,5,FALSE)","v":43},{"$f":"T6-HLOOKUP(Y6,Feuil2!$C$1:$CD$9,6,FALSE)","v":20},{"$f":"T6-HLOOKUP(Y6,Feuil2!$C$1:$CD$9,7,FALSE)","v":-765},{"$f":"T6-HLOOKUP(Y6,Feuil2!$C$1:$CD$9,8,FALSE)","v":-765},{"$f":"T6-HLOOKUP(Y6,Feuil2!$C$1:$CD$9,9,FALSE)","v":-765},null,null,null,null,null,null,null,{"$f":"IF(AH6>=0,$AH$5,IF(AG6>=0,$AG$5,IF(AF6>=0,$AF$5,IF(AE6>=0,$AE$5,IF(AD6>=0,$AD$5,IF(AC6>=0,$AC$5,IF(AB6>=0,$AB$5,IF(AA6>=0,$AA$5,$AI$5))))))))","v":"MON +"},{"$f":"2017-H6","v":35},null,{"$f":"IF(AQ6,VLOOKUP(AQ6,HOM!$AS$389:$AT$444,2))","v":1.0720000000000001}]
["H",null,null,null,null,null,null,1977,77,null,"F",null,null,90,90,120,null,null,120,210,300.15512035733974,"MON +",18,"V2 H40",{"$f":"IF(AND(H7<1920),VLOOKUP(I7,Feuil2!$F$10:$P$28,11),IF(AND(H7>=1920,H7<1939),VLOOKUP(I7,Feuil2!$F$10:$P$28,11),IF(AND(H7>=1938,H7<1943),VLOOKUP(I7,Feuil2!$F$10:$P$28,10),IF(AND(H7>=1943,H7<1948),VLOOKUP(I7,Feuil2!$F$10:$P$28,9),IF(AND(H7>=1948,H7<1953),VLOOKUP(I7,Feuil2!$F$10:$P$28,8),IF(AND(H7>=1953,H7<1958),VLOOKUP(I7,Feuil2!$F$10:$P$28,7),IF(AND(H7>=1958,H7<1963),VLOOKUP(I7,Feuil2!$F$10:$P$28,6),IF(AND(H7>=1963,H7<1968),VLOOKUP(I7,Feuil2!$F$10:$P$28,5),IF(AND(H7>=1968,H7<1973),VLOOKUP(I7,Feuil2!$F$10:$P$28,4),IF(AND(H7>=1973,H7<1978),VLOOKUP(I7,Feuil2!$F$10:$P$28,3),IF(AND(H7>=1978,H7<1983),VLOOKUP(I7,Feuil2!$F$10:$P$28,2),VLOOKUP(I7,Feuil2!$F$10:$P$28,2))))))))))))","v":"VH40-77"},null,{"$f":"T7-HLOOKUP(Y7,Feuil2!$C$1:$CD$9,2,FALSE)","v":210},{"$f":"T7-HLOOKUP(Y7,Feuil2!$C$1:$CD$9,3,FALSE)","v":58},{"$f":"T7-HLOOKUP(Y7,Feuil2!$C$1:$CD$9,4,FALSE)","v":48},{"$f":"T7-HLOOKUP(Y7,Feuil2!$C$1:$CD$9,5,FALSE)","v":38},{"$f":"T7-HLOOKUP(Y7,Feuil2!$C$1:$CD$9,6,FALSE)","v":18},{"$f":"T7-HLOOKUP(Y7,Feuil2!$C$1:$CD$9,7,FALSE)","v":-790},{"$f":"T7-HLOOKUP(Y7,Feuil2!$C$1:$CD$9,8,FALSE)","v":-790},{"$f":"T7-HLOOKUP(Y7,Feuil2!$C$1:$CD$9,9,FALSE)","v":-790},null,null,null,null,null,null,null,"MON +",40,null,{"$f":"IF(AQ7,VLOOKUP(AQ7,HOM!$AS$389:$AT$444,2))","v":1.135}]
["H",null,null,null,null,null,null,1972,77,null,"F",null,null,85,85,100,null,null,100,185,280.26441288494959,"MON +",0,"V3 H45",{"$f":"IF(AND(H8<1920),VLOOKUP(I8,Feuil2!$F$10:$P$28,11),IF(AND(H8>=1920,H8<1939),VLOOKUP(I8,Feuil2!$F$10:$P$28,11),IF(AND(H8>=1938,H8<1943),VLOOKUP(I8,Feuil2!$F$10:$P$28,10),IF(AND(H8>=1943,H8<1948),VLOOKUP(I8,Feuil2!$F$10:$P$28,9),IF(AND(H8>=1948,H8<1953),VLOOKUP(I8,Feuil2!$F$10:$P$28,8),IF(AND(H8>=1953,H8<1958),VLOOKUP(I8,Feuil2!$F$10:$P$28,7),IF(AND(H8>=1958,H8<1963),VLOOKUP(I8,Feuil2!$F$10:$P$28,6),IF(AND(H8>=1963,H8<1968),VLOOKUP(I8,Feuil2!$F$10:$P$28,5),IF(AND(H8>=1968,H8<1973),VLOOKUP(I8,Feuil2!$F$10:$P$28,4),IF(AND(H8>=1973,H8<1978),VLOOKUP(I8,Feuil2!$F$10:$P$28,3),IF(AND(H8>=1978,H8<1983),VLOOKUP(I8,Feuil2!$F$10:$P$28,2),VLOOKUP(I8,Feuil2!$F$10:$P$28,2))))))))))))","v":"VH45-77"},null,{"$f":"T8-HLOOKUP(Y8,Feuil2!$C$1:$CD$9,2,FALSE)","v":185},{"$f":"T8-HLOOKUP(Y8,Feuil2!$C$1:$CD$9,3,FALSE)","v":40},{"$f":"T8-HLOOKUP(Y8,Feuil2!$C$1:$CD$9,4,FALSE)","v":30},{"$f":"T8-HLOOKUP(Y8,Feuil2!$C$1:$CD$9,5,FALSE)","v":20},{"$f":"T8-HLOOKUP(Y8,Feuil2!$C$1:$CD$9,6,FALSE)","v":0},{"$f":"T8-HLOOKUP(Y8,Feuil2!$C$1:$CD$9,7,FALSE)","v":-815},{"$f":"T8-HLOOKUP(Y8,Feuil2!$C$1:$CD$9,8,FALSE)","v":-815},{"$f":"T8-HLOOKUP(Y8,Feuil2!$C$1:$CD$9,9,FALSE)","v":-815},null,null,null,null,null,null,null,"MON +",45,null,{"$f":"IF(AQ8,VLOOKUP(AQ8,HOM!$AS$389:$AT$444,2))","v":1.2030000000000001}]
["H",null,null,null,null,null,null,1967,85,null,"F",null,null,65,65,80,null,null,80,145,221.62520020545571,"REG +",5,"V4 H50",{"$f":"IF(AND(H9<1920),VLOOKUP(I9,Feuil2!$F$10:$P$28,11),IF(AND(H9>=1920,H9<1939),VLOOKUP(I9,Feuil2!$F$10:$P$28,11),IF(AND(H9>=1938,H9<1943),VLOOKUP(I9,Feuil2!$F$10:$P$28,10),IF(AND(H9>=1943,H9<1948),VLOOKUP(I9,Feuil2!$F$10:$P$28,9),IF(AND(H9>=1948,H9<1953),VLOOKUP(I9,Feuil2!$F$10:$P$28,8),IF(AND(H9>=1953,H9<1958),VLOOKUP(I9,Feuil2!$F$10:$P$28,7),IF(AND(H9>=1958,H9<1963),VLOOKUP(I9,Feuil2!$F$10:$P$28,6),IF(AND(H9>=1963,H9<1968),VLOOKUP(I9,Feuil2!$F$10:$P$28,5),IF(AND(H9>=1968,H9<1973),VLOOKUP(I9,Feuil2!$F$10:$P$28,4),IF(AND(H9>=1973,H9<1978),VLOOKUP(I9,Feuil2!$F$10:$P$28,3),IF(AND(H9>=1978,H9<1983),VLOOKUP(I9,Feuil2!$F$10:$P$28,2),VLOOKUP(I9,Feuil2!$F$10:$P$28,2))))))))))))","v":"VH50-85"},null,{"$f":"T9-HLOOKUP(Y9,Feuil2!$C$1:$CD$9,2,FALSE)","v":145},{"$f":"T9-HLOOKUP(Y9,Feuil2!$C$1:$CD$9,3,FALSE)","v":5},{"$f":"T9-HLOOKUP(Y9,Feuil2!$C$1:$CD$9,4,FALSE)","v":-5},{"$f":"T9-HLOOKUP(Y9,Feuil2!$C$1:$CD$9,5,FALSE)","v":-15},{"$f":"T9-HLOOKUP(Y9,Feuil2!$C$1:$CD$9,6,FALSE)","v":-35},{"$f":"T9-HLOOKUP(Y9,Feuil2!$C$1:$CD$9,7,FALSE)","v":-855},{"$f":"T9-HLOOKUP(Y9,Feuil2!$C$1:$CD$9,8,FALSE)","v":-855},{"$f":"T9-HLOOKUP(Y9,Feuil2!$C$1:$CD$9,9,FALSE)","v":-855},null,null,null,null,null,null,null,"REG +",50,null,{"$f":"IF(AQ9,VLOOKUP(AQ9,HOM!$AS$389:$AT$444,2))","v":1.2789999999999999}]
["H",null,null,null,null,null,null,1962,69,null,"F",null,null,89,89,110,null,null,110,199,370.77371184113008,"MON +",59,"V5 H55",{"$f":"IF(AND(H10<1920),VLOOKUP(I10,Feuil2!$F$10:$P$28,11),IF(AND(H10>=1920,H10<1939),VLOOKUP(I10,Feuil2!$F$10:$P$28,11),IF(AND(H10>=1938,H10<1943),VLOOKUP(I10,Feuil2!$F$10:$P$28,10),IF(AND(H10>=1943,H10<1948),VLOOKUP(I10,Feuil2!$F$10:$P$28,9),IF(AND(H10>=1948,H10<1953),VLOOKUP(I10,Feuil2!$F$10:$P$28,8),IF(AND(H10>=1953,H10<1958),VLOOKUP(I10,Feuil2!$F$10:$P$28,7),IF(AND(H10>=1958,H10<1963),VLOOKUP(I10,Feuil2!$F$10:$P$28,6),IF(AND(H10>=1963,H10<1968),VLOOKUP(I10,Feuil2!$F$10:$P$28,5),IF(AND(H10>=1968,H10<1973),VLOOKUP(I10,Feuil2!$F$10:$P$28,4),IF(AND(H10>=1973,H10<1978),VLOOKUP(I10,Feuil2!$F$10:$P$28,3),IF(AND(H10>=1978,H10<1983),VLOOKUP(I10,Feuil2!$F$10:$P$28,2),VLOOKUP(I10,Feuil2!$F$10:$P$28,2))))))))))))","v":"VH55-69"},null,{"$f":"T10-HLOOKUP(Y10,Feuil2!$C$1:$CD$9,2,FALSE)","v":199},{"$f":"T10-HLOOKUP(Y10,Feuil2!$C$1:$CD$9,3,FALSE)","v":94},{"$f":"T10-HLOOKUP(Y10,Feuil2!$C$1:$CD$9,4,FALSE)","v":84},{"$f":"T10-HLOOKUP(Y10,Feuil2!$C$1:$CD$9,5,FALSE)","v":74},{"$f":"T10-HLOOKUP(Y10,Feuil2!$C$1:$CD$9,6,FALSE)","v":59},{"$f":"T10-HLOOKUP(Y10,Feuil2!$C$1:$CD$9,7,FALSE)","v":-801},{"$f":"T10-HLOOKUP(Y10,Feuil2!$C$1:$CD$9,8,FALSE)","v":-801},{"$f":"T10-HLOOKUP(Y10,Feuil2!$C$1:$CD$9,9,FALSE)","v":-801},null,null,null,null,null,null,null,"MON +",55,null,{"$f":"IF(AQ10,VLOOKUP(AQ10,HOM!$AS$389:$AT$444,2))","v":1.385}]
["H",null,null,null,null,null,null,1957,77,null,"F",null,null,65,{"$f":"IF(I11=\"\",\"\",IF(MAXA(L11:N11)<=0,0,MAXA(L11:N11)))","v":65},80,null,null,80,145,276.45501813319402,"MON +",8,"V6 H60",{"$f":"IF(AND(H11<1920),VLOOKUP(I11,Feuil2!$F$10:$P$28,11),IF(AND(H11>=1920,H11<1939),VLOOKUP(I11,Feuil2!$F$10:$P$28,11),IF(AND(H11>=1938,H11<1943),VLOOKUP(I11,Feuil2!$F$10:$P$28,10),IF(AND(H11>=1943,H11<1948),VLOOKUP(I11,Feuil2!$F$10:$P$28,9),IF(AND(H11>=1948,H11<1953),VLOOKUP(I11,Feuil2!$F$10:$P$28,8),IF(AND(H11>=1953,H11<1958),VLOOKUP(I11,Feuil2!$F$10:$P$28,7),IF(AND(H11>=1958,H11<1963),VLOOKUP(I11,Feuil2!$F$10:$P$28,6),IF(AND(H11>=1963,H11<1968),VLOOKUP(I11,Feuil2!$F$10:$P$28,5),IF(AND(H11>=1968,H11<1973),VLOOKUP(I11,Feuil2!$F$10:$P$28,4),IF(AND(H11>=1973,H11<1978),VLOOKUP(I11,Feuil2!$F$10:$P$28,3),IF(AND(H11>=1978,H11<1983),VLOOKUP(I11,Feuil2!$F$10:$P$28,2),VLOOKUP(I11,Feuil2!$F$10:$P$28,2))))))))))))","v":"VH60-77"},null,{"$f":"T11-HLOOKUP(Y11,Feuil2!$C$1:$CD$9,2,FALSE)","v":145},{"$f":"T11-HLOOKUP(Y11,Feuil2!$C$1:$CD$9,3,FALSE)","v":43},{"$f":"T11-HLOOKUP(Y11,Feuil2!$C$1:$CD$9,4,FALSE)","v":33},{"$f":"T11-HLOOKUP(Y11,Feuil2!$C$1:$CD$9,5,FALSE)","v":23},{"$f":"T11-HLOOKUP(Y11,Feuil2!$C$1:$CD$9,6,FALSE)","v":8},{"$f":"T11-HLOOKUP(Y11,Feuil2!$C$1:$CD$9,7,FALSE)","v":-855},{"$f":"T11-HLOOKUP(Y11,Feuil2!$C$1:$CD$9,8,FALSE)","v":-855},{"$f":"T11-HLOOKUP(Y11,Feuil2!$C$1:$CD$9,9,FALSE)","v":-855},null,null,null,null,null,null,null,"MON +",60,null,{"$f":"IF(AQ11,VLOOKUP(AQ11,HOM!$AS$389:$AT$444,2))","v":1.514}]
["H",null,null,null,null,null,null,1952,69,null,"F",null,null,65,65,80,null,null,80,145,324.38916243604626,"MON +",33,"V7 H65",{"$f":"IF(AND(H12<1920),VLOOKUP(I12,Feuil2!$F$10:$P$28,11),IF(AND(H12>=1920,H12<1939),VLOOKUP(I12,Feuil2!$F$10:$P$28,11),IF(AND(H12>=1938,H12<1943),VLOOKUP(I12,Feuil2!$F$10:$P$28,10),IF(AND(H12>=1943,H12<1948),VLOOKUP(I12,Feuil2!$F$10:$P$28,9),IF(AND(H12>=1948,H12<1953),VLOOKUP(I12,Feuil2!$F$10:$P$28,8),IF(AND(H12>=1953,H12<1958),VLOOKUP(I12,Feuil2!$F$10:$P$28,7),IF(AND(H12>=1958,H12<1963),VLOOKUP(I12,Feuil2!$F$10:$P$28,6),IF(AND(H12>=1963,H12<1968),VLOOKUP(I12,Feuil2!$F$10:$P$28,5),IF(AND(H12>=1968,H12<1973),VLOOKUP(I12,Feuil2!$F$10:$P$28,4),IF(AND(H12>=1973,H12<1978),VLOOKUP(I12,Feuil2!$F$10:$P$28,3),IF(AND(H12>=1978,H12<1983),VLOOKUP(I12,Feuil2!$F$10:$P$28,2),VLOOKUP(I12,Feuil2!$F$10:$P$28,2))))))))))))","v":"VH65-69"},null,{"$f":"T12-HLOOKUP(Y12,Feuil2!$C$1:$CD$9,2,FALSE)","v":145},{"$f":"T12-HLOOKUP(Y12,Feuil2!$C$1:$CD$9,3,FALSE)","v":68},{"$f":"T12-HLOOKUP(Y12,Feuil2!$C$1:$CD$9,4,FALSE)","v":58},{"$f":"T12-HLOOKUP(Y12,Feuil2!$C$1:$CD$9,5,FALSE)","v":48},{"$f":"T12-HLOOKUP(Y12,Feuil2!$C$1:$CD$9,6,FALSE)","v":33},{"$f":"T12-HLOOKUP(Y12,Feuil2!$C$1:$CD$9,7,FALSE)","v":-855},{"$f":"T12-HLOOKUP(Y12,Feuil2!$C$1:$CD$9,8,FALSE)","v":-855},{"$f":"T12-HLOOKUP(Y12,Feuil2!$C$1:$CD$9,9,FALSE)","v":-855},null,null,null,null,null,null,null,"MON +",65,null,{"$f":"IF(AQ12,VLOOKUP(AQ12,HOM!$AS$389:$AT$444,2))","v":1.663}]
["H",null,null,null,null,null,null,1947,77,null,"F",null,null,65,65,80,null,null,80,145,340.91249594099946,"MON +",48,"V8 H70",{"$f":"IF(AND(H13<1920),VLOOKUP(I13,Feuil2!$F$10:$P$28,11),IF(AND(H13>=1920,H13<1939),VLOOKUP(I13,Feuil2!$F$10:$P$28,11),IF(AND(H13>=1938,H13<1943),VLOOKUP(I13,Feuil2!$F$10:$P$28,10),IF(AND(H13>=1943,H13<1948),VLOOKUP(I13,Feuil2!$F$10:$P$28,9),IF(AND(H13>=1948,H13<1953),VLOOKUP(I13,Feuil2!$F$10:$P$28,8),IF(AND(H13>=1953,H13<1958),VLOOKUP(I13,Feuil2!$F$10:$P$28,7),IF(AND(H13>=1958,H13<1963),VLOOKUP(I13,Feuil2!$F$10:$P$28,6),IF(AND(H13>=1963,H13<1968),VLOOKUP(I13,Feuil2!$F$10:$P$28,5),IF(AND(H13>=1968,H13<1973),VLOOKUP(I13,Feuil2!$F$10:$P$28,4),IF(AND(H13>=1973,H13<1978),VLOOKUP(I13,Feuil2!$F$10:$P$28,3),IF(AND(H13>=1978,H13<1983),VLOOKUP(I13,Feuil2!$F$10:$P$28,2),VLOOKUP(I13,Feuil2!$F$10:$P$28,2))))))))))))","v":"VH70-77"},null,{"$f":"T13-HLOOKUP(Y13,Feuil2!$C$1:$CD$9,2,FALSE)","v":145},{"$f":"T13-HLOOKUP(Y13,Feuil2!$C$1:$CD$9,3,FALSE)","v":75},{"$f":"T13-HLOOKUP(Y13,Feuil2!$C$1:$CD$9,4,FALSE)","v":65},{"$f":"T13-HLOOKUP(Y13,Feuil2!$C$1:$CD$9,5,FALSE)","v":55},{"$f":"T13-HLOOKUP(Y13,Feuil2!$C$1:$CD$9,6,FALSE)","v":48},{"$f":"T13-HLOOKUP(Y13,Feuil2!$C$1:$CD$9,7,FALSE)","v":-855},{"$f":"T13-HLOOKUP(Y13,Feuil2!$C$1:$CD$9,8,FALSE)","v":-855},{"$f":"T13-HLOOKUP(Y13,Feuil2!$C$1:$CD$9,9,FALSE)","v":-855},null,null,null,null,null,null,null,"MON +",70,null,{"$f":"IF(AQ13,VLOOKUP(AQ13,HOM!$AS$389:$AT$444,2))","v":1.867}]
["H",null,null,null,null,null,null,1942,75,null,"F",null,null,65,65,80,null,null,80,145,392.43711687457613,"MON +",58,"V9 H75",{"$f":"IF(AND(H14<1920),VLOOKUP(I14,Feuil2!$F$10:$P$28,11),IF(AND(H14>=1920,H14<1939),VLOOKUP(I14,Feuil2!$F$10:$P$28,11),IF(AND(H14>=1938,H14<1943),VLOOKUP(I14,Feuil2!$F$10:$P$28,10),IF(AND(H14>=1943,H14<1948),VLOOKUP(I14,Feuil2!$F$10:$P$28,9),IF(AND(H14>=1948,H14<1953),VLOOKUP(I14,Feuil2!$F$10:$P$28,8),IF(AND(H14>=1953,H14<1958),VLOOKUP(I14,Feuil2!$F$10:$P$28,7),IF(AND(H14>=1958,H14<1963),VLOOKUP(I14,Feuil2!$F$10:$P$28,6),IF(AND(H14>=1963,H14<1968),VLOOKUP(I14,Feuil2!$F$10:$P$28,5),IF(AND(H14>=1968,H14<1973),VLOOKUP(I14,Feuil2!$F$10:$P$28,4),IF(AND(H14>=1973,H14<1978),VLOOKUP(I14,Feuil2!$F$10:$P$28,3),IF(AND(H14>=1978,H14<1983),VLOOKUP(I14,Feuil2!$F$10:$P$28,2),VLOOKUP(I14,Feuil2!$F$10:$P$28,2))))))))))))","v":"VH75-77"},null,{"$f":"T14-HLOOKUP(Y14,Feuil2!$C$1:$CD$9,2,FALSE)","v":145},{"$f":"T14-HLOOKUP(Y14,Feuil2!$C$1:$CD$9,3,FALSE)","v":83},{"$f":"T14-HLOOKUP(Y14,Feuil2!$C$1:$CD$9,4,FALSE)","v":73},{"$f":"T14-HLOOKUP(Y14,Feuil2!$C$1:$CD$9,5,FALSE)","v":63},{"$f":"T14-HLOOKUP(Y14,Feuil2!$C$1:$CD$9,6,FALSE)","v":58},{"$f":"T14-HLOOKUP(Y14,Feuil2!$C$1:$CD$9,7,FALSE)","v":-855},{"$f":"T14-HLOOKUP(Y14,Feuil2!$C$1:$CD$9,8,FALSE)","v":-855},{"$f":"T14-HLOOKUP(Y14,Feuil2!$C$1:$CD$9,9,FALSE)","v":-855},null,null,null,null,null,null,null,"MON +",75,null,{"$f":"IF(AQ14,VLOOKUP(AQ14,HOM!$AS$389:$AT$444,2))","v":2.117}]
["H",null,null,null,null,null,null,1937,65,null,"F",null,null,30,30,40,null,null,40,70,245.28162789102348,"MON +",10,"V10 H80+",{"$f":"IF(AND(H15<1920),VLOOKUP(I15,Feuil2!$F$10:$P$28,11),IF(AND(H15>=1920,H15<1939),VLOOKUP(I15,Feuil2!$F$10:$P$28,11),IF(AND(H15>=1938,H15<1943),VLOOKUP(I15,Feuil2!$F$10:$P$28,10),IF(AND(H15>=1943,H15<1948),VLOOKUP(I15,Feuil2!$F$10:$P$28,9),IF(AND(H15>=1948,H15<1953),VLOOKUP(I15,Feuil2!$F$10:$P$28,8),IF(AND(H15>=1953,H15<1958),VLOOKUP(I15,Feuil2!$F$10:$P$28,7),IF(AND(H15>=1958,H15<1963),VLOOKUP(I15,Feuil2!$F$10:$P$28,6),IF(AND(H15>=1963,H15<1968),VLOOKUP(I15,Feuil2!$F$10:$P$28,5),IF(AND(H15>=1968,H15<1973),VLOOKUP(I15,Feuil2!$F$10:$P$28,4),IF(AND(H15>=1973,H15<1978),VLOOKUP(I15,Feuil2!$F$10:$P$28,3),IF(AND(H15>=1978,H15<1983),VLOOKUP(I15,Feuil2!$F$10:$P$28,2),VLOOKUP(I15,Feuil2!$F$10:$P$28,2))))))))))))","v":"VH80+-69"},null,{"$f":"T15-HLOOKUP(Y15,Feuil2!$C$1:$CD$9,2,FALSE)","v":70},{"$f":"T15-HLOOKUP(Y15,Feuil2!$C$1:$CD$9,3,FALSE)","v":20},{"$f":"T15-HLOOKUP(Y15,Feuil2!$C$1:$CD$9,4,FALSE)","v":12},{"$f":"T15-HLOOKUP(Y15,Feuil2!$C$1:$CD$9,5,FALSE)","v":11},{"$f":"T15-HLOOKUP(Y15,Feuil2!$C$1:$CD$9,6,FALSE)","v":10},{"$f":"T15-HLOOKUP(Y15,Feuil2!$C$1:$CD$9,7,FALSE)","v":-930},{"$f":"T15-HLOOKUP(Y15,Feuil2!$C$1:$CD$9,8,FALSE)","v":-930},{"$f":"T15-HLOOKUP(Y15,Feuil2!$C$1:$CD$9,9,FALSE)","v":-930},null,null,null,null,null,null,null,"MON +",80,null,{"$f":"IF(AQ15,VLOOKUP(AQ15,HOM!$AS$389:$AT$444,2))","v":2.504}]
["H",null,null,null,null,null,null,null,null,null,null,null,null,null,"",null,null,null,"","","","","",false,{"$f":"IF(AND(H16<1920),VLOOKUP(I16,Feuil2!$F$10:$P$28,11),IF(AND(H16>=1920,H16<1939),VLOOKUP(I16,Feuil2!$F$10:$P$28,11),IF(AND(H16>=1938,H16<1943),VLOOKUP(I16,Feuil2!$F$10:$P$28,10),IF(AND(H16>=1943,H16<1948),VLOOKUP(I16,Feuil2!$F$10:$P$28,9),IF(AND(H16>=1948,H16<1953),VLOOKUP(I16,Feuil2!$F$10:$P$28,8),IF(AND(H16>=1953,H16<1958),VLOOKUP(I16,Feuil2!$F$10:$P$28,7),IF(AND(H16>=1958,H16<1963),VLOOKUP(I16,Feuil2!$F$10:$P$28,6),IF(AND(H16>=1963,H16<1968),VLOOKUP(I16,Feuil2!$F$10:$P$28,5),IF(AND(H16>=1968,H16<1973),VLOOKUP(I16,Feuil2!$F$10:$P$28,4),IF(AND(H16>=1973,H16<1978),VLOOKUP(I16,Feuil2!$F$10:$P$28,3),IF(AND(H16>=1978,H16<1983),VLOOKUP(I16,Feuil2!$F$10:$P$28,2),VLOOKUP(I16,Feuil2!$F$10:$P$28,2))))))))))))","v":{"$error":"#N/A"}},null,{"$f":"T16-HLOOKUP(Y16,Feuil2!$C$1:$CD$9,2,FALSE)","v":{"$error":"#VALUE!"}},{"$f":"T16-HLOOKUP(Y16,Feuil2!$C$1:$CD$9,3,FALSE)","v":{"$error":"#VALUE!"}},{"$f":"T16-HLOOKUP(Y16,Feuil2!$C$1:$CD$9,4,FALSE)","v":{"$error":"#VALUE!"}},{"$f":"T16-HLOOKUP(Y16,Feuil2!$C$1:$CD$9,5,FALSE)","v":{"$error":"#VALUE!"}},{"$f":"T16-HLOOKUP(Y16,Feuil2!$C$1:$CD$9,6,FALSE)","v":{"$error":"#VALUE!"}},{"$f":"T16-HLOOKUP(Y16,Feuil2!$C$1:$CD$9,7,FALSE)","v":{"$error":"#VALUE!"}},{"$f":"T16-HLOOKUP(Y16,Feuil2!$C$1:$CD$9,8,FALSE)","v":{"$error":"#VALUE!"}},{"$f":"T16-HLOOKUP(Y16,Feuil2!$C$1:$CD$9,9,FALSE)","v":{"$error":"#VALUE!"}},null,null,null,null,null,null,null,{"$error":"#VALUE!"},2017,null,{"$f":"IF(AQ16,VLOOKUP(AQ16,HOM!$AS$389:$AT$444,2))","v":4.4930000000000003}]
["H",null,null,null,null,null,null,null,null,null,null,null,null,null,"",null,null,null,"","","","","",false,{"$f":"IF(AND(H17<1920),VLOOKUP(I17,Feuil2!$F$10:$P$28,11),IF(AND(H17>=1920,H17<1939),VLOOKUP(I17,Feuil2!$F$10:$P$28,11),IF(AND(H17>=1938,H17<1943),VLOOKUP(I17,Feuil2!$F$10:$P$28,10),IF(AND(H17>=1943,H17<1948),VLOOKUP(I17,Feuil2!$F$10:$P$28,9),IF(AND(H17>=1948,H17<1953),VLOOKUP(I17,Feuil2!$F$10:$P$28,8),IF(AND(H17>=1953,H17<1958),VLOOKUP(I17,Feuil2!$F$10:$P$28,7),IF(AND(H17>=1958,H17<1963),VLOOKUP(I17,Feuil2!$F$10:$P$28,6),IF(AND(H17>=1963,H17<1968),VLOOKUP(I17,Feuil2!$F$10:$P$28,5),IF(AND(H17>=1968,H17<1973),VLOOKUP(I17,Feuil2!$F$10:$P$28,4),IF(AND(H17>=1973,H17<1978),VLOOKUP(I17,Feuil2!$F$10:$P$28,3),IF(AND(H17>=1978,H17<1983),VLOOKUP(I17,Feuil2!$F$10:$P$28,2),VLOOKUP(I17,Feuil2!$F$10:$P$28,2))))))))))))","v":{"$error":"#N/A"}},null,{"$f":"T17-HLOOKUP(Y17,Feuil2!$C$1:$CD$9,2,FALSE)","v":{"$error":"#VALUE!"}},{"$f":"T17-HLOOKUP(Y17,Feuil2!$C$1:$CD$9,3,FALSE)","v":{"$error":"#VALUE!"}},{"$f":"T17-HLOOKUP(Y17,Feuil2!$C$1:$CD$9,4,FALSE)","v":{"$error":"#VALUE!"}},{"$f":"T17-HLOOKUP(Y17,Feuil2!$C$1:$CD$9,5,FALSE)","v":{"$error":"#VALUE!"}},{"$f":"T17-HLOOKUP(Y17,Feuil2!$C$1:$CD$9,6,FALSE)","v":{"$error":"#VALUE!"}},{"$f":"T17-HLOOKUP(Y17,Feuil2!$C$1:$CD$9,7,FALSE)","v":{"$error":"#VALUE!"}},{"$f":"T17-HLOOKUP(Y17,Feuil2!$C$1:$CD$9,8,FALSE)","v":{"$error":"#VALUE!"}},{"$f":"T17-HLOOKUP(Y17,Feuil2!$C$1:$CD$9,9,FALSE)","v":{"$error":"#VALUE!"}},null,null,null,null,null,null,null,{"$error":"#VALUE!"},2017,null,{"$f":"IF(AQ17,VLOOKUP(AQ17,HOM!$AS$389:$AT$444,2))","v":4.4930000000000003}]
["H",null,null,null,null,null,null,null,null,null,null,null,null,null,"",null,null,null,"","","","","",false,{"$f":"IF(AND(H18<1920),VLOOKUP(I18,Feuil2!$F$10:$P$28,11),IF(AND(H18>=1920,H18<1939),VLOOKUP(I18,Feuil2!$F$10:$P$28,11),IF(AND(H18>=1938,H18<1943),VLOOKUP(I18,Feuil2!$F$10:$P$28,10),IF(AND(H18>=1943,H18<1948),VLOOKUP(I18,Feuil2!$F$10:$P$28,9),IF(AND(H18>=1948,H18<1953),VLOOKUP(I18,Feuil2!$F$10:$P$28,8),IF(AND(H18>=1953,H18<1958),VLOOKUP(I18,Feuil2!$F$10:$P$28,7),IF(AND(H18>=1958,H18<1963),VLOOKUP(I18,Feuil2!$F$10:$P$28,6),IF(AND(H18>=1963,H18<1968),VLOOKUP(I18,Feuil2!$F$10:$P$28,5),IF(AND(H18>=1968,H18<1973),VLOOKUP(I18,Feuil2!$F$10:$P$28,4),IF(AND(H18>=1973,H18<1978),VLOOKUP(I18,Feuil2!$F$10:$P$28,3),IF(AND(H18>=1978,H18<1983),VLOOKUP(I18,Feuil2!$F$10:$P$28,2),VLOOKUP(I18,Feuil2!$F$10:$P$28,2))))))))))))","v":{"$error":"#N/A"}},null,{"$f":"T18-HLOOKUP(Y18,Feuil2!$C$1:$CD$9,2,FALSE)","v":{"$error":"#VALUE!"}},{"$f":"T18-HLOOKUP(Y18,Feuil2!$C$1:$CD$9,3,FALSE)","v":{"$error":"#VALUE!"}},{"$f":"T18-HLOOKUP(Y18,Feuil2!$C$1:$CD$9,4,FALSE)","v":{"$error":"#VALUE!"}},{"$f":"T18-HLOOKUP(Y18,Feuil2!$C$1:$CD$9,5,FALSE)","v":{"$error":"#VALUE!"}},{"$f":"T18-HLOOKUP(Y18,Feuil2!$C$1:$CD$9,6,FALSE)","v":{"$error":"#VALUE!"}},{"$f":"T18-HLOOKUP(Y18,Feuil2!$C$1:$CD$9,7,FALSE)","v":{"$error":"#VALUE!"}},{"$f":"T18-HLOOKUP(Y18,Feuil2!$C$1:$CD$9,8,FALSE)","v":{"$error":"#VALUE!"}},{"$f":"T18-HLOOKUP(Y18,Feuil2!$C$1:$CD$9,9,FALSE)","v":{"$error":"#VALUE!"}},null,null,null,null,null,null,null,{"$error":"#VALUE!"},2017,null,{"$f":"IF(AQ18,VLOOKUP(AQ18,HOM!$AS$389:$AT$444,2))","v":4.4930000000000003}]
["H",null,null,null,null,null,null,null,null,null,null,null,null,null,"",null,null,null,"","","","","",false,{"$f":"IF(AND(H19<1920),VLOOKUP(I19,Feuil2!$F$10:$P$28,11),IF(AND(H19>=1920,H19<1939),VLOOKUP(I19,Feuil2!$F$10:$P$28,11),IF(AND(H19>=1938,H19<1943),VLOOKUP(I19,Feuil2!$F$10:$P$28,10),IF(AND(H19>=1943,H19<1948),VLOOKUP(I19,Feuil2!$F$10:$P$28,9),IF(AND(H19>=1948,H19<1953),VLOOKUP(I19,Feuil2!$F$10:$P$28,8),IF(AND(H19>=1953,H19<1958),VLOOKUP(I19,Feuil2!$F$10:$P$28,7),IF(AND(H19>=1958,H19<1963),VLOOKUP(I19,Feuil2!$F$10:$P$28,6),IF(AND(H19>=1963,H19<1968),VLOOKUP(I19,Feuil2!$F$10:$P$28,5),IF(AND(H19>=1968,H19<1973),VLOOKUP(I19,Feuil2!$F$10:$P$28,4),IF(AND(H19>=1973,H19<1978),VLOOKUP(I19,Feuil2!$F$10:$P$28,3),IF(AND(H19>=1978,H19<1983),VLOOKUP(I19,Feuil2!$F$10:$P$28,2),VLOOKUP(I19,Feuil2!$F$10:$P$28,2))))))))))))","v":{"$error":"#N/A"}},null,{"$f":"T19-HLOOKUP(Y19,Feuil2!$C$1:$CD$9,2,FALSE)","v":{"$error":"#VALUE!"}},{"$f":"T19-HLOOKUP(Y19,Feuil2!$C$1:$CD$9,3,FALSE)","v":{"$error":"#VALUE!"}},{"$f":"T19-HLOOKUP(Y19,Feuil2!$C$1:$CD$9,4,FALSE)","v":{"$error":"#VALUE!"}},{"$f":"T19-HLOOKUP(Y19,Feuil2!$C$1:$CD$9,5,FALSE)","v":{"$error":"#VALUE!"}},{"$f":"T19-HLOOKUP(Y19,Feuil2!$C$1:$CD$9,6,FALSE)","v":{"$error":"#VALUE!"}},{"$f":"T19-HLOOKUP(Y19,Feuil2!$C$1:$CD$9,7,FALSE)","v":{"$error":"#VALUE!"}},{"$f":"T19-HLOOKUP(Y19,Feuil2!$C$1:$CD$9,8,FALSE)","v":{"$error":"#VALUE!"}},{"$f":"T19-HLOOKUP(Y19,Feuil2!$C$1:$CD$9,9,FALSE)","v":{"$error":"#VALUE!"}},null,null,null,null,null,null,null,{"$error":"#VALUE!"},2017,null,{"$f":"IF(AQ19,VLOOKUP(AQ19,HOM!$AS$389:$AT$444,2))","v":4.4930000000000003}]
["H",null,null,null,null,null,null,null,null,null,null,null,null,null,"",null,null,null,"","","","","",false,{"$f":"IF(AND(H20<1920),VLOOKUP(I20,Feuil2!$F$10:$P$28,11),IF(AND(H20>=1920,H20<1939),VLOOKUP(I20,Feuil2!$F$10:$P$28,11),IF(AND(H20>=1938,H20<1943),VLOOKUP(I20,Feuil2!$F$10:$P$28,10),IF(AND(H20>=1943,H20<1948),VLOOKUP(I20,Feuil2!$F$10:$P$28,9),IF(AND(H20>=1948,H20<1953),VLOOKUP(I20,Feuil2!$F$10:$P$28,8),IF(AND(H20>=1953,H20<1958),VLOOKUP(I20,Feuil2!$F$10:$P$28,7),IF(AND(H20>=1958,H20<1963),VLOOKUP(I20,Feuil2!$F$10:$P$28,6),IF(AND(H20>=1963,H20<1968),VLOOKUP(I20,Feuil2!$F$10:$P$28,5),IF(AND(H20>=1968,H20<1973),VLOOKUP(I20,Feuil2!$F$10:$P$28,4),IF(AND(H20>=1973,H20<1978),VLOOKUP(I20,Feuil2!$F$10:$P$28,3),IF(AND(H20>=1978,H20<1983),VLOOKUP(I20,Feuil2!$F$10:$P$28,2),VLOOKUP(I20,Feuil2!$F$10:$P$28,2))))))))))))","v":{"$error":"#N/A"}},null,{"$f":"T20-HLOOKUP(Y20,Feuil2!$C$1:$CD$9,2,FALSE)","v":{"$error":"#VALUE!"}},{"$f":"T20-HLOOKUP(Y20,Feuil2!$C$1:$CD$9,3,FALSE)","v":{"$error":"#VALUE!"}},{"$f":"T20-HLOOKUP(Y20,Feuil2!$C$1:$CD$9,4,FALSE)","v":{"$error":"#VALUE!"}},{"$f":"T20-HLOOKUP(Y20,Feuil2!$C$1:$CD$9,5,FALSE)","v":{"$error":"#VALUE!"}},{"$f":"T20-HLOOKUP(Y20,Feuil2!$C$1:$CD$9,6,FALSE)","v":{"$error":"#VALUE!"}},{"$f":"T20-HLOOKUP(Y20,Feuil2!$C$1:$CD$9,7,FALSE)","v":{"$error":"#VALUE!"}},{"$f":"T20-HLOOKUP(Y20,Feuil2!$C$1:$CD$9,8,FALSE)","v":{"$error":"#VALUE!"}},{"$f":"T20-HLOOKUP(Y20,Feuil2!$C$1:$CD$9,9,FALSE)","v":{"$error":"#VALUE!"}},null,null,null,null,null,null,null,{"$error":"#VALUE!"},2017,null,{"$f":"IF(AQ20,VLOOKUP(AQ20,HOM!$AS$389:$AT$444,2))","v":4.4930000000000003}]
["H",null,null,null,null,null,null,null,null,null,null,null,null,null,"",null,null,null,"","","","","",false,{"$f":"IF(AND(H21<1920),VLOOKUP(I21,Feuil2!$F$10:$P$28,11),IF(AND(H21>=1920,H21<1939),VLOOKUP(I21,Feuil2!$F$10:$P$28,11),IF(AND(H21>=1938,H21<1943),VLOOKUP(I21,Feuil2!$F$10:$P$28,10),IF(AND(H21>=1943,H21<1948),VLOOKUP(I21,Feuil2!$F$10:$P$28,9),IF(AND(H21>=1948,H21<1953),VLOOKUP(I21,Feuil2!$F$10:$P$28,8),IF(AND(H21>=1953,H21<1958),VLOOKUP(I21,Feuil2!$F$10:$P$28,7),IF(AND(H21>=1958,H21<1963),VLOOKUP(I21,Feuil2!$F$10:$P$28,6),IF(AND(H21>=1963,H21<1968),VLOOKUP(I21,Feuil2!$F$10:$P$28,5),IF(AND(H21>=1968,H21<1973),VLOOKUP(I21,Feuil2!$F$10:$P$28,4),IF(AND(H21>=1973,H21<1978),VLOOKUP(I21,Feuil2!$F$10:$P$28,3),IF(AND(H21>=1978,H21<1983),VLOOKUP(I21,Feuil2!$F$10:$P$28,2),VLOOKUP(I21,Feuil2!$F$10:$P$28,2))))))))))))","v":{"$error":"#N/A"}},null,{"$f":"T21-HLOOKUP(Y21,Feuil2!$C$1:$CD$9,2,FALSE)","v":{"$error":"#VALUE!"}},{"$f":"T21-HLOOKUP(Y21,Feuil2!$C$1:$CD$9,3,FALSE)","v":{"$error":"#VALUE!"}},{"$f":"T21-HLOOKUP(Y21,Feuil2!$C$1:$CD$9,4,FALSE)","v":{"$error":"#VALUE!"}},{"$f":"T21-HLOOKUP(Y21,Feuil2!$C$1:$CD$9,5,FALSE)","v":{"$error":"#VALUE!"}},{"$f":"T21-HLOOKUP(Y21,Feuil2!$C$1:$CD$9,6,FALSE)","v":{"$error":"#VALUE!"}},{"$f":"T21-HLOOKUP(Y21,Feuil2!$C$1:$CD$9,7,FALSE)","v":{"$error":"#VALUE!"}},{"$f":"T21-HLOOKUP(Y21,Feuil2!$C$1:$CD$9,8,FALSE)","v":{"$error":"#VALUE!"}},{"$f":"T21-HLOOKUP(Y21,Feuil2!$C$1:$CD$9,9,FALSE)","v":{"$error":"#VALUE!"}},null,null,null,null,null,null,null,{"$error":"#VALUE!"},2017,null,{"$f":"IF(AQ21,VLOOKUP(AQ21,HOM!$AS$389:$AT$444,2))","v":4.4930000000000003}]
["H",null,null,null,null,null,null,null,null,null,null,null,null,null,"",null,null,null,"","","","","",false,{"$f":"IF(AND(H22<1920),VLOOKUP(I22,Feuil2!$F$10:$P$28,11),IF(AND(H22>=1920,H22<1939),VLOOKUP(I22,Feuil2!$F$10:$P$28,11),IF(AND(H22>=1938,H22<1943),VLOOKUP(I22,Feuil2!$F$10:$P$28,10),IF(AND(H22>=1943,H22<1948),VLOOKUP(I22,Feuil2!$F$10:$P$28,9),IF(AND(H22>=1948,H22<1953),VLOOKUP(I22,Feuil2!$F$10:$P$28,8),IF(AND(H22>=1953,H22<1958),VLOOKUP(I22,Feuil2!$F$10:$P$28,7),IF(AND(H22>=1958,H22<1963),VLOOKUP(I22,Feuil2!$F$10:$P$28,6),IF(AND(H22>=1963,H22<1968),VLOOKUP(I22,Feuil2!$F$10:$P$28,5),IF(AND(H22>=1968,H22<1973),VLOOKUP(I22,Feuil2!$F$10:$P$28,4),IF(AND(H22>=1973,H22<1978),VLOOKUP(I22,Feuil2!$F$10:$P$28,3),IF(AND(H22>=1978,H22<1983),VLOOKUP(I22,Feuil2!$F$10:$P$28,2),VLOOKUP(I22,Feuil2!$F$10:$P$28,2))))))))))))","v":{"$error":"#N/A"}},null,{"$f":"T22-HLOOKUP(Y22,Feuil2!$C$1:$CD$9,2,FALSE)","v":{"$error":"#VALUE!"}},{"$f":"T22-HLOOKUP(Y22,Feuil2!$C$1:$CD$9,3,FALSE)","v":{"$error":"#VALUE!"}},{"$f":"T22-HLOOKUP(Y22,Feuil2!$C$1:$CD$9,4,FALSE)","v":{"$error":"#VALUE!"}},{"$f":"T22-HLOOKUP(Y22,Feuil2!$C$1:$CD$9,5,FALSE)","v":{"$error":"#VALUE!"}},{"$f":"T22-HLOOKUP(Y22,Feuil2!$C$1:$CD$9,6,FALSE)","v":{"$error":"#VALUE!"}},{"$f":"T22-HLOOKUP(Y22,Feuil2!$C$1:$CD$9,7,FALSE)","v":{"$error":"#VALUE!"}},{"$f":"T22-HLOOKUP(Y22,Feuil2!$C$1:$CD$9,8,FALSE)","v":{"$error":"#VALUE!"}},{"$f":"T22-HLOOKUP(Y22,Feuil2!$C$1:$CD$9,9,FALSE)","v":{"$error":"#VALUE!"}},null,null,null,null,null,null,null,{"$error":"#VALUE!"},2017,null,{"$f":"IF(AQ22,VLOOKUP(AQ22,HOM!$AS$389:$AT$444,2))","v":4.4930000000000003}]
["H",null,null,null,null,null,null,null,null,null,null,null,null,null,"",null,null,null,"","","","","",false,{"$f":"IF(AND(H23<1920),VLOOKUP(I23,Feuil2!$F$10:$P$28,11),IF(AND(H23>=1920,H23<1939),VLOOKUP(I23,Feuil2!$F$10:$P$28,11),IF(AND(H23>=1938,H23<1943),VLOOKUP(I23,Feuil2!$F$10:$P$28,10),IF(AND(H23>=1943,H23<1948),VLOOKUP(I23,Feuil2!$F$10:$P$28,9),IF(AND(H23>=1948,H23<1953),VLOOKUP(I23,Feuil2!$F$10:$P$28,8),IF(AND(H23>=1953,H23<1958),VLOOKUP(I23,Feuil2!$F$10:$P$28,7),IF(AND(H23>=1958,H23<1963),VLOOKUP(I23,Feuil2!$F$10:$P$28,6),IF(AND(H23>=1963,H23<1968),VLOOKUP(I23,Feuil2!$F$10:$P$28,5),IF(AND(H23>=1968,H23<1973),VLOOKUP(I23,Feuil2!$F$10:$P$28,4),IF(AND(H23>=1973,H23<1978),VLOOKUP(I23,Feuil2!$F$10:$P$28,3),IF(AND(H23>=1978,H23<1983),VLOOKUP(I23,Feuil2!$F$10:$P$28,2),VLOOKUP(I23,Feuil2!$F$10:$P$28,2))))))))))))","v":{"$error":"#N/A"}},null,{"$f":"T23-HLOOKUP(Y23,Feuil2!$C$1:$CD$9,2,FALSE)","v":{"$error":"#VALUE!"}},{"$f":"T23-HLOOKUP(Y23,Feuil2!$C$1:$CD$9,3,FALSE)","v":{"$error":"#VALUE!"}},{"$f":"T23-HLOOKUP(Y23,Feuil2!$C$1:$CD$9,4,FALSE)","v":{"$error":"#VALUE!"}},{"$f":"T23-HLOOKUP(Y23,Feuil2!$C$1:$CD$9,5,FALSE)","v":{"$error":"#VALUE!"}},{"$f":"T23-HLOOKUP(Y23,Feuil2!$C$1:$CD$9,6,FALSE)","v":{"$error":"#VALUE!"}},{"$f":"T23-HLOOKUP(Y23,Feuil2!$C$1:$CD$9,7,FALSE)","v":{"$error":"#VALUE!"}},{"$f":"T23-HLOOKUP(Y23,Feuil2!$C$1:$CD$9,8,FALSE)","v":{"$error":"#VALUE!"}},{"$f":"T23-HLOOKUP(Y23,Feuil2!$C$1:$CD$9,9,FALSE)","v":{"$error":"#VALUE!"}},null,null,null,null,null,null,null,{"$error":"#VALUE!"},2017,null,{"$f":"IF(AQ23,VLOOKUP(AQ23,HOM!$AS$389:$AT$444,2))","v":4.4930000000000003}]
["H",null,null,null,null,null,null,null,null,null,null,null,null,null,"",null,null,null,"","","","","",false,{"$f":"IF(AND(H24<1920),VLOOKUP(I24,Feuil2!$F$10:$P$28,11),IF(AND(H24>=1920,H24<1939),VLOOKUP(I24,Feuil2!$F$10:$P$28,11),IF(AND(H24>=1938,H24<1943),VLOOKUP(I24,Feuil2!$F$10:$P$28,10),IF(AND(H24>=1943,H24<1948),VLOOKUP(I24,Feuil2!$F$10:$P$28,9),IF(AND(H24>=1948,H24<1953),VLOOKUP(I24,Feuil2!$F$10:$P$28,8),IF(AND(H24>=1953,H24<1958),VLOOKUP(I24,Feuil2!$F$10:$P$28,7),IF(AND(H24>=1958,H24<1963),VLOOKUP(I24,Feuil2!$F$10:$P$28,6),IF(AND(H24>=1963,H24<1968),VLOOKUP(I24,Feuil2!$F$10:$P$28,5),IF(AND(H24>=1968,H24<1973),VLOOKUP(I24,Feuil2!$F$10:$P$28,4),IF(AND(H24>=1973,H24<1978),VLOOKUP(I24,Feuil2!$F$10:$P$28,3),IF(AND(H24>=1978,H24<1983),VLOOKUP(I24,Feuil2!$F$10:$P$28,2),VLOOKUP(I24,Feuil2!$F$10:$P$28,2))))))))))))","v":{"$error":"#N/A"}},null,{"$f":"T24-HLOOKUP(Y24,Feuil2!$C$1:$CD$9,2,FALSE)","v":{"$error":"#VALUE!"}},{"$f":"T24-HLOOKUP(Y24,Feuil2!$C$1:$CD$9,3,FALSE)","v":{"$error":"#VALUE!"}},{"$f":"T24-HLOOKUP(Y24,Feuil2!$C$1:$CD$9,4,FALSE)","v":{"$error":"#VALUE!"}},{"$f":"T24-HLOOKUP(Y24,Feuil2!$C$1:$CD$9,5,FALSE)","v":{"$error":"#VALUE!"}},{"$f":"T24-HLOOKUP(Y24,Feuil2!$C$1:$CD$9,6,FALSE)","v":{"$error":"#VALUE!"}},{"$f":"T24-HLOOKUP(Y24,Feuil2!$C$1:$CD$9,7,FALSE)","v":{"$error":"#VALUE!"}},{"$f":"T24-HLOOKUP(Y24,Feuil2!$C$1:$CD$9,8,FALSE)","v":{"$error":"#VALUE!"}},{"$f":"T24-HLOOKUP(Y24,Feuil2!$C$1:$CD$9,9,FALSE)","v":{"$error":"#VALUE!"}},null,null,null,null,null,null,null,{"$error":"#VALUE!"},2017,null,{"$f":"IF(AQ24,VLOOKUP(AQ24,HOM!$AS$389:$AT$444,2))","v":4.4930000000000003}]
["H",null,null,null,null,null,null,null,null,null,null,null,null,null,"",null,null,null,"","","","","",false,{"$f":"IF(AND(H25<1920),VLOOKUP(I25,Feuil2!$F$10:$P$28,11),IF(AND(H25>=1920,H25<1939),VLOOKUP(I25,Feuil2!$F$10:$P$28,11),IF(AND(H25>=1938,H25<1943),VLOOKUP(I25,Feuil2!$F$10:$P$28,10),IF(AND(H25>=1943,H25<1948),VLOOKUP(I25,Feuil2!$F$10:$P$28,9),IF(AND(H25>=1948,H25<1953),VLOOKUP(I25,Feuil2!$F$10:$P$28,8),IF(AND(H25>=1953,H25<1958),VLOOKUP(I25,Feuil2!$F$10:$P$28,7),IF(AND(H25>=1958,H25<1963),VLOOKUP(I25,Feuil2!$F$10:$P$28,6),IF(AND(H25>=1963,H25<1968),VLOOKUP(I25,Feuil2!$F$10:$P$28,5),IF(AND(H25>=1968,H25<1973),VLOOKUP(I25,Feuil2!$F$10:$P$28,4),IF(AND(H25>=1973,H25<1978),VLOOKUP(I25,Feuil2!$F$10:$P$28,3),IF(AND(H25>=1978,H25<1983),VLOOKUP(I25,Feuil2!$F$10:$P$28,2),VLOOKUP(I25,Feuil2!$F$10:$P$28,2))))))))))))","v":{"$error":"#N/A"}},null,{"$f":"T25-HLOOKUP(Y25,Feuil2!$C$1:$CD$9,2,FALSE)","v":{"$error":"#VALUE!"}},{"$f":"T25-HLOOKUP(Y25,Feuil2!$C$1:$CD$9,3,FALSE)","v":{"$error":"#VALUE!"}},{"$f":"T25-HLOOKUP(Y25,Feuil2!$C$1:$CD$9,4,FALSE)","v":{"$error":"#VALUE!"}},{"$f":"T25-HLOOKUP(Y25,Feuil2!$C$1:$CD$9,5,FALSE)","v":{"$error":"#VALUE!"}},{"$f":"T25-HLOOKUP(Y25,Feuil2!$C$1:$CD$9,6,FALSE)","v":{"$error":"#VALUE!"}},{"$f":"T25-HLOOKUP(Y25,Feuil2!$C$1:$CD$9,7,FALSE)","v":{"$error":"#VALUE!"}},{"$f":"T25-HLOOKUP(Y25,Feuil2!$C$1:$CD$9,8,FALSE)","v":{"$error":"#VALUE!"}},{"$f":"T25-HLOOKUP(Y25,Feuil2!$C$1:$CD$9,9,FALSE)","v":{"$error":"#VALUE!"}},null,null,null,null,null,null,null,{"$error":"#VALUE!"},2017,null,{"$f":"IF(AQ25,VLOOKUP(AQ25,HOM!$AS$389:$AT$444,2))","v":4.4930000000000003}]
["H",null,null,null,null,null,null,null,null,null,null,null,null,null,"",null,null,null,"","","","","",false,{"$f":"IF(AND(H26<1920),VLOOKUP(I26,Feuil2!$F$10:$P$28,11),IF(AND(H26>=1920,H26<1939),VLOOKUP(I26,Feuil2!$F$10:$P$28,11),IF(AND(H26>=1938,H26<1943),VLOOKUP(I26,Feuil2!$F$10:$P$28,10),IF(AND(H26>=1943,H26<1948),VLOOKUP(I26,Feuil2!$F$10:$P$28,9),IF(AND(H26>=1948,H26<1953),VLOOKUP(I26,Feuil2!$F$10:$P$28,8),IF(AND(H26>=1953,H26<1958),VLOOKUP(I26,Feuil2!$F$10:$P$28,7),IF(AND(H26>=1958,H26<1963),VLOOKUP(I26,Feuil2!$F$10:$P$28,6),IF(AND(H26>=1963,H26<1968),VLOOKUP(I26,Feuil2!$F$10:$P$28,5),IF(AND(H26>=1968,H26<1973),VLOOKUP(I26,Feuil2!$F$10:$P$28,4),IF(AND(H26>=1973,H26<1978),VLOOKUP(I26,Feuil2!$F$10:$P$28,3),IF(AND(H26>=1978,H26<1983),VLOOKUP(I26,Feuil2!$F$10:$P$28,2),VLOOKUP(I26,Feuil2!$F$10:$P$28,2))))))))))))","v":{"$error":"#N/A"}},null,{"$f":"T26-HLOOKUP(Y26,Feuil2!$C$1:$CD$9,2,FALSE)","v":{"$error":"#VALUE!"}},{"$f":"T26-HLOOKUP(Y26,Feuil2!$C$1:$CD$9,3,FALSE)","v":{"$error":"#VALUE!"}},{"$f":"T26-HLOOKUP(Y26,Feuil2!$C$1:$CD$9,4,FALSE)","v":{"$error":"#VALUE!"}},{"$f":"T26-HLOOKUP(Y26,Feuil2!$C$1:$CD$9,5,FALSE)","v":{"$error":"#VALUE!"}},{"$f":"T26-HLOOKUP(Y26,Feuil2!$C$1:$CD$9,6,FALSE)","v":{"$error":"#VALUE!"}},{"$f":"T26-HLOOKUP(Y26,Feuil2!$C$1:$CD$9,7,FALSE)","v":{"$error":"#VALUE!"}},{"$f":"T26-HLOOKUP(Y26,Feuil2!$C$1:$CD$9,8,FALSE)","v":{"$error":"#VALUE!"}},{"$f":"T26-HLOOKUP(Y26,Feuil2!$C$1:$CD$9,9,FALSE)","v":{"$error":"#VALUE!"}},null,null,null,null,null,null,null,{"$error":"#VALUE!"},2017,null,{"$f":"IF(AQ26,VLOOKUP(AQ26,HOM!$AS$389:$AT$444,2))","v":4.4930000000000003}]
["H",null,null,null,null,null,null,null,null,null,null,null,null,null,"",null,null,null,"","","","","",false,{"$f":"IF(AND(H27<1920),VLOOKUP(I27,Feuil2!$F$10:$P$28,11),IF(AND(H27>=1920,H27<1939),VLOOKUP(I27,Feuil2!$F$10:$P$28,11),IF(AND(H27>=1938,H27<1943),VLOOKUP(I27,Feuil2!$F$10:$P$28,10),IF(AND(H27>=1943,H27<1948),VLOOKUP(I27,Feuil2!$F$10:$P$28,9),IF(AND(H27>=1948,H27<1953),VLOOKUP(I27,Feuil2!$F$10:$P$28,8),IF(AND(H27>=1953,H27<1958),VLOOKUP(I27,Feuil2!$F$10:$P$28,7),IF(AND(H27>=1958,H27<1963),VLOOKUP(I27,Feuil2!$F$10:$P$28,6),IF(AND(H27>=1963,H27<1968),VLOOKUP(I27,Feuil2!$F$10:$P$28,5),IF(AND(H27>=1968,H27<1973),VLOOKUP(I27,Feuil2!$F$10:$P$28,4),IF(AND(H27>=1973,H27<1978),VLOOKUP(I27,Feuil2!$F$10:$P$28,3),IF(AND(H27>=1978,H27<1983),VLOOKUP(I27,Feuil2!$F$10:$P$28,2),VLOOKUP(I27,Feuil2!$F$10:$P$28,2))))))))))))","v":{"$error":"#N/A"}},null,{"$f":"T27-HLOOKUP(Y27,Feuil2!$C$1:$CD$9,2,FALSE)","v":{"$error":"#VALUE!"}},{"$f":"T27-HLOOKUP(Y27,Feuil2!$C$1:$CD$9,3,FALSE)","v":{"$error":"#VALUE!"}},{"$f":"T27-HLOOKUP(Y27,Feuil2!$C$1:$CD$9,4,FALSE)","v":{"$error":"#VALUE!"}},{"$f":"T27-HLOOKUP(Y27,Feuil2!$C$1:$CD$9,5,FALSE)","v":{"$error":"#VALUE!"}},{"$f":"T27-HLOOKUP(Y27,Feuil2!$C$1:$CD$9,6,FALSE)","v":{"$error":"#VALUE!"}},{"$f":"T27-HLOOKUP(Y27,Feuil2!$C$1:$CD$9,7,FALSE)","v":{"$error":"#VALUE!"}},{"$f":"T27-HLOOKUP(Y27,Feuil2!$C$1:$CD$9,8,FALSE)","v":{"$error":"#VALUE!"}},{"$f":"T27-HLOOKUP(Y27,Feuil2!$C$1:$CD$9,9,FALSE)","v":{"$error":"#VALUE!"}},null,null,null,null,null,null,null,{"$error":"#VALUE!"},2017,null,{"$f":"IF(AQ27,VLOOKUP(AQ27,HOM!$AS$389:$AT$444,2))","v":4.4930000000000003}]
["H",null,null,null,null,null,null,null,null,null,null,null,null,null,"",null,null,null,"","","","","",false,{"$f":"IF(AND(H28<1920),VLOOKUP(I28,Feuil2!$F$10:$P$28,11),IF(AND(H28>=1920,H28<1939),VLOOKUP(I28,Feuil2!$F$10:$P$28,11),IF(AND(H28>=1938,H28<1943),VLOOKUP(I28,Feuil2!$F$10:$P$28,10),IF(AND(H28>=1943,H28<1948),VLOOKUP(I28,Feuil2!$F$10:$P$28,9),IF(AND(H28>=1948,H28<1953),VLOOKUP(I28,Feuil2!$F$10:$P$28,8),IF(AND(H28>=1953,H28<1958),VLOOKUP(I28,Feuil2!$F$10:$P$28,7),IF(AND(H28>=1958,H28<1963),VLOOKUP(I28,Feuil2!$F$10:$P$28,6),IF(AND(H28>=1963,H28<1968),VLOOKUP(I28,Feuil2!$F$10:$P$28,5),IF(AND(H28>=1968,H28<1973),VLOOKUP(I28,Feuil2!$F$10:$P$28,4),IF(AND(H28>=1973,H28<1978),VLOOKUP(I28,Feuil2!$F$10:$P$28,3),IF(AND(H28>=1978,H28<1983),VLOOKUP(I28,Feuil2!$F$10:$P$28,2),VLOOKUP(I28,Feuil2!$F$10:$P$28,2))))))))))))","v":{"$error":"#N/A"}},null,{"$f":"T28-HLOOKUP(Y28,Feuil2!$C$1:$CD$9,2,FALSE)","v":{"$error":"#VALUE!"}},{"$f":"T28-HLOOKUP(Y28,Feuil2!$C$1:$CD$9,3,FALSE)","v":{"$error":"#VALUE!"}},{"$f":"T28-HLOOKUP(Y28,Feuil2!$C$1:$CD$9,4,FALSE)","v":{"$error":"#VALUE!"}},{"$f":"T28-HLOOKUP(Y28,Feuil2!$C$1:$CD$9,5,FALSE)","v":{"$error":"#VALUE!"}},{"$f":"T28-HLOOKUP(Y28,Feuil2!$C$1:$CD$9,6,FALSE)","v":{"$error":"#VALUE!"}},{"$f":"T28-HLOOKUP(Y28,Feuil2!$C$1:$CD$9,7,FALSE)","v":{"$error":"#VALUE!"}},{"$f":"T28-HLOOKUP(Y28,Feuil2!$C$1:$CD$9,8,FALSE)","v":{"$error":"#VALUE!"}},{"$f":"T28-HLOOKUP(Y28,Feuil2!$C$1:$CD$9,9,FALSE)","v":{"$error":"#VALUE!"}},null,null,null,null,null,null,null,{"$error":"#VALUE!"},2017,null,{"$f":"IF(AQ28,VLOOKUP(AQ28,HOM!$AS$389:$AT$444,2))","v":4.4930000000000003}]
["H",null,null,null,null,null,null,null,null,null,null,null,null,null,"",null,null,null,"","","","","",false,{"$f":"IF(AND(H29<1920),VLOOKUP(I29,Feuil2!$F$10:$P$28,11),IF(AND(H29>=1920,H29<1939),VLOOKUP(I29,Feuil2!$F$10:$P$28,11),IF(AND(H29>=1938,H29<1943),VLOOKUP(I29,Feuil2!$F$10:$P$28,10),IF(AND(H29>=1943,H29<1948),VLOOKUP(I29,Feuil2!$F$10:$P$28,9),IF(AND(H29>=1948,H29<1953),VLOOKUP(I29,Feuil2!$F$10:$P$28,8),IF(AND(H29>=1953,H29<1958),VLOOKUP(I29,Feuil2!$F$10:$P$28,7),IF(AND(H29>=1958,H29<1963),VLOOKUP(I29,Feuil2!$F$10:$P$28,6),IF(AND(H29>=1963,H29<1968),VLOOKUP(I29,Feuil2!$F$10:$P$28,5),IF(AND(H29>=1968,H29<1973),VLOOKUP(I29,Feuil2!$F$10:$P$28,4),IF(AND(H29>=1973,H29<1978),VLOOKUP(I29,Feuil2!$F$10:$P$28,3),IF(AND(H29>=1978,H29<1983),VLOOKUP(I29,Feuil2!$F$10:$P$28,2),VLOOKUP(I29,Feuil2!$F$10:$P$28,2))))))))))))","v":{"$error":"#N/A"}},null,{"$f":"T29-HLOOKUP(Y29,Feuil2!$C$1:$CD$9,2,FALSE)","v":{"$error":"#VALUE!"}},{"$f":"T29-HLOOKUP(Y29,Feuil2!$C$1:$CD$9,3,FALSE)","v":{"$error":"#VALUE!"}},{"$f":"T29-HLOOKUP(Y29,Feuil2!$C$1:$CD$9,4,FALSE)","v":{"$error":"#VALUE!"}},{"$f":"T29-HLOOKUP(Y29,Feuil2!$C$1:$CD$9,5,FALSE)","v":{"$error":"#VALUE!"}},{"$f":"T29-HLOOKUP(Y29,Feuil2!$C$1:$CD$9,6,FALSE)","v":{"$error":"#VALUE!"}},{"$f":"T29-HLOOKUP(Y29,Feuil2!$C$1:$CD$9,7,FALSE)","v":{"$error":"#VALUE!"}},{"$f":"T29-HLOOKUP(Y29,Feuil2!$C$1:$CD$9,8,FALSE)","v":{"$error":"#VALUE!"}},{"$f":"T29-HLOOKUP(Y29,Feuil2!$C$1:$CD$9,9,FALSE)","v":{"$error":"#VALUE!"}},null,null,null,null,null,null,null,{"$error":"#VALUE!"},2017,null,{"$f":"IF(AQ29,VLOOKUP(AQ29,HOM!$AS$389:$AT$444,2))","v":4.4930000000000003}]
["H",null,null,null,null,null,null,null,null,null,null,null,null,null,"",null,null,null,"","","","","",false,{"$f":"IF(AND(H30<1920),VLOOKUP(I30,Feuil2!$F$10:$P$28,11),IF(AND(H30>=1920,H30<1939),VLOOKUP(I30,Feuil2!$F$10:$P$28,11),IF(AND(H30>=1938,H30<1943),VLOOKUP(I30,Feuil2!$F$10:$P$28,10),IF(AND(H30>=1943,H30<1948),VLOOKUP(I30,Feuil2!$F$10:$P$28,9),IF(AND(H30>=1948,H30<1953),VLOOKUP(I30,Feuil2!$F$10:$P$28,8),IF(AND(H30>=1953,H30<1958),VLOOKUP(I30,Feuil2!$F$10:$P$28,7),IF(AND(H30>=1958,H30<1963),VLOOKUP(I30,Feuil2!$F$10:$P$28,6),IF(AND(H30>=1963,H30<1968),VLOOKUP(I30,Feuil2!$F$10:$P$28,5),IF(AND(H30>=1968,H30<1973),VLOOKUP(I30,Feuil2!$F$10:$P$28,4),IF(AND(H30>=1973,H30<1978),VLOOKUP(I30,Feuil2!$F$10:$P$28,3),IF(AND(H30>=1978,H30<1983),VLOOKUP(I30,Feuil2!$F$10:$P$28,2),VLOOKUP(I30,Feuil2!$F$10:$P$28,2))))))))))))","v":{"$error":"#N/A"}},null,{"$f":"T30-HLOOKUP(Y30,Feuil2!$C$1:$CD$9,2,FALSE)","v":{"$error":"#VALUE!"}},{"$f":"T30-HLOOKUP(Y30,Feuil2!$C$1:$CD$9,3,FALSE)","v":{"$error":"#VALUE!"}},{"$f":"T30-HLOOKUP(Y30,Feuil2!$C$1:$CD$9,4,FALSE)","v":{"$error":"#VALUE!"}},{"$f":"T30-HLOOKUP(Y30,Feuil2!$C$1:$CD$9,5,FALSE)","v":{"$error":"#VALUE!"}},{"$f":"T30-HLOOKUP(Y30,Feuil2!$C$1:$CD$9,6,FALSE)","v":{"$error":"#VALUE!"}},{"$f":"T30-HLOOKUP(Y30,Feuil2!$C$1:$CD$9,7,FALSE)","v":{"$error":"#VALUE!"}},{"$f":"T30-HLOOKUP(Y30,Feuil2!$C$1:$CD$9,8,FALSE)","v":{"$error":"#VALUE!"}},{"$f":"T30-HLOOKUP(Y30,Feuil2!$C$1:$CD$9,9,FALSE)","v":{"$error":"#VALUE!"}},null,null,null,null,null,null,null,{"$error":"#VALUE!"},2017,null,{"$f":"IF(AQ30,VLOOKUP(AQ30,HOM!$AS$389:$AT$444,2))","v":4.4930000000000003}]
["H",null,null,null,null,null,null,null,null,null,null,null,null,null,"",null,null,null,"","","","","",false,{"$f":"IF(AND(H31<1920),VLOOKUP(I31,Feuil2!$F$10:$P$28,11),IF(AND(H31>=1920,H31<1939),VLOOKUP(I31,Feuil2!$F$10:$P$28,11),IF(AND(H31>=1938,H31<1943),VLOOKUP(I31,Feuil2!$F$10:$P$28,10),IF(AND(H31>=1943,H31<1948),VLOOKUP(I31,Feuil2!$F$10:$P$28,9),IF(AND(H31>=1948,H31<1953),VLOOKUP(I31,Feuil2!$F$10:$P$28,8),IF(AND(H31>=1953,H31<1958),VLOOKUP(I31,Feuil2!$F$10:$P$28,7),IF(AND(H31>=1958,H31<1963),VLOOKUP(I31,Feuil2!$F$10:$P$28,6),IF(AND(H31>=1963,H31<1968),VLOOKUP(I31,Feuil2!$F$10:$P$28,5),IF(AND(H31>=1968,H31<1973),VLOOKUP(I31,Feuil2!$F$10:$P$28,4),IF(AND(H31>=1973,H31<1978),VLOOKUP(I31,Feuil2!$F$10:$P$28,3),IF(AND(H31>=1978,H31<1983),VLOOKUP(I31,Feuil2!$F$10:$P$28,2),VLOOKUP(I31,Feuil2!$F$10:$P$28,2))))))))))))","v":{"$error":"#N/A"}},null,{"$f":"T31-HLOOKUP(Y31,Feuil2!$C$1:$CD$9,2,FALSE)","v":{"$error":"#VALUE!"}},{"$f":"T31-HLOOKUP(Y31,Feuil2!$C$1:$CD$9,3,FALSE)","v":{"$error":"#VALUE!"}},{"$f":"T31-HLOOKUP(Y31,Feuil2!$C$1:$CD$9,4,FALSE)","v":{"$error":"#VALUE!"}},{"$f":"T31-HLOOKUP(Y31,Feuil2!$C$1:$CD$9,5,FALSE)","v":{"$error":"#VALUE!"}},{"$f":"T31-HLOOKUP(Y31,Feuil2!$C$1:$CD$9,6,FALSE)","v":{"$error":"#VALUE!"}},{"$f":"T31-HLOOKUP(Y31,Feuil2!$C$1:$CD$9,7,FALSE)","v":{"$error":"#VALUE!"}},{"$f":"T31-HLOOKUP(Y31,Feuil2!$C$1:$CD$9,8,FALSE)","v":{"$error":"#VALUE!"}},{"$f":"T31-HLOOKUP(Y31,Feuil2!$C$1:$CD$9,9,FALSE)","v":{"$error":"#VALUE!"}},null,null,null,null,null,null,null,{"$error":"#VALUE!"},2017,null,{"$f":"IF(AQ31,VLOOKUP(AQ31,HOM!$AS$389:$AT$444,2))","v":4.4930000000000003}]
["H",null,null,null,null,null,null,null,null,null,null,null,null,null,"",null,null,null,"","","","","",false,{"$f":"IF(AND(H32<1920),VLOOKUP(I32,Feuil2!$F$10:$P$28,11),IF(AND(H32>=1920,H32<1939),VLOOKUP(I32,Feuil2!$F$10:$P$28,11),IF(AND(H32>=1938,H32<1943),VLOOKUP(I32,Feuil2!$F$10:$P$28,10),IF(AND(H32>=1943,H32<1948),VLOOKUP(I32,Feuil2!$F$10:$P$28,9),IF(AND(H32>=1948,H32<1953),VLOOKUP(I32,Feuil2!$F$10:$P$28,8),IF(AND(H32>=1953,H32<1958),VLOOKUP(I32,Feuil2!$F$10:$P$28,7),IF(AND(H32>=1958,H32<1963),VLOOKUP(I32,Feuil2!$F$10:$P$28,6),IF(AND(H32>=1963,H32<1968),VLOOKUP(I32,Feuil2!$F$10:$P$28,5),IF(AND(H32>=1968,H32<1973),VLOOKUP(I32,Feuil2!$F$10:$P$28,4),IF(AND(H32>=1973,H32<1978),VLOOKUP(I32,Feuil2!$F$10:$P$28,3),IF(AND(H32>=1978,H32<1983),VLOOKUP(I32,Feuil2!$F$10:$P$28,2),VLOOKUP(I32,Feuil2!$F$10:$P$28,2))))))))))))","v":{"$error":"#N/A"}},null,{"$f":"T32-HLOOKUP(Y32,Feuil2!$C$1:$CD$9,2,FALSE)","v":{"$error":"#VALUE!"}},{"$f":"T32-HLOOKUP(Y32,Feuil2!$C$1:$CD$9,3,FALSE)","v":{"$error":"#VALUE!"}},{"$f":"T32-HLOOKUP(Y32,Feuil2!$C$1:$CD$9,4,FALSE)","v":{"$error":"#VALUE!"}},{"$f":"T32-HLOOKUP(Y32,Feuil2!$C$1:$CD$9,5,FALSE)","v":{"$error":"#VALUE!"}},{"$f":"T32-HLOOKUP(Y32,Feuil2!$C$1:$CD$9,6,FALSE)","v":{"$error":"#VALUE!"}},{"$f":"T32-HLOOKUP(Y32,Feuil2!$C$1:$CD$9,7,FALSE)","v":{"$error":"#VALUE!"}},{"$f":"T32-HLOOKUP(Y32,Feuil2!$C$1:$CD$9,8,FALSE)","v":{"$error":"#VALUE!"}},{"$f":"T32-HLOOKUP(Y32,Feuil2!$C$1:$CD$9,9,FALSE)","v":{"$error":"#VALUE!"}},null,null,null,null,null,null,null,{"$error":"#VALUE!"},2017,null,{"$f":"IF(AQ32,VLOOKUP(AQ32,HOM!$AS$389:$AT$444,2))","v":4.4930000000000003}]
["H",null,null,null,null,null,null,null,null,null,null,null,null,null,"",null,null,null,"","","","","",false,{"$f":"IF(AND(H33<1920),VLOOKUP(I33,Feuil2!$F$10:$P$28,11),IF(AND(H33>=1920,H33<1939),VLOOKUP(I33,Feuil2!$F$10:$P$28,11),IF(AND(H33>=1938,H33<1943),VLOOKUP(I33,Feuil2!$F$10:$P$28,10),IF(AND(H33>=1943,H33<1948),VLOOKUP(I33,Feuil2!$F$10:$P$28,9),IF(AND(H33>=1948,H33<1953),VLOOKUP(I33,Feuil2!$F$10:$P$28,8),IF(AND(H33>=1953,H33<1958),VLOOKUP(I33,Feuil2!$F$10:$P$28,7),IF(AND(H33>=1958,H33<1963),VLOOKUP(I33,Feuil2!$F$10:$P$28,6),IF(AND(H33>=1963,H33<1968),VLOOKUP(I33,Feuil2!$F$10:$P$28,5),IF(AND(H33>=1968,H33<1973),VLOOKUP(I33,Feuil2!$F$10:$P$28,4),IF(AND(H33>=1973,H33<1978),VLOOKUP(I33,Feuil2!$F$10:$P$28,3),IF(AND(H33>=1978,H33<1983),VLOOKUP(I33,Feuil2!$F$10:$P$28,2),VLOOKUP(I33,Feuil2!$F$10:$P$28,2))))))))))))","v":{"$error":"#N/A"}},null,{"$f":"T33-HLOOKUP(Y33,Feuil2!$C$1:$CD$9,2,FALSE)","v":{"$error":"#VALUE!"}},{"$f":"T33-HLOOKUP(Y33,Feuil2!$C$1:$CD$9,3,FALSE)","v":{"$error":"#VALUE!"}},{"$f":"T33-HLOOKUP(Y33,Feuil2!$C$1:$CD$9,4,FALSE)","v":{"$error":"#VALUE!"}},{"$f":"T33-HLOOKUP(Y33,Feuil2!$C$1:$CD$9,5,FALSE)","v":{"$error":"#VALUE!"}},{"$f":"T33-HLOOKUP(Y33,Feuil2!$C$1:$CD$9,6,FALSE)","v":{"$error":"#VALUE!"}},{"$f":"T33-HLOOKUP(Y33,Feuil2!$C$1:$CD$9,7,FALSE)","v":{"$error":"#VALUE!"}},{"$f":"T33-HLOOKUP(Y33,Feuil2!$C$1:$CD$9,8,FALSE)","v":{"$error":"#VALUE!"}},{"$f":"T33-HLOOKUP(Y33,Feuil2!$C$1:$CD$9,9,FALSE)","v":{"$error":"#VALUE!"}},null,null,null,null,null,null,null,{"$error":"#VALUE!"},2017,null,{"$f":"IF(AQ33,VLOOKUP(AQ33,HOM!$AS$389:$AT$444,2))","v":4.4930000000000003}]
["H",null,null,null,null,null,null,null,null,null,null,null,null,null,"",null,null,null,"","","","","",false,{"$f":"IF(AND(H34<1920),VLOOKUP(I34,Feuil2!$F$10:$P$28,11),IF(AND(H34>=1920,H34<1939),VLOOKUP(I34,Feuil2!$F$10:$P$28,11),IF(AND(H34>=1938,H34<1943),VLOOKUP(I34,Feuil2!$F$10:$P$28,10),IF(AND(H34>=1943,H34<1948),VLOOKUP(I34,Feuil2!$F$10:$P$28,9),IF(AND(H34>=1948,H34<1953),VLOOKUP(I34,Feuil2!$F$10:$P$28,8),IF(AND(H34>=1953,H34<1958),VLOOKUP(I34,Feuil2!$F$10:$P$28,7),IF(AND(H34>=1958,H34<1963),VLOOKUP(I34,Feuil2!$F$10:$P$28,6),IF(AND(H34>=1963,H34<1968),VLOOKUP(I34,Feuil2!$F$10:$P$28,5),IF(AND(H34>=1968,H34<1973),VLOOKUP(I34,Feuil2!$F$10:$P$28,4),IF(AND(H34>=1973,H34<1978),VLOOKUP(I34,Feuil2!$F$10:$P$28,3),IF(AND(H34>=1978,H34<1983),VLOOKUP(I34,Feuil2!$F$10:$P$28,2),VLOOKUP(I34,Feuil2!$F$10:$P$28,2))))))))))))","v":{"$error":"#N/A"}},null,{"$f":"T34-HLOOKUP(Y34,Feuil2!$C$1:$CD$9,2,FALSE)","v":{"$error":"#VALUE!"}},{"$f":"T34-HLOOKUP(Y34,Feuil2!$C$1:$CD$9,3,FALSE)","v":{"$error":"#VALUE!"}},{"$f":"T34-HLOOKUP(Y34,Feuil2!$C$1:$CD$9,4,FALSE)","v":{"$error":"#VALUE!"}},{"$f":"T34-HLOOKUP(Y34,Feuil2!$C$1:$CD$9,5,FALSE)","v":{"$error":"#VALUE!"}},{"$f":"T34-HLOOKUP(Y34,Feuil2!$C$1:$CD$9,6,FALSE)","v":{"$error":"#VALUE!"}},{"$f":"T34-HLOOKUP(Y34,Feuil2!$C$1:$CD$9,7,FALSE)","v":{"$error":"#VALUE!"}},{"$f":"T34-HLOOKUP(Y34,Feuil2!$C$1:$CD$9,8,FALSE)","v":{"$error":"#VALUE!"}},{"$f":"T34-HLOOKUP(Y34,Feuil2!$C$1:$CD$9,9,FALSE)","v":{"$error":"#VALUE!"}},null,null,null,null,null,null,null,{"$error":"#VALUE!"},2017,null,{"$f":"IF(AQ34,VLOOKUP(AQ34,HOM!$AS$389:$AT$444,2))","v":4.4930000000000003}]
["H",null,null,null,null,null,null,null,null,null,null,null,null,null,"",null,null,null,"","","","","",false,{"$f":"IF(AND(H35<1920),VLOOKUP(I35,Feuil2!$F$10:$P$28,11),IF(AND(H35>=1920,H35<1939),VLOOKUP(I35,Feuil2!$F$10:$P$28,11),IF(AND(H35>=1938,H35<1943),VLOOKUP(I35,Feuil2!$F$10:$P$28,10),IF(AND(H35>=1943,H35<1948),VLOOKUP(I35,Feuil2!$F$10:$P$28,9),IF(AND(H35>=1948,H35<1953),VLOOKUP(I35,Feuil2!$F$10:$P$28,8),IF(AND(H35>=1953,H35<1958),VLOOKUP(I35,Feuil2!$F$10:$P$28,7),IF(AND(H35>=1958,H35<1963),VLOOKUP(I35,Feuil2!$F$10:$P$28,6),IF(AND(H35>=1963,H35<1968),VLOOKUP(I35,Feuil2!$F$10:$P$28,5),IF(AND(H35>=1968,H35<1973),VLOOKUP(I35,Feuil2!$F$10:$P$28,4),IF(AND(H35>=1973,H35<1978),VLOOKUP(I35,Feuil2!$F$10:$P$28,3),IF(AND(H35>=1978,H35<1983),VLOOKUP(I35,Feuil2!$F$10:$P$28,2),VLOOKUP(I35,Feuil2!$F$10:$P$28,2))))))))))))","v":{"$error":"#N/A"}},null,{"$f":"T35-HLOOKUP(Y35,Feuil2!$C$1:$CD$9,2,FALSE)","v":{"$error":"#VALUE!"}},{"$f":"T35-HLOOKUP(Y35,Feuil2!$C$1:$CD$9,3,FALSE)","v":{"$error":"#VALUE!"}},{"$f":"T35-HLOOKUP(Y35,Feuil2!$C$1:$CD$9,4,FALSE)","v":{"$error":"#VALUE!"}},{"$f":"T35-HLOOKUP(Y35,Feuil2!$C$1:$CD$9,5,FALSE)","v":{"$error":"#VALUE!"}},{"$f":"T35-HLOOKUP(Y35,Feuil2!$C$1:$CD$9,6,FALSE)","v":{"$error":"#VALUE!"}},{"$f":"T35-HLOOKUP(Y35,Feuil2!$C$1:$CD$9,7,FALSE)","v":{"$error":"#VALUE!"}},{"$f":"T35-HLOOKUP(Y35,Feuil2!$C$1:$CD$9,8,FALSE)","v":{"$error":"#VALUE!"}},{"$f":"T35-HLOOKUP(Y35,Feuil2!$C$1:$CD$9,9,FALSE)","v":{"$error":"#VALUE!"}},null,null,null,null,null,null,null,{"$error":"#VALUE!"},2017,null,{"$f":"IF(AQ35,VLOOKUP(AQ35,HOM!$AS$389:$AT$444,2))","v":4.4930000000000003}]
["H",null,null,null,null,null,null,null,null,null,null,null,null,null,"",null,null,null,"","","","","",false,{"$f":"IF(AND(H36<1920),VLOOKUP(I36,Feuil2!$F$10:$P$28,11),IF(AND(H36>=1920,H36<1939),VLOOKUP(I36,Feuil2!$F$10:$P$28,11),IF(AND(H36>=1938,H36<1943),VLOOKUP(I36,Feuil2!$F$10:$P$28,10),IF(AND(H36>=1943,H36<1948),VLOOKUP(I36,Feuil2!$F$10:$P$28,9),IF(AND(H36>=1948,H36<1953),VLOOKUP(I36,Feuil2!$F$10:$P$28,8),IF(AND(H36>=1953,H36<1958),VLOOKUP(I36,Feuil2!$F$10:$P$28,7),IF(AND(H36>=1958,H36<1963),VLOOKUP(I36,Feuil2!$F$10:$P$28,6),IF(AND(H36>=1963,H36<1968),VLOOKUP(I36,Feuil2!$F$10:$P$28,5),IF(AND(H36>=1968,H36<1973),VLOOKUP(I36,Feuil2!$F$10:$P$28,4),IF(AND(H36>=1973,H36<1978),VLOOKUP(I36,Feuil2!$F$10:$P$28,3),IF(AND(H36>=1978,H36<1983),VLOOKUP(I36,Feuil2!$F$10:$P$28,2),VLOOKUP(I36,Feuil2!$F$10:$P$28,2))))))))))))","v":{"$error":"#N/A"}},null,{"$f":"T36-HLOOKUP(Y36,Feuil2!$C$1:$CD$9,2,FALSE)","v":{"$error":"#VALUE!"}},{"$f":"T36-HLOOKUP(Y36,Feuil2!$C$1:$CD$9,3,FALSE)","v":{"$error":"#VALUE!"}},{"$f":"T36-HLOOKUP(Y36,Feuil2!$C$1:$CD$9,4,FALSE)","v":{"$error":"#VALUE!"}},{"$f":"T36-HLOOKUP(Y36,Feuil2!$C$1:$CD$9,5,FALSE)","v":{"$error":"#VALUE!"}},{"$f":"T36-HLOOKUP(Y36,Feuil2!$C$1:$CD$9,6,FALSE)","v":{"$error":"#VALUE!"}},{"$f":"T36-HLOOKUP(Y36,Feuil2!$C$1:$CD$9,7,FALSE)","v":{"$error":"#VALUE!"}},{"$f":"T36-HLOOKUP(Y36,Feuil2!$C$1:$CD$9,8,FALSE)","v":{"$error":"#VALUE!"}},{"$f":"T36-HLOOKUP(Y36,Feuil2!$C$1:$CD$9,9,FALSE)","v":{"$error":"#VALUE!"}},null,null,null,null,null,null,null,{"$error":"#VALUE!"},2017,null,{"$f":"IF(AQ36,VLOOKUP(AQ36,HOM!$AS$389:$AT$444,2))","v":4.4930000000000003}]
["H",null,null,null,null,null,null,null,null,null,null,null,null,null,"",null,null,null,"","","","","",false,{"$f":"IF(AND(H37<1920),VLOOKUP(I37,Feuil2!$F$10:$P$28,11),IF(AND(H37>=1920,H37<1939),VLOOKUP(I37,Feuil2!$F$10:$P$28,11),IF(AND(H37>=1938,H37<1943),VLOOKUP(I37,Feuil2!$F$10:$P$28,10),IF(AND(H37>=1943,H37<1948),VLOOKUP(I37,Feuil2!$F$10:$P$28,9),IF(AND(H37>=1948,H37<1953),VLOOKUP(I37,Feuil2!$F$10:$P$28,8),IF(AND(H37>=1953,H37<1958),VLOOKUP(I37,Feuil2!$F$10:$P$28,7),IF(AND(H37>=1958,H37<1963),VLOOKUP(I37,Feuil2!$F$10:$P$28,6),IF(AND(H37>=1963,H37<1968),VLOOKUP(I37,Feuil2!$F$10:$P$28,5),IF(AND(H37>=1968,H37<1973),VLOOKUP(I37,Feuil2!$F$10:$P$28,4),IF(AND(H37>=1973,H37<1978),VLOOKUP(I37,Feuil2!$F$10:$P$28,3),IF(AND(H37>=1978,H37<1983),VLOOKUP(I37,Feuil2!$F$10:$P$28,2),VLOOKUP(I37,Feuil2!$F$10:$P$28,2))))))))))))","v":{"$error":"#N/A"}},null,{"$f":"T37-HLOOKUP(Y37,Feuil2!$C$1:$CD$9,2,FALSE)","v":{"$error":"#VALUE!"}},{"$f":"T37-HLOOKUP(Y37,Feuil2!$C$1:$CD$9,3,FALSE)","v":{"$error":"#VALUE!"}},{"$f":"T37-HLOOKUP(Y37,Feuil2!$C$1:$CD$9,4,FALSE)","v":{"$error":"#VALUE!"}},{"$f":"T37-HLOOKUP(Y37,Feuil2!$C$1:$CD$9,5,FALSE)","v":{"$error":"#VALUE!"}},{"$f":"T37-HLOOKUP(Y37,Feuil2!$C$1:$CD$9,6,FALSE)","v":{"$error":"#VALUE!"}},{"$f":"T37-HLOOKUP(Y37,Feuil2!$C$1:$CD$9,7,FALSE)","v":{"$error":"#VALUE!"}},{"$f":"T37-HLOOKUP(Y37,Feuil2!$C$1:$CD$9,8,FALSE)","v":{"$error":"#VALUE!"}},{"$f":"T37-HLOOKUP(Y37,Feuil2!$C$1:$CD$9,9,FALSE)","v":{"$error":"#VALUE!"}},null,null,null,null,null,null,null,{"$error":"#VALUE!"},2017,null,{"$f":"IF(AQ37,VLOOKUP(AQ37,HOM!$AS$389:$AT$444,2))","v":4.4930000000000003}]
["H",null,null,null,null,null,null,null,null,null,null,null,null,null,{"$f":"IF(I38=\"\",\"\",IF(MAXA(L38:N38)<=0,0,MAXA(L38:N38)))","v":""},null,null,null,{"$f":"IF(I38=\"\",\"\",IF(MAXA(P38:R38)<=0,0,MAXA(P38:R38)))","v":""},{"$f":"IF(I38=\"\",\"\",IF(OR(O38=0,S38=0),0,O38+S38))","v":""},"",{"$f":"IF(I38=\"\",\"\",AP38)","v":""},{"$f":"IF(I38=\"\",\"\",IF(AH38>=0,AH38,IF(AG38>=0,AG38,IF(AF38>=0,AF38,IF(AE38>=0,AE38,IF(AD38>=0,AD38,IF(AC38>=0,AC38,IF(AB38>=0,AB38,AA38))))))))","v":""},{"$f":"IF(AQ38<95,IF(AQ38<=90,VLOOKUP(AQ38,$AQ$255:$AR$444,2)))","v":false},{"$f":"IF(AND(H38<1920),VLOOKUP(I38,Feuil2!$F$10:$P$28,11),IF(AND(H38>=1920,H38<1939),VLOOKUP(I38,Feuil2!$F$10:$P$28,11),IF(AND(H38>=1938,H38<1943),VLOOKUP(I38,Feuil2!$F$10:$P$28,10),IF(AND(H38>=1943,H38<1948),VLOOKUP(I38,Feuil2!$F$10:$P$28,9),IF(AND(H38>=1948,H38<1953),VLOOKUP(I38,Feuil2!$F$10:$P$28,8),IF(AND(H38>=1953,H38<1958),VLOOKUP(I38,Feuil2!$F$10:$P$28,7),IF(AND(H38>=1958,H38<1963),VLOOKUP(I38,Feuil2!$F$10:$P$28,6),IF(AND(H38>=1963,H38<1968),VLOOKUP(I38,Feuil2!$F$10:$P$28,5),IF(AND(H38>=1968,H38<1973),VLOOKUP(I38,Feuil2!$F$10:$P$28,4),IF(AND(H38>=1973,H38<1978),VLOOKUP(I38,Feuil2!$F$10:$P$28,3),IF(AND(H38>=1978,H38<1983),VLOOKUP(I38,Feuil2!$F$10:$P$28,2),VLOOKUP(I38,Feuil2!$F$10:$P$28,2))))))))))))","v":{"$error":"#N/A"}},null,{"$f":"T38-HLOOKUP(Y38,Feuil2!$C$1:$CD$9,2,FALSE)","v":{"$error":"#VALUE!"}},{"$f":"T38-HLOOKUP(Y38,Feuil2!$C$1:$CD$9,3,FALSE)","v":{"$error":"#VALUE!"}},{"$f":"T38-HLOOKUP(Y38,Feuil2!$C$1:$CD$9,4,FALSE)","v":{"$error":"#VALUE!"}},{"$f":"T38-HLOOKUP(Y38,Feuil2!$C$1:$CD$9,5,FALSE)","v":{"$error":"#VALUE!"}},{"$f":"T38-HLOOKUP(Y38,Feuil2!$C$1:$CD$9,6,FALSE)","v":{"$error":"#VALUE!"}},{"$f":"T38-HLOOKUP(Y38,Feuil2!$C$1:$CD$9,7,FALSE)","v":{"$error":"#VALUE!"}},{"$f":"T38-HLOOKUP(Y38,Feuil2!$C$1:$CD$9,8,FALSE)","v":{"$error":"#VALUE!"}},{"$f":"T38-HLOOKUP(Y38,Feuil2!$C$1:$CD$9,9,FALSE)","v":{"$error":"#VALUE!"}},null,null,null,null,null,null,null,{"$f":"IF(AH38>=0,$AH$5,IF(AG38>=0,$AG$5,IF(AF38>=0,$AF$5,IF(AE38>=0,$AE$5,IF(AD38>=0,$AD$5,IF(AC38>=0,$AC$5,IF(AB38>=0,$AB$5,IF(AA38>=0,$AA$5,$AI$5))))))))","v":{"$error":"#VALUE!"}},{"$f":"2017-H38","v":2017},null,{"$f":"IF(AQ38,VLOOKUP(AQ38,HOM!$AS$389:$AT$444,2))","v":4.4930000000000003}]
["H",null,null,null,null,null,null,null,null,null,null,null,null,null,"",null,null,null,"","","","","",false,{"$f":"IF(AND(H39<1920),VLOOKUP(I39,Feuil2!$F$10:$P$28,11),IF(AND(H39>=1920,H39<1939),VLOOKUP(I39,Feuil2!$F$10:$P$28,11),IF(AND(H39>=1938,H39<1943),VLOOKUP(I39,Feuil2!$F$10:$P$28,10),IF(AND(H39>=1943,H39<1948),VLOOKUP(I39,Feuil2!$F$10:$P$28,9),IF(AND(H39>=1948,H39<1953),VLOOKUP(I39,Feuil2!$F$10:$P$28,8),IF(AND(H39>=1953,H39<1958),VLOOKUP(I39,Feuil2!$F$10:$P$28,7),IF(AND(H39>=1958,H39<1963),VLOOKUP(I39,Feuil2!$F$10:$P$28,6),IF(AND(H39>=1963,H39<1968),VLOOKUP(I39,Feuil2!$F$10:$P$28,5),IF(AND(H39>=1968,H39<1973),VLOOKUP(I39,Feuil2!$F$10:$P$28,4),IF(AND(H39>=1973,H39<1978),VLOOKUP(I39,Feuil2!$F$10:$P$28,3),IF(AND(H39>=1978,H39<1983),VLOOKUP(I39,Feuil2!$F$10:$P$28,2),VLOOKUP(I39,Feuil2!$F$10:$P$28,2))))))))))))","v":{"$error":"#N/A"}},null,{"$f":"T39-HLOOKUP(Y39,Feuil2!$C$1:$CD$9,2,FALSE)","v":{"$error":"#VALUE!"}},{"$f":"T39-HLOOKUP(Y39,Feuil2!$C$1:$CD$9,3,FALSE)","v":{"$error":"#VALUE!"}},{"$f":"T39-HLOOKUP(Y39,Feuil2!$C$1:$CD$9,4,FALSE)","v":{"$error":"#VALUE!"}},{"$f":"T39-HLOOKUP(Y39,Feuil2!$C$1:$CD$9,5,FALSE)","v":{"$error":"#VALUE!"}},{"$f":"T39-HLOOKUP(Y39,Feuil2!$C$1:$CD$9,6,FALSE)","v":{"$error":"#VALUE!"}},{"$f":"T39-HLOOKUP(Y39,Feuil2!$C$1:$CD$9,7,FALSE)","v":{"$error":"#VALUE!"}},{"$f":"T39-HLOOKUP(Y39,Feuil2!$C$1:$CD$9,8,FALSE)","v":{"$error":"#VALUE!"}},{"$f":"T39-HLOOKUP(Y39,Feuil2!$C$1:$CD$9,9,FALSE)","v":{"$error":"#VALUE!"}},null,null,null,null,null,null,null,{"$error":"#VALUE!"},2017,null,{"$f":"IF(AQ39,VLOOKUP(AQ39,HOM!$AS$389:$AT$444,2))","v":4.4930000000000003}]
["H",null,null,null,null,null,null,null,null,null,null,null,null,null,"",null,null,null,"","","","","",false,{"$f":"IF(AND(H40<1920),VLOOKUP(I40,Feuil2!$F$10:$P$28,11),IF(AND(H40>=1920,H40<1939),VLOOKUP(I40,Feuil2!$F$10:$P$28,11),IF(AND(H40>=1938,H40<1943),VLOOKUP(I40,Feuil2!$F$10:$P$28,10),IF(AND(H40>=1943,H40<1948),VLOOKUP(I40,Feuil2!$F$10:$P$28,9),IF(AND(H40>=1948,H40<1953),VLOOKUP(I40,Feuil2!$F$10:$P$28,8),IF(AND(H40>=1953,H40<1958),VLOOKUP(I40,Feuil2!$F$10:$P$28,7),IF(AND(H40>=1958,H40<1963),VLOOKUP(I40,Feuil2!$F$10:$P$28,6),IF(AND(H40>=1963,H40<1968),VLOOKUP(I40,Feuil2!$F$10:$P$28,5),IF(AND(H40>=1968,H40<1973),VLOOKUP(I40,Feuil2!$F$10:$P$28,4),IF(AND(H40>=1973,H40<1978),VLOOKUP(I40,Feuil2!$F$10:$P$28,3),IF(AND(H40>=1978,H40<1983),VLOOKUP(I40,Feuil2!$F$10:$P$28,2),VLOOKUP(I40,Feuil2!$F$10:$P$28,2))))))))))))","v":{"$error":"#N/A"}},null,{"$f":"T40-HLOOKUP(Y40,Feuil2!$C$1:$CD$9,2,FALSE)","v":{"$error":"#VALUE!"}},{"$f":"T40-HLOOKUP(Y40,Feuil2!$C$1:$CD$9,3,FALSE)","v":{"$error":"#VALUE!"}},{"$f":"T40-HLOOKUP(Y40,Feuil2!$C$1:$CD$9,4,FALSE)","v":{"$error":"#VALUE!"}},{"$f":"T40-HLOOKUP(Y40,Feuil2!$C$1:$CD$9,5,FALSE)","v":{"$error":"#VALUE!"}},{"$f":"T40-HLOOKUP(Y40,Feuil2!$C$1:$CD$9,6,FALSE)","v":{"$error":"#VALUE!"}},{"$f":"T40-HLOOKUP(Y40,Feuil2!$C$1:$CD$9,7,FALSE)","v":{"$error":"#VALUE!"}},{"$f":"T40-HLOOKUP(Y40,Feuil2!$C$1:$CD$9,8,FALSE)","v":{"$error":"#VALUE!"}},{"$f":"T40-HLOOKUP(Y40,Feuil2!$C$1:$CD$9,9,FALSE)","v":{"$error":"#VALUE!"}},null,null,null,null,null,null,null,{"$error":"#VALUE!"},2017,null,{"$f":"IF(AQ40,VLOOKUP(AQ40,HOM!$AS$389:$AT$444,2))","v":4.4930000000000003}]
["H",null,null,null,null,null,null,null,null,null,null,null,null,null,"",null,null,null,"","","","","",false,{"$f":"IF(AND(H41<1920),VLOOKUP(I41,Feuil2!$F$10:$P$28,11),IF(AND(H41>=1920,H41<1939),VLOOKUP(I41,Feuil2!$F$10:$P$28,11),IF(AND(H41>=1938,H41<1943),VLOOKUP(I41,Feuil2!$F$10:$P$28,10),IF(AND(H41>=1943,H41<1948),VLOOKUP(I41,Feuil2!$F$10:$P$28,9),IF(AND(H41>=1948,H41<1953),VLOOKUP(I41,Feuil2!$F$10:$P$28,8),IF(AND(H41>=1953,H41<1958),VLOOKUP(I41,Feuil2!$F$10:$P$28,7),IF(AND(H41>=1958,H41<1963),VLOOKUP(I41,Feuil2!$F$10:$P$28,6),IF(AND(H41>=1963,H41<1968),VLOOKUP(I41,Feuil2!$F$10:$P$28,5),IF(AND(H41>=1968,H41<1973),VLOOKUP(I41,Feuil2!$F$10:$P$28,4),IF(AND(H41>=1973,H41<1978),VLOOKUP(I41,Feuil2!$F$10:$P$28,3),IF(AND(H41>=1978,H41<1983),VLOOKUP(I41,Feuil2!$F$10:$P$28,2),VLOOKUP(I41,Feuil2!$F$10:$P$28,2))))))))))))","v":{"$error":"#N/A"}},null,{"$f":"T41-HLOOKUP(Y41,Feuil2!$C$1:$CD$9,2,FALSE)","v":{"$error":"#VALUE!"}},{"$f":"T41-HLOOKUP(Y41,Feuil2!$C$1:$CD$9,3,FALSE)","v":{"$error":"#VALUE!"}},{"$f":"T41-HLOOKUP(Y41,Feuil2!$C$1:$CD$9,4,FALSE)","v":{"$error":"#VALUE!"}},{"$f":"T41-HLOOKUP(Y41,Feuil2!$C$1:$CD$9,5,FALSE)","v":{"$error":"#VALUE!"}},{"$f":"T41-HLOOKUP(Y41,Feuil2!$C$1:$CD$9,6,FALSE)","v":{"$error":"#VALUE!"}},{"$f":"T41-HLOOKUP(Y41,Feuil2!$C$1:$CD$9,7,FALSE)","v":{"$error":"#VALUE!"}},{"$f":"T41-HLOOKUP(Y41,Feuil2!$C$1:$CD$9,8,FALSE)","v":{"$error":"#VALUE!"}},{"$f":"T41-HLOOKUP(Y41,Feuil2!$C$1:$CD$9,9,FALSE)","v":{"$error":"#VALUE!"}},null,null,null,null,null,null,null,{"$error":"#VALUE!"},2017,null,{"$f":"IF(AQ41,VLOOKUP(AQ41,HOM!$AS$389:$AT$444,2))","v":4.4930000000000003}]
["H",null,null,null,null,null,null,null,null,null,null,null,null,null,"",null,null,null,"","","","","",false,{"$f":"IF(AND(H42<1920),VLOOKUP(I42,Feuil2!$F$10:$P$28,11),IF(AND(H42>=1920,H42<1939),VLOOKUP(I42,Feuil2!$F$10:$P$28,11),IF(AND(H42>=1938,H42<1943),VLOOKUP(I42,Feuil2!$F$10:$P$28,10),IF(AND(H42>=1943,H42<1948),VLOOKUP(I42,Feuil2!$F$10:$P$28,9),IF(AND(H42>=1948,H42<1953),VLOOKUP(I42,Feuil2!$F$10:$P$28,8),IF(AND(H42>=1953,H42<1958),VLOOKUP(I42,Feuil2!$F$10:$P$28,7),IF(AND(H42>=1958,H42<1963),VLOOKUP(I42,Feuil2!$F$10:$P$28,6),IF(AND(H42>=1963,H42<1968),VLOOKUP(I42,Feuil2!$F$10:$P$28,5),IF(AND(H42>=1968,H42<1973),VLOOKUP(I42,Feuil2!$F$10:$P$28,4),IF(AND(H42>=1973,H42<1978),VLOOKUP(I42,Feuil2!$F$10:$P$28,3),IF(AND(H42>=1978,H42<1983),VLOOKUP(I42,Feuil2!$F$10:$P$28,2),VLOOKUP(I42,Feuil2!$F$10:$P$28,2))))))))))))","v":{"$error":"#N/A"}},null,{"$f":"T42-HLOOKUP(Y42,Feuil2!$C$1:$CD$9,2,FALSE)","v":{"$error":"#VALUE!"}},{"$f":"T42-HLOOKUP(Y42,Feuil2!$C$1:$CD$9,3,FALSE)","v":{"$error":"#VALUE!"}},{"$f":"T42-HLOOKUP(Y42,Feuil2!$C$1:$CD$9,4,FALSE)","v":{"$error":"#VALUE!"}},{"$f":"T42-HLOOKUP(Y42,Feuil2!$C$1:$CD$9,5,FALSE)","v":{"$error":"#VALUE!"}},{"$f":"T42-HLOOKUP(Y42,Feuil2!$C$1:$CD$9,6,FALSE)","v":{"$error":"#VALUE!"}},{"$f":"T42-HLOOKUP(Y42,Feuil2!$C$1:$CD$9,7,FALSE)","v":{"$error":"#VALUE!"}},{"$f":"T42-HLOOKUP(Y42,Feuil2!$C$1:$CD$9,8,FALSE)","v":{"$error":"#VALUE!"}},{"$f":"T42-HLOOKUP(Y42,Feuil2!$C$1:$CD$9,9,FALSE)","v":{"$error":"#VALUE!"}},null,null,null,null,null,null,null,{"$error":"#VALUE!"},2017,null,{"$f":"IF(AQ42,VLOOKUP(AQ42,HOM!$AS$389:$AT$444,2))","v":4.4930000000000003}]
["H",null,null,null,null,null,null,null,null,null,null,null,null,null,"",null,null,null,"","","","","",false,{"$f":"IF(AND(H43<1920),VLOOKUP(I43,Feuil2!$F$10:$P$28,11),IF(AND(H43>=1920,H43<1939),VLOOKUP(I43,Feuil2!$F$10:$P$28,11),IF(AND(H43>=1938,H43<1943),VLOOKUP(I43,Feuil2!$F$10:$P$28,10),IF(AND(H43>=1943,H43<1948),VLOOKUP(I43,Feuil2!$F$10:$P$28,9),IF(AND(H43>=1948,H43<1953),VLOOKUP(I43,Feuil2!$F$10:$P$28,8),IF(AND(H43>=1953,H43<1958),VLOOKUP(I43,Feuil2!$F$10:$P$28,7),IF(AND(H43>=1958,H43<1963),VLOOKUP(I43,Feuil2!$F$10:$P$28,6),IF(AND(H43>=1963,H43<1968),VLOOKUP(I43,Feuil2!$F$10:$P$28,5),IF(AND(H43>=1968,H43<1973),VLOOKUP(I43,Feuil2!$F$10:$P$28,4),IF(AND(H43>=1973,H43<1978),VLOOKUP(I43,Feuil2!$F$10:$P$28,3),IF(AND(H43>=1978,H43<1983),VLOOKUP(I43,Feuil2!$F$10:$P$28,2),VLOOKUP(I43,Feuil2!$F$10:$P$28,2))))))))))))","v":{"$error":"#N/A"}},null,{"$f":"T43-HLOOKUP(Y43,Feuil2!$C$1:$CD$9,2,FALSE)","v":{"$error":"#VALUE!"}},{"$f":"T43-HLOOKUP(Y43,Feuil2!$C$1:$CD$9,3,FALSE)","v":{"$error":"#VALUE!"}},{"$f":"T43-HLOOKUP(Y43,Feuil2!$C$1:$CD$9,4,FALSE)","v":{"$error":"#VALUE!"}},{"$f":"T43-HLOOKUP(Y43,Feuil2!$C$1:$CD$9,5,FALSE)","v":{"$error":"#VALUE!"}},{"$f":"T43-HLOOKUP(Y43,Feuil2!$C$1:$CD$9,6,FALSE)","v":{"$error":"#VALUE!"}},{"$f":"T43-HLOOKUP(Y43,Feuil2!$C$1:$CD$9,7,FALSE)","v":{"$error":"#VALUE!"}},{"$f":"T43-HLOOKUP(Y43,Feuil2!$C$1:$CD$9,8,FALSE)","v":{"$error":"#VALUE!"}},{"$f":"T43-HLOOKUP(Y43,Feuil2!$C$1:$CD$9,9,FALSE)","v":{"$error":"#VALUE!"}},null,null,null,null,null,null,null,{"$error":"#VALUE!"},2017,null,{"$f":"IF(AQ43,VLOOKUP(AQ43,HOM!$AS$389:$AT$444,2))","v":4.4930000000000003}]
["H",null,null,null,null,null,null,null,null,null,null,null,null,null,"",null,null,null,"","","","","",false,{"$f":"IF(AND(H44<1920),VLOOKUP(I44,Feuil2!$F$10:$P$28,11),IF(AND(H44>=1920,H44<1939),VLOOKUP(I44,Feuil2!$F$10:$P$28,11),IF(AND(H44>=1938,H44<1943),VLOOKUP(I44,Feuil2!$F$10:$P$28,10),IF(AND(H44>=1943,H44<1948),VLOOKUP(I44,Feuil2!$F$10:$P$28,9),IF(AND(H44>=1948,H44<1953),VLOOKUP(I44,Feuil2!$F$10:$P$28,8),IF(AND(H44>=1953,H44<1958),VLOOKUP(I44,Feuil2!$F$10:$P$28,7),IF(AND(H44>=1958,H44<1963),VLOOKUP(I44,Feuil2!$F$10:$P$28,6),IF(AND(H44>=1963,H44<1968),VLOOKUP(I44,Feuil2!$F$10:$P$28,5),IF(AND(H44>=1968,H44<1973),VLOOKUP(I44,Feuil2!$F$10:$P$28,4),IF(AND(H44>=1973,H44<1978),VLOOKUP(I44,Feuil2!$F$10:$P$28,3),IF(AND(H44>=1978,H44<1983),VLOOKUP(I44,Feuil2!$F$10:$P$28,2),VLOOKUP(I44,Feuil2!$F$10:$P$28,2))))))))))))","v":{"$error":"#N/A"}},null,{"$f":"T44-HLOOKUP(Y44,Feuil2!$C$1:$CD$9,2,FALSE)","v":{"$error":"#VALUE!"}},{"$f":"T44-HLOOKUP(Y44,Feuil2!$C$1:$CD$9,3,FALSE)","v":{"$error":"#VALUE!"}},{"$f":"T44-HLOOKUP(Y44,Feuil2!$C$1:$CD$9,4,FALSE)","v":{"$error":"#VALUE!"}},{"$f":"T44-HLOOKUP(Y44,Feuil2!$C$1:$CD$9,5,FALSE)","v":{"$error":"#VALUE!"}},{"$f":"T44-HLOOKUP(Y44,Feuil2!$C$1:$CD$9,6,FALSE)","v":{"$error":"#VALUE!"}},{"$f":"T44-HLOOKUP(Y44,Feuil2!$C$1:$CD$9,7,FALSE)","v":{"$error":"#VALUE!"}},{"$f":"T44-HLOOKUP(Y44,Feuil2!$C$1:$CD$9,8,FALSE)","v":{"$error":"#VALUE!"}},{"$f":"T44-HLOOKUP(Y44,Feuil2!$C$1:$CD$9,9,FALSE)","v":{"$error":"#VALUE!"}},null,null,null,null,null,null,null,{"$error":"#VALUE!"},2017,null,{"$f":"IF(AQ44,VLOOKUP(AQ44,HOM!$AS$389:$AT$444,2))","v":4.4930000000000003}]
["H",null,null,null,null,null,null,1952,69,null,"F",null,null,65,65,80,null,null,80,145,324.38916243604626,"MON +",33,"V7 H65",{"$f":"IF(AND(H45<1920),VLOOKUP(I45,Feuil2!$F$10:$P$28,11),IF(AND(H45>=1920,H45<1939),VLOOKUP(I45,Feuil2!$F$10:$P$28,11),IF(AND(H45>=1938,H45<1943),VLOOKUP(I45,Feuil2!$F$10:$P$28,10),IF(AND(H45>=1943,H45<1948),VLOOKUP(I45,Feuil2!$F$10:$P$28,9),IF(AND(H45>=1948,H45<1953),VLOOKUP(I45,Feuil2!$F$10:$P$28,8),IF(AND(H45>=1953,H45<1958),VLOOKUP(I45,Feuil2!$F$10:$P$28,7),IF(AND(H45>=1958,H45<1963),VLOOKUP(I45,Feuil2!$F$10:$P$28,6),IF(AND(H45>=1963,H45<1968),VLOOKUP(I45,Feuil2!$F$10:$P$28,5),IF(AND(H45>=1968,H45<1973),VLOOKUP(I45,Feuil2!$F$10:$P$28,4),IF(AND(H45>=1973,H45<1978),VLOOKUP(I45,Feuil2!$F$10:$P$28,3),IF(AND(H45>=1978,H45<1983),VLOOKUP(I45,Feuil2!$F$10:$P$28,2),VLOOKUP(I45,Feuil2!$F$10:$P$28,2))))))))))))","v":"VH65-69"},null,{"$f":"T45-HLOOKUP(Y45,Feuil2!$C$1:$CD$9,2,FALSE)","v":145},{"$f":"T45-HLOOKUP(Y45,Feuil2!$C$1:$CD$9,3,FALSE)","v":68},{"$f":"T45-HLOOKUP(Y45,Feuil2!$C$1:$CD$9,4,FALSE)","v":58},{"$f":"T45-HLOOKUP(Y45,Feuil2!$C$1:$CD$9,5,FALSE)","v":48},{"$f":"T45-HLOOKUP(Y45,Feuil2!$C$1:$CD$9,6,FALSE)","v":33},{"$f":"T45-HLOOKUP(Y45,Feuil2!$C$1:$CD$9,7,FALSE)","v":-855},{"$f":"T45-HLOOKUP(Y45,Feuil2!$C$1:$CD$9,8,FALSE)","v":-855},{"$f":"T45-HLOOKUP(Y45,Feuil2!$C$1:$CD$9,9,FALSE)","v":-855},null,null,null,null,null,null,null,"MON +",65,null,{"$f":"IF(AQ45,VLOOKUP(AQ45,HOM!$AS$389:$AT$444,2))","v":1.663}]
["H",null,null,null,null,null,null,null,null,null,null,null,null,null,"",null,null,null,"","","","","",false,{"$f":"IF(AND(H46<1920),VLOOKUP(I46,Feuil2!$F$10:$P$28,11),IF(AND(H46>=1920,H46<1939),VLOOKUP(I46,Feuil2!$F$10:$P$28,11),IF(AND(H46>=1938,H46<1943),VLOOKUP(I46,Feuil2!$F$10:$P$28,10),IF(AND(H46>=1943,H46<1948),VLOOKUP(I46,Feuil2!$F$10:$P$28,9),IF(AND(H46>=1948,H46<1953),VLOOKUP(I46,Feuil2!$F$10:$P$28,8),IF(AND(H46>=1953,H46<1958),VLOOKUP(I46,Feuil2!$F$10:$P$28,7),IF(AND(H46>=1958,H46<1963),VLOOKUP(I46,Feuil2!$F$10:$P$28,6),IF(AND(H46>=1963,H46<1968),VLOOKUP(I46,Feuil2!$F$10:$P$28,5),IF(AND(H46>=1968,H46<1973),VLOOKUP(I46,Feuil2!$F$10:$P$28,4),IF(AND(H46>=1973,H46<1978),VLOOKUP(I46,Feuil2!$F$10:$P$28,3),IF(AND(H46>=1978,H46<1983),VLOOKUP(I46,Feuil2!$F$10:$P$28,2),VLOOKUP(I46,Feuil2!$F$10:$P$28,2))))))))))))","v":{"$error":"#N/A"}},null,{"$f":"T46-HLOOKUP(Y46,Feuil2!$C$1:$CD$9,2,FALSE)","v":{"$error":"#VALUE!"}},{"$f":"T46-HLOOKUP(Y46,Feuil2!$C$1:$CD$9,3,FALSE)","v":{"$error":"#VALUE!"}},{"$f":"T46-HLOOKUP(Y46,Feuil2!$C$1:$CD$9,4,FALSE)","v":{"$error":"#VALUE!"}},{"$f":"T46-HLOOKUP(Y46,Feuil2!$C$1:$CD$9,5,FALSE)","v":{"$error":"#VALUE!"}},{"$f":"T46-HLOOKUP(Y46,Feuil2!$C$1:$CD$9,6,FALSE)","v":{"$error":"#VALUE!"}},{"$f":"T46-HLOOKUP(Y46,Feuil2!$C$1:$CD$9,7,FALSE)","v":{"$error":"#VALUE!"}},{"$f":"T46-HLOOKUP(Y46,Feuil2!$C$1:$CD$9,8,FALSE)","v":{"$error":"#VALUE!"}},{"$f":"T46-HLOOKUP(Y46,Feuil2!$C$1:$CD$9,9,FALSE)","v":{"$error":"#VALUE!"}},null,null,null,null,null,null,null,{"$error":"#VALUE!"},2017,null,{"$f":"IF(AQ46,VLOOKUP(AQ46,HOM!$AS$389:$AT$444,2))","v":4.4930000000000003}]
["H",null,null,null,null,null,null,null,null,null,null,null,null,null,"",null,null,null,"","","","","",false,{"$f":"IF(AND(H47<1920),VLOOKUP(I47,Feuil2!$F$10:$P$28,11),IF(AND(H47>=1920,H47<1939),VLOOKUP(I47,Feuil2!$F$10:$P$28,11),IF(AND(H47>=1938,H47<1943),VLOOKUP(I47,Feuil2!$F$10:$P$28,10),IF(AND(H47>=1943,H47<1948),VLOOKUP(I47,Feuil2!$F$10:$P$28,9),IF(AND(H47>=1948,H47<1953),VLOOKUP(I47,Feuil2!$F$10:$P$28,8),IF(AND(H47>=1953,H47<1958),VLOOKUP(I47,Feuil2!$F$10:$P$28,7),IF(AND(H47>=1958,H47<1963),VLOOKUP(I47,Feuil2!$F$10:$P$28,6),IF(AND(H47>=1963,H47<1968),VLOOKUP(I47,Feuil2!$F$10:$P$28,5),IF(AND(H47>=1968,H47<1973),VLOOKUP(I47,Feuil2!$F$10:$P$28,4),IF(AND(H47>=1973,H47<1978),VLOOKUP(I47,Feuil2!$F$10:$P$28,3),IF(AND(H47>=1978,H47<1983),VLOOKUP(I47,Feuil2!$F$10:$P$28,2),VLOOKUP(I47,Feuil2!$F$10:$P$28,2))))))))))))","v":{"$error":"#N/A"}},null,{"$f":"T47-HLOOKUP(Y47,Feuil2!$C$1:$CD$9,2,FALSE)","v":{"$error":"#VALUE!"}},{"$f":"T47-HLOOKUP(Y47,Feuil2!$C$1:$CD$9,3,FALSE)","v":{"$error":"#VALUE!"}},{"$f":"T47-HLOOKUP(Y47,Feuil2!$C$1:$CD$9,4,FALSE)","v":{"$error":"#VALUE!"}},{"$f":"T47-HLOOKUP(Y47,Feuil2!$C$1:$CD$9,5,FALSE)","v":{"$error":"#VALUE!"}},{"$f":"T47-HLOOKUP(Y47,Feuil2!$C$1:$CD$9,6,FALSE)","v":{"$error":"#VALUE!"}},{"$f":"T47-HLOOKUP(Y47,Feuil2!$C$1:$CD$9,7,FALSE)","v":{"$error":"#VALUE!"}},{"$f":"T47-HLOOKUP(Y47,Feuil2!$C$1:$CD$9,8,FALSE)","v":{"$error":"#VALUE!"}},{"$f":"T47-HLOOKUP(Y47,Feuil2!$C$1:$CD$9,9,FALSE)","v":{"$error":"#VALUE!"}},null,null,null,null,null,null,null,{"$error":"#VALUE!"},2017,null,{"$f":"IF(AQ47,VLOOKUP(AQ47,HOM!$AS$389:$AT$444,2))","v":4.4930000000000003}]
["H",null,null,null,null,null,null,null,null,null,null,null,null,null,"",null,null,null,"","","","","",false,{"$f":"IF(AND(H48<1920),VLOOKUP(I48,Feuil2!$F$10:$P$28,11),IF(AND(H48>=1920,H48<1939),VLOOKUP(I48,Feuil2!$F$10:$P$28,11),IF(AND(H48>=1938,H48<1943),VLOOKUP(I48,Feuil2!$F$10:$P$28,10),IF(AND(H48>=1943,H48<1948),VLOOKUP(I48,Feuil2!$F$10:$P$28,9),IF(AND(H48>=1948,H48<1953),VLOOKUP(I48,Feuil2!$F$10:$P$28,8),IF(AND(H48>=1953,H48<1958),VLOOKUP(I48,Feuil2!$F$10:$P$28,7),IF(AND(H48>=1958,H48<1963),VLOOKUP(I48,Feuil2!$F$10:$P$28,6),IF(AND(H48>=1963,H48<1968),VLOOKUP(I48,Feuil2!$F$10:$P$28,5),IF(AND(H48>=1968,H48<1973),VLOOKUP(I48,Feuil2!$F$10:$P$28,4),IF(AND(H48>=1973,H48<1978),VLOOKUP(I48,Feuil2!$F$10:$P$28,3),IF(AND(H48>=1978,H48<1983),VLOOKUP(I48,Feuil2!$F$10:$P$28,2),VLOOKUP(I48,Feuil2!$F$10:$P$28,2))))))))))))","v":{"$error":"#N/A"}},null,{"$f":"T48-HLOOKUP(Y48,Feuil2!$C$1:$CD$9,2,FALSE)","v":{"$error":"#VALUE!"}},{"$f":"T48-HLOOKUP(Y48,Feuil2!$C$1:$CD$9,3,FALSE)","v":{"$error":"#VALUE!"}},{"$f":"T48-HLOOKUP(Y48,Feuil2!$C$1:$CD$9,4,FALSE)","v":{"$error":"#VALUE!"}},{"$f":"T48-HLOOKUP(Y48,Feuil2!$C$1:$CD$9,5,FALSE)","v":{"$error":"#VALUE!"}},{"$f":"T48-HLOOKUP(Y48,Feuil2!$C$1:$CD$9,6,FALSE)","v":{"$error":"#VALUE!"}},{"$f":"T48-HLOOKUP(Y48,Feuil2!$C$1:$CD$9,7,FALSE)","v":{"$error":"#VALUE!"}},{"$f":"T48-HLOOKUP(Y48,Feuil2!$C$1:$CD$9,8,FALSE)","v":{"$error":"#VALUE!"}},{"$f":"T48-HLOOKUP(Y48,Feuil2!$C$1:$CD$9,9,FALSE)","v":{"$error":"#VALUE!"}},null,null,null,null,null,null,null,{"$error":"#VALUE!"},2017,null,{"$f":"IF(AQ48,VLOOKUP(AQ48,HOM!$AS$389:$AT$444,2))","v":4.4930000000000003}]
["H",null,null,null,null,null,null,null,null,null,null,null,null,null,"",null,null,null,"","","","","",false,{"$f":"IF(AND(H49<1920),VLOOKUP(I49,Feuil2!$F$10:$P$28,11),IF(AND(H49>=1920,H49<1939),VLOOKUP(I49,Feuil2!$F$10:$P$28,11),IF(AND(H49>=1938,H49<1943),VLOOKUP(I49,Feuil2!$F$10:$P$28,10),IF(AND(H49>=1943,H49<1948),VLOOKUP(I49,Feuil2!$F$10:$P$28,9),IF(AND(H49>=1948,H49<1953),VLOOKUP(I49,Feuil2!$F$10:$P$28,8),IF(AND(H49>=1953,H49<1958),VLOOKUP(I49,Feuil2!$F$10:$P$28,7),IF(AND(H49>=1958,H49<1963),VLOOKUP(I49,Feuil2!$F$10:$P$28,6),IF(AND(H49>=1963,H49<1968),VLOOKUP(I49,Feuil2!$F$10:$P$28,5),IF(AND(H49>=1968,H49<1973),VLOOKUP(I49,Feuil2!$F$10:$P$28,4),IF(AND(H49>=1973,H49<1978),VLOOKUP(I49,Feuil2!$F$10:$P$28,3),IF(AND(H49>=1978,H49<1983),VLOOKUP(I49,Feuil2!$F$10:$P$28,2),VLOOKUP(I49,Feuil2!$F$10:$P$28,2))))))))))))","v":{"$error":"#N/A"}},null,{"$f":"T49-HLOOKUP(Y49,Feuil2!$C$1:$CD$9,2,FALSE)","v":{"$error":"#VALUE!"}},{"$f":"T49-HLOOKUP(Y49,Feuil2!$C$1:$CD$9,3,FALSE)","v":{"$error":"#VALUE!"}},{"$f":"T49-HLOOKUP(Y49,Feuil2!$C$1:$CD$9,4,FALSE)","v":{"$error":"#VALUE!"}},{"$f":"T49-HLOOKUP(Y49,Feuil2!$C$1:$CD$9,5,FALSE)","v":{"$error":"#VALUE!"}},{"$f":"T49-HLOOKUP(Y49,Feuil2!$C$1:$CD$9,6,FALSE)","v":{"$error":"#VALUE!"}},{"$f":"T49-HLOOKUP(Y49,Feuil2!$C$1:$CD$9,7,FALSE)","v":{"$error":"#VALUE!"}},{"$f":"T49-HLOOKUP(Y49,Feuil2!$C$1:$CD$9,8,FALSE)","v":{"$error":"#VALUE!"}},{"$f":"T49-HLOOKUP(Y49,Feuil2!$C$1:$CD$9,9,FALSE)","v":{"$error":"#VALUE!"}},null,null,null,null,null,null,null,{"$error":"#VALUE!"},2017,null,{"$f":"IF(AQ49,VLOOKUP(AQ49,HOM!$AS$389:$AT$444,2))","v":4.4930000000000003}]
["H",null,null,null,null,null,null,null,null,null,null,null,null,null,"",null,null,null,"","","","","",false,{"$f":"IF(AND(H50<1920),VLOOKUP(I50,Feuil2!$F$10:$P$28,11),IF(AND(H50>=1920,H50<1939),VLOOKUP(I50,Feuil2!$F$10:$P$28,11),IF(AND(H50>=1938,H50<1943),VLOOKUP(I50,Feuil2!$F$10:$P$28,10),IF(AND(H50>=1943,H50<1948),VLOOKUP(I50,Feuil2!$F$10:$P$28,9),IF(AND(H50>=1948,H50<1953),VLOOKUP(I50,Feuil2!$F$10:$P$28,8),IF(AND(H50>=1953,H50<1958),VLOOKUP(I50,Feuil2!$F$10:$P$28,7),IF(AND(H50>=1958,H50<1963),VLOOKUP(I50,Feuil2!$F$10:$P$28,6),IF(AND(H50>=1963,H50<1968),VLOOKUP(I50,Feuil2!$F$10:$P$28,5),IF(AND(H50>=1968,H50<1973),VLOOKUP(I50,Feuil2!$F$10:$P$28,4),IF(AND(H50>=1973,H50<1978),VLOOKUP(I50,Feuil2!$F$10:$P$28,3),IF(AND(H50>=1978,H50<1983),VLOOKUP(I50,Feuil2!$F$10:$P$28,2),VLOOKUP(I50,Feuil2!$F$10:$P$28,2))))))))))))","v":{"$error":"#N/A"}},null,{"$f":"T50-HLOOKUP(Y50,Feuil2!$C$1:$CD$9,2,FALSE)","v":{"$error":"#VALUE!"}},{"$f":"T50-HLOOKUP(Y50,Feuil2!$C$1:$CD$9,3,FALSE)","v":{"$error":"#VALUE!"}},{"$f":"T50-HLOOKUP(Y50,Feuil2!$C$1:$CD$9,4,FALSE)","v":{"$error":"#VALUE!"}},{"$f":"T50-HLOOKUP(Y50,Feuil2!$C$1:$CD$9,5,FALSE)","v":{"$error":"#VALUE!"}},{"$f":"T50-HLOOKUP(Y50,Feuil2!$C$1:$CD$9,6,FALSE)","v":{"$error":"#VALUE!"}},{"$f":"T50-HLOOKUP(Y50,Feuil2!$C$1:$CD$9,7,FALSE)","v":{"$error":"#VALUE!"}},{"$f":"T50-HLOOKUP(Y50,Feuil2!$C$1:$CD$9,8,FALSE)","v":{"$error":"#VALUE!"}},{"$f":"T50-HLOOKUP(Y50,Feuil2!$C$1:$CD$9,9,FALSE)","v":{"$error":"#VALUE!"}},null,null,null,null,null,null,null,{"$error":"#VALUE!"},2017,null,{"$f":"IF(AQ50,VLOOKUP(AQ50,HOM!$AS$389:$AT$444,2))","v":4.4930000000000003}]
["H",null,null,null,null,null,null,null,null,null,null,null,null,null,"",null,null,null,"","","","","",false,{"$f":"IF(AND(H51<1920),VLOOKUP(I51,Feuil2!$F$10:$P$28,11),IF(AND(H51>=1920,H51<1939),VLOOKUP(I51,Feuil2!$F$10:$P$28,11),IF(AND(H51>=1938,H51<1943),VLOOKUP(I51,Feuil2!$F$10:$P$28,10),IF(AND(H51>=1943,H51<1948),VLOOKUP(I51,Feuil2!$F$10:$P$28,9),IF(AND(H51>=1948,H51<1953),VLOOKUP(I51,Feuil2!$F$10:$P$28,8),IF(AND(H51>=1953,H51<1958),VLOOKUP(I51,Feuil2!$F$10:$P$28,7),IF(AND(H51>=1958,H51<1963),VLOOKUP(I51,Feuil2!$F$10:$P$28,6),IF(AND(H51>=1963,H51<1968),VLOOKUP(I51,Feuil2!$F$10:$P$28,5),IF(AND(H51>=1968,H51<1973),VLOOKUP(I51,Feuil2!$F$10:$P$28,4),IF(AND(H51>=1973,H51<1978),VLOOKUP(I51,Feuil2!$F$10:$P$28,3),IF(AND(H51>=1978,H51<1983),VLOOKUP(I51,Feuil2!$F$10:$P$28,2),VLOOKUP(I51,Feuil2!$F$10:$P$28,2))))))))))))","v":{"$error":"#N/A"}},null,{"$f":"T51-HLOOKUP(Y51,Feuil2!$C$1:$CD$9,2,FALSE)","v":{"$error":"#VALUE!"}},{"$f":"T51-HLOOKUP(Y51,Feuil2!$C$1:$CD$9,3,FALSE)","v":{"$error":"#VALUE!"}},{"$f":"T51-HLOOKUP(Y51,Feuil2!$C$1:$CD$9,4,FALSE)","v":{"$error":"#VALUE!"}},{"$f":"T51-HLOOKUP(Y51,Feuil2!$C$1:$CD$9,5,FALSE)","v":{"$error":"#VALUE!"}},{"$f":"T51-HLOOKUP(Y51,Feuil2!$C$1:$CD$9,6,FALSE)","v":{"$error":"#VALUE!"}},{"$f":"T51-HLOOKUP(Y51,Feuil2!$C$1:$CD$9,7,FALSE)","v":{"$error":"#VALUE!"}},{"$f":"T51-HLOOKUP(Y51,Feuil2!$C$1:$CD$9,8,FALSE)","v":{"$error":"#VALUE!"}},{"$f":"T51-HLOOKUP(Y51,Feuil2!$C$1:$CD$9,9,FALSE)","v":{"$error":"#VALUE!"}},null,null,null,null,null,null,null,{"$error":"#VALUE!"},2017,null,{"$f":"IF(AQ51,VLOOKUP(AQ51,HOM!$AS$389:$AT$444,2))","v":4.4930000000000003}]
["H",null,null,null,null,null,null,null,null,null,null,null,null,null,"",null,null,null,"","","","","",false,{"$f":"IF(AND(H52<1920),VLOOKUP(I52,Feuil2!$F$10:$P$28,11),IF(AND(H52>=1920,H52<1939),VLOOKUP(I52,Feuil2!$F$10:$P$28,11),IF(AND(H52>=1938,H52<1943),VLOOKUP(I52,Feuil2!$F$10:$P$28,10),IF(AND(H52>=1943,H52<1948),VLOOKUP(I52,Feuil2!$F$10:$P$28,9),IF(AND(H52>=1948,H52<1953),VLOOKUP(I52,Feuil2!$F$10:$P$28,8),IF(AND(H52>=1953,H52<1958),VLOOKUP(I52,Feuil2!$F$10:$P$28,7),IF(AND(H52>=1958,H52<1963),VLOOKUP(I52,Feuil2!$F$10:$P$28,6),IF(AND(H52>=1963,H52<1968),VLOOKUP(I52,Feuil2!$F$10:$P$28,5),IF(AND(H52>=1968,H52<1973),VLOOKUP(I52,Feuil2!$F$10:$P$28,4),IF(AND(H52>=1973,H52<1978),VLOOKUP(I52,Feuil2!$F$10:$P$28,3),IF(AND(H52>=1978,H52<1983),VLOOKUP(I52,Feuil2!$F$10:$P$28,2),VLOOKUP(I52,Feuil2!$F$10:$P$28,2))))))))))))","v":{"$error":"#N/A"}},null,{"$f":"T52-HLOOKUP(Y52,Feuil2!$C$1:$CD$9,2,FALSE)","v":{"$error":"#VALUE!"}},{"$f":"T52-HLOOKUP(Y52,Feuil2!$C$1:$CD$9,3,FALSE)","v":{"$error":"#VALUE!"}},{"$f":"T52-HLOOKUP(Y52,Feuil2!$C$1:$CD$9,4,FALSE)","v":{"$error":"#VALUE!"}},{"$f":"T52-HLOOKUP(Y52,Feuil2!$C$1:$CD$9,5,FALSE)","v":{"$error":"#VALUE!"}},{"$f":"T52-HLOOKUP(Y52,Feuil2!$C$1:$CD$9,6,FALSE)","v":{"$error":"#VALUE!"}},{"$f":"T52-HLOOKUP(Y52,Feuil2!$C$1:$CD$9,7,FALSE)","v":{"$error":"#VALUE!"}},{"$f":"T52-HLOOKUP(Y52,Feuil2!$C$1:$CD$9,8,FALSE)","v":{"$error":"#VALUE!"}},{"$f":"T52-HLOOKUP(Y52,Feuil2!$C$1:$CD$9,9,FALSE)","v":{"$error":"#VALUE!"}},null,null,null,null,null,null,null,{"$error":"#VALUE!"},2017,null,{"$f":"IF(AQ52,VLOOKUP(AQ52,HOM!$AS$389:$AT$444,2))","v":4.4930000000000003}]
["H",null,null,null,null,null,null,null,null,null,null,null,null,null,"",null,null,null,"","","","","",false,{"$f":"IF(AND(H53<1920),VLOOKUP(I53,Feuil2!$F$10:$P$28,11),IF(AND(H53>=1920,H53<1939),VLOOKUP(I53,Feuil2!$F$10:$P$28,11),IF(AND(H53>=1938,H53<1943),VLOOKUP(I53,Feuil2!$F$10:$P$28,10),IF(AND(H53>=1943,H53<1948),VLOOKUP(I53,Feuil2!$F$10:$P$28,9),IF(AND(H53>=1948,H53<1953),VLOOKUP(I53,Feuil2!$F$10:$P$28,8),IF(AND(H53>=1953,H53<1958),VLOOKUP(I53,Feuil2!$F$10:$P$28,7),IF(AND(H53>=1958,H53<1963),VLOOKUP(I53,Feuil2!$F$10:$P$28,6),IF(AND(H53>=1963,H53<1968),VLOOKUP(I53,Feuil2!$F$10:$P$28,5),IF(AND(H53>=1968,H53<1973),VLOOKUP(I53,Feuil2!$F$10:$P$28,4),IF(AND(H53>=1973,H53<1978),VLOOKUP(I53,Feuil2!$F$10:$P$28,3),IF(AND(H53>=1978,H53<1983),VLOOKUP(I53,Feuil2!$F$10:$P$28,2),VLOOKUP(I53,Feuil2!$F$10:$P$28,2))))))))))))","v":{"$error":"#N/A"}},null,{"$f":"T53-HLOOKUP(Y53,Feuil2!$C$1:$CD$9,2,FALSE)","v":{"$error":"#VALUE!"}},{"$f":"T53-HLOOKUP(Y53,Feuil2!$C$1:$CD$9,3,FALSE)","v":{"$error":"#VALUE!"}},{"$f":"T53-HLOOKUP(Y53,Feuil2!$C$1:$CD$9,4,FALSE)","v":{"$error":"#VALUE!"}},{"$f":"T53-HLOOKUP(Y53,Feuil2!$C$1:$CD$9,5,FALSE)","v":{"$error":"#VALUE!"}},{"$f":"T53-HLOOKUP(Y53,Feuil2!$C$1:$CD$9,6,FALSE)","v":{"$error":"#VALUE!"}},{"$f":"T53-HLOOKUP(Y53,Feuil2!$C$1:$CD$9,7,FALSE)","v":{"$error":"#VALUE!"}},{"$f":"T53-HLOOKUP(Y53,Feuil2!$C$1:$CD$9,8,FALSE)","v":{"$error":"#VALUE!"}},{"$f":"T53-HLOOKUP(Y53,Feuil2!$C$1:$CD$9,9,FALSE)","v":{"$error":"#VALUE!"}},null,null,null,null,null,null,null,{"$error":"#VALUE!"},2017,null,{"$f":"IF(AQ53,VLOOKUP(AQ53,HOM!$AS$389:$AT$444,2))","v":4.4930000000000003}]
["H",null,null,null,null,null,null,null,null,null,null,null,null,null,"",null,null,null,"","","","","",false,{"$f":"IF(AND(H54<1920),VLOOKUP(I54,Feuil2!$F$10:$P$28,11),IF(AND(H54>=1920,H54<1939),VLOOKUP(I54,Feuil2!$F$10:$P$28,11),IF(AND(H54>=1938,H54<1943),VLOOKUP(I54,Feuil2!$F$10:$P$28,10),IF(AND(H54>=1943,H54<1948),VLOOKUP(I54,Feuil2!$F$10:$P$28,9),IF(AND(H54>=1948,H54<1953),VLOOKUP(I54,Feuil2!$F$10:$P$28,8),IF(AND(H54>=1953,H54<1958),VLOOKUP(I54,Feuil2!$F$10:$P$28,7),IF(AND(H54>=1958,H54<1963),VLOOKUP(I54,Feuil2!$F$10:$P$28,6),IF(AND(H54>=1963,H54<1968),VLOOKUP(I54,Feuil2!$F$10:$P$28,5),IF(AND(H54>=1968,H54<1973),VLOOKUP(I54,Feuil2!$F$10:$P$28,4),IF(AND(H54>=1973,H54<1978),VLOOKUP(I54,Feuil2!$F$10:$P$28,3),IF(AND(H54>=1978,H54<1983),VLOOKUP(I54,Feuil2!$F$10:$P$28,2),VLOOKUP(I54,Feuil2!$F$10:$P$28,2))))))))))))","v":{"$error":"#N/A"}},null,{"$f":"T54-HLOOKUP(Y54,Feuil2!$C$1:$CD$9,2,FALSE)","v":{"$error":"#VALUE!"}},{"$f":"T54-HLOOKUP(Y54,Feuil2!$C$1:$CD$9,3,FALSE)","v":{"$error":"#VALUE!"}},{"$f":"T54-HLOOKUP(Y54,Feuil2!$C$1:$CD$9,4,FALSE)","v":{"$error":"#VALUE!"}},{"$f":"T54-HLOOKUP(Y54,Feuil2!$C$1:$CD$9,5,FALSE)","v":{"$error":"#VALUE!"}},{"$f":"T54-HLOOKUP(Y54,Feuil2!$C$1:$CD$9,6,FALSE)","v":{"$error":"#VALUE!"}},{"$f":"T54-HLOOKUP(Y54,Feuil2!$C$1:$CD$9,7,FALSE)","v":{"$error":"#VALUE!"}},{"$f":"T54-HLOOKUP(Y54,Feuil2!$C$1:$CD$9,8,FALSE)","v":{"$error":"#VALUE!"}},{"$f":"T54-HLOOKUP(Y54,Feuil2!$C$1:$CD$9,9,FALSE)","v":{"$error":"#VALUE!"}},null,null,null,null,null,null,null,{"$error":"#VALUE!"},2017,null,{"$f":"IF(AQ54,VLOOKUP(AQ54,HOM!$AS$389:$AT$444,2))","v":4.4930000000000003}]
["H",null,null,null,null,null,null,null,null,null,null,null,null,null,"",null,null,null,"","","","","",false,{"$f":"IF(AND(H55<1920),VLOOKUP(I55,Feuil2!$F$10:$P$28,11),IF(AND(H55>=1920,H55<1939),VLOOKUP(I55,Feuil2!$F$10:$P$28,11),IF(AND(H55>=1938,H55<1943),VLOOKUP(I55,Feuil2!$F$10:$P$28,10),IF(AND(H55>=1943,H55<1948),VLOOKUP(I55,Feuil2!$F$10:$P$28,9),IF(AND(H55>=1948,H55<1953),VLOOKUP(I55,Feuil2!$F$10:$P$28,8),IF(AND(H55>=1953,H55<1958),VLOOKUP(I55,Feuil2!$F$10:$P$28,7),IF(AND(H55>=1958,H55<1963),VLOOKUP(I55,Feuil2!$F$10:$P$28,6),IF(AND(H55>=1963,H55<1968),VLOOKUP(I55,Feuil2!$F$10:$P$28,5),IF(AND(H55>=1968,H55<1973),VLOOKUP(I55,Feuil2!$F$10:$P$28,4),IF(AND(H55>=1973,H55<1978),VLOOKUP(I55,Feuil2!$F$10:$P$28,3),IF(AND(H55>=1978,H55<1983),VLOOKUP(I55,Feuil2!$F$10:$P$28,2),VLOOKUP(I55,Feuil2!$F$10:$P$28,2))))))))))))","v":{"$error":"#N/A"}},null,{"$f":"T55-HLOOKUP(Y55,Feuil2!$C$1:$CD$9,2,FALSE)","v":{"$error":"#VALUE!"}},{"$f":"T55-HLOOKUP(Y55,Feuil2!$C$1:$CD$9,3,FALSE)","v":{"$error":"#VALUE!"}},{"$f":"T55-HLOOKUP(Y55,Feuil2!$C$1:$CD$9,4,FALSE)","v":{"$error":"#VALUE!"}},{"$f":"T55-HLOOKUP(Y55,Feuil2!$C$1:$CD$9,5,FALSE)","v":{"$error":"#VALUE!"}},{"$f":"T55-HLOOKUP(Y55,Feuil2!$C$1:$CD$9,6,FALSE)","v":{"$error":"#VALUE!"}},{"$f":"T55-HLOOKUP(Y55,Feuil2!$C$1:$CD$9,7,FALSE)","v":{"$error":"#VALUE!"}},{"$f":"T55-HLOOKUP(Y55,Feuil2!$C$1:$CD$9,8,FALSE)","v":{"$error":"#VALUE!"}},{"$f":"T55-HLOOKUP(Y55,Feuil2!$C$1:$CD$9,9,FALSE)","v":{"$error":"#VALUE!"}},null,null,null,null,null,null,null,{"$error":"#VALUE!"},2017,null,{"$f":"IF(AQ55,VLOOKUP(AQ55,HOM!$AS$389:$AT$444,2))","v":4.4930000000000003}]
["H",null,null,null,null,null,null,null,null,null,null,null,null,null,"",null,null,null,"","","","","",false,{"$f":"IF(AND(H56<1920),VLOOKUP(I56,Feuil2!$F$10:$P$28,11),IF(AND(H56>=1920,H56<1939),VLOOKUP(I56,Feuil2!$F$10:$P$28,11),IF(AND(H56>=1938,H56<1943),VLOOKUP(I56,Feuil2!$F$10:$P$28,10),IF(AND(H56>=1943,H56<1948),VLOOKUP(I56,Feuil2!$F$10:$P$28,9),IF(AND(H56>=1948,H56<1953),VLOOKUP(I56,Feuil2!$F$10:$P$28,8),IF(AND(H56>=1953,H56<1958),VLOOKUP(I56,Feuil2!$F$10:$P$28,7),IF(AND(H56>=1958,H56<1963),VLOOKUP(I56,Feuil2!$F$10:$P$28,6),IF(AND(H56>=1963,H56<1968),VLOOKUP(I56,Feuil2!$F$10:$P$28,5),IF(AND(H56>=1968,H56<1973),VLOOKUP(I56,Feuil2!$F$10:$P$28,4),IF(AND(H56>=1973,H56<1978),VLOOKUP(I56,Feuil2!$F$10:$P$28,3),IF(AND(H56>=1978,H56<1983),VLOOKUP(I56,Feuil2!$F$10:$P$28,2),VLOOKUP(I56,Feuil2!$F$10:$P$28,2))))))))))))","v":{"$error":"#N/A"}},null,{"$f":"T56-HLOOKUP(Y56,Feuil2!$C$1:$CD$9,2,FALSE)","v":{"$error":"#VALUE!"}},{"$f":"T56-HLOOKUP(Y56,Feuil2!$C$1:$CD$9,3,FALSE)","v":{"$error":"#VALUE!"}},{"$f":"T56-HLOOKUP(Y56,Feuil2!$C$1:$CD$9,4,FALSE)","v":{"$error":"#VALUE!"}},{"$f":"T56-HLOOKUP(Y56,Feuil2!$C$1:$CD$9,5,FALSE)","v":{"$error":"#VALUE!"}},{"$f":"T56-HLOOKUP(Y56,Feuil2!$C$1:$CD$9,6,FALSE)","v":{"$error":"#VALUE!"}},{"$f":"T56-HLOOKUP(Y56,Feuil2!$C$1:$CD$9,7,FALSE)","v":{"$error":"#VALUE!"}},{"$f":"T56-HLOOKUP(Y56,Feuil2!$C$1:$CD$9,8,FALSE)","v":{"$error":"#VALUE!"}},{"$f":"T56-HLOOKUP(Y56,Feuil2!$C$1:$CD$9,9,FALSE)","v":{"$error":"#VALUE!"}},null,null,null,null,null,null,null,{"$error":"#VALUE!"},2017,null,{"$f":"IF(AQ56,VLOOKUP(AQ56,HOM!$AS$389:$AT$444,2))","v":4.4930000000000003}]
["H",null,null,null,null,null,null,null,null,null,null,null,null,null,"",null,null,null,"","","","","",false,{"$f":"IF(AND(H57<1920),VLOOKUP(I57,Feuil2!$F$10:$P$28,11),IF(AND(H57>=1920,H57<1939),VLOOKUP(I57,Feuil2!$F$10:$P$28,11),IF(AND(H57>=1938,H57<1943),VLOOKUP(I57,Feuil2!$F$10:$P$28,10),IF(AND(H57>=1943,H57<1948),VLOOKUP(I57,Feuil2!$F$10:$P$28,9),IF(AND(H57>=1948,H57<1953),VLOOKUP(I57,Feuil2!$F$10:$P$28,8),IF(AND(H57>=1953,H57<1958),VLOOKUP(I57,Feuil2!$F$10:$P$28,7),IF(AND(H57>=1958,H57<1963),VLOOKUP(I57,Feuil2!$F$10:$P$28,6),IF(AND(H57>=1963,H57<1968),VLOOKUP(I57,Feuil2!$F$10:$P$28,5),IF(AND(H57>=1968,H57<1973),VLOOKUP(I57,Feuil2!$F$10:$P$28,4),IF(AND(H57>=1973,H57<1978),VLOOKUP(I57,Feuil2!$F$10:$P$28,3),IF(AND(H57>=1978,H57<1983),VLOOKUP(I57,Feuil2!$F$10:$P$28,2),VLOOKUP(I57,Feuil2!$F$10:$P$28,2))))))))))))","v":{"$error":"#N/A"}},null,{"$f":"T57-HLOOKUP(Y57,Feuil2!$C$1:$CD$9,2,FALSE)","v":{"$error":"#VALUE!"}},{"$f":"T57-HLOOKUP(Y57,Feuil2!$C$1:$CD$9,3,FALSE)","v":{"$error":"#VALUE!"}},{"$f":"T57-HLOOKUP(Y57,Feuil2!$C$1:$CD$9,4,FALSE)","v":{"$error":"#VALUE!"}},{"$f":"T57-HLOOKUP(Y57,Feuil2!$C$1:$CD$9,5,FALSE)","v":{"$error":"#VALUE!"}},{"$f":"T57-HLOOKUP(Y57,Feuil2!$C$1:$CD$9,6,FALSE)","v":{"$error":"#VALUE!"}},{"$f":"T57-HLOOKUP(Y57,Feuil2!$C$1:$CD$9,7,FALSE)","v":{"$error":"#VALUE!"}},{"$f":"T57-HLOOKUP(Y57,Feuil2!$C$1:$CD$9,8,FALSE)","v":{"$error":"#VALUE!"}},{"$f":"T57-HLOOKUP(Y57,Feuil2!$C$1:$CD$9,9,FALSE)","v":{"$error":"#VALUE!"}},null,null,null,null,null,null,null,{"$error":"#VALUE!"},2017,null,{"$f":"IF(AQ57,VLOOKUP(AQ57,HOM!$AS$389:$AT$444,2))","v":4.4930000000000003}]
["H",null,null,null,null,null,null,null,null,null,null,null,null,null,"",null,null,null,"","","","","",false,{"$f":"IF(AND(H58<1920),VLOOKUP(I58,Feuil2!$F$10:$P$28,11),IF(AND(H58>=1920,H58<1939),VLOOKUP(I58,Feuil2!$F$10:$P$28,11),IF(AND(H58>=1938,H58<1943),VLOOKUP(I58,Feuil2!$F$10:$P$28,10),IF(AND(H58>=1943,H58<1948),VLOOKUP(I58,Feuil2!$F$10:$P$28,9),IF(AND(H58>=1948,H58<1953),VLOOKUP(I58,Feuil2!$F$10:$P$28,8),IF(AND(H58>=1953,H58<1958),VLOOKUP(I58,Feuil2!$F$10:$P$28,7),IF(AND(H58>=1958,H58<1963),VLOOKUP(I58,Feuil2!$F$10:$P$28,6),IF(AND(H58>=1963,H58<1968),VLOOKUP(I58,Feuil2!$F$10:$P$28,5),IF(AND(H58>=1968,H58<1973),VLOOKUP(I58,Feuil2!$F$10:$P$28,4),IF(AND(H58>=1973,H58<1978),VLOOKUP(I58,Feuil2!$F$10:$P$28,3),IF(AND(H58>=1978,H58<1983),VLOOKUP(I58,Feuil2!$F$10:$P$28,2),VLOOKUP(I58,Feuil2!$F$10:$P$28,2))))))))))))","v":{"$error":"#N/A"}},null,{"$f":"T58-HLOOKUP(Y58,Feuil2!$C$1:$CD$9,2,FALSE)","v":{"$error":"#VALUE!"}},{"$f":"T58-HLOOKUP(Y58,Feuil2!$C$1:$CD$9,3,FALSE)","v":{"$error":"#VALUE!"}},{"$f":"T58-HLOOKUP(Y58,Feuil2!$C$1:$CD$9,4,FALSE)","v":{"$error":"#VALUE!"}},{"$f":"T58-HLOOKUP(Y58,Feuil2!$C$1:$CD$9,5,FALSE)","v":{"$error":"#VALUE!"}},{"$f":"T58-HLOOKUP(Y58,Feuil2!$C$1:$CD$9,6,FALSE)","v":{"$error":"#VALUE!"}},{"$f":"T58-HLOOKUP(Y58,Feuil2!$C$1:$CD$9,7,FALSE)","v":{"$error":"#VALUE!"}},{"$f":"T58-HLOOKUP(Y58,Feuil2!$C$1:$CD$9,8,FALSE)","v":{"$error":"#VALUE!"}},{"$f":"T58-HLOOKUP(Y58,Feuil2!$C$1:$CD$9,9,FALSE)","v":{"$error":"#VALUE!"}},null,null,null,null,null,null,null,{"$error":"#VALUE!"},2017,null,{"$f":"IF(AQ58,VLOOKUP(AQ58,HOM!$AS$389:$AT$444,2))","v":4.4930000000000003}]
["H",null,null,null,null,null,null,null,null,null,null,null,null,null,"",null,null,null,"","","","","",false,{"$f":"IF(AND(H59<1920),VLOOKUP(I59,Feuil2!$F$10:$P$28,11),IF(AND(H59>=1920,H59<1939),VLOOKUP(I59,Feuil2!$F$10:$P$28,11),IF(AND(H59>=1938,H59<1943),VLOOKUP(I59,Feuil2!$F$10:$P$28,10),IF(AND(H59>=1943,H59<1948),VLOOKUP(I59,Feuil2!$F$10:$P$28,9),IF(AND(H59>=1948,H59<1953),VLOOKUP(I59,Feuil2!$F$10:$P$28,8),IF(AND(H59>=1953,H59<1958),VLOOKUP(I59,Feuil2!$F$10:$P$28,7),IF(AND(H59>=1958,H59<1963),VLOOKUP(I59,Feuil2!$F$10:$P$28,6),IF(AND(H59>=1963,H59<1968),VLOOKUP(I59,Feuil2!$F$10:$P$28,5),IF(AND(H59>=1968,H59<1973),VLOOKUP(I59,Feuil2!$F$10:$P$28,4),IF(AND(H59>=1973,H59<1978),VLOOKUP(I59,Feuil2!$F$10:$P$28,3),IF(AND(H59>=1978,H59<1983),VLOOKUP(I59,Feuil2!$F$10:$P$28,2),VLOOKUP(I59,Feuil2!$F$10:$P$28,2))))))))))))","v":{"$error":"#N/A"}},null,{"$f":"T59-HLOOKUP(Y59,Feuil2!$C$1:$CD$9,2,FALSE)","v":{"$error":"#VALUE!"}},{"$f":"T59-HLOOKUP(Y59,Feuil2!$C$1:$CD$9,3,FALSE)","v":{"$error":"#VALUE!"}},{"$f":"T59-HLOOKUP(Y59,Feuil2!$C$1:$CD$9,4,FALSE)","v":{"$error":"#VALUE!"}},{"$f":"T59-HLOOKUP(Y59,Feuil2!$C$1:$CD$9,5,FALSE)","v":{"$error":"#VALUE!"}},{"$f":"T59-HLOOKUP(Y59,Feuil2!$C$1:$CD$9,6,FALSE)","v":{"$error":"#VALUE!"}},{"$f":"T59-HLOOKUP(Y59,Feuil2!$C$1:$CD$9,7,FALSE)","v":{"$error":"#VALUE!"}},{"$f":"T59-HLOOKUP(Y59,Feuil2!$C$1:$CD$9,8,FALSE)","v":{"$error":"#VALUE!"}},{"$f":"T59-HLOOKUP(Y59,Feuil2!$C$1:$CD$9,9,FALSE)","v":{"$error":"#VALUE!"}},null,null,null,null,null,null,null,{"$error":"#VALUE!"},2017,null,{"$f":"IF(AQ59,VLOOKUP(AQ59,HOM!$AS$389:$AT$444,2))","v":4.4930000000000003}]
["H",null,null,null,null,null,null,null,null,null,null,null,null,null,"",null,null,null,"","","","","",false,{"$f":"IF(AND(H60<1920),VLOOKUP(I60,Feuil2!$F$10:$P$28,11),IF(AND(H60>=1920,H60<1939),VLOOKUP(I60,Feuil2!$F$10:$P$28,11),IF(AND(H60>=1938,H60<1943),VLOOKUP(I60,Feuil2!$F$10:$P$28,10),IF(AND(H60>=1943,H60<1948),VLOOKUP(I60,Feuil2!$F$10:$P$28,9),IF(AND(H60>=1948,H60<1953),VLOOKUP(I60,Feuil2!$F$10:$P$28,8),IF(AND(H60>=1953,H60<1958),VLOOKUP(I60,Feuil2!$F$10:$P$28,7),IF(AND(H60>=1958,H60<1963),VLOOKUP(I60,Feuil2!$F$10:$P$28,6),IF(AND(H60>=1963,H60<1968),VLOOKUP(I60,Feuil2!$F$10:$P$28,5),IF(AND(H60>=1968,H60<1973),VLOOKUP(I60,Feuil2!$F$10:$P$28,4),IF(AND(H60>=1973,H60<1978),VLOOKUP(I60,Feuil2!$F$10:$P$28,3),IF(AND(H60>=1978,H60<1983),VLOOKUP(I60,Feuil2!$F$10:$P$28,2),VLOOKUP(I60,Feuil2!$F$10:$P$28,2))))))))))))","v":{"$error":"#N/A"}},null,{"$f":"T60-HLOOKUP(Y60,Feuil2!$C$1:$CD$9,2,FALSE)","v":{"$error":"#VALUE!"}},{"$f":"T60-HLOOKUP(Y60,Feuil2!$C$1:$CD$9,3,FALSE)","v":{"$error":"#VALUE!"}},{"$f":"T60-HLOOKUP(Y60,Feuil2!$C$1:$CD$9,4,FALSE)","v":{"$error":"#VALUE!"}},{"$f":"T60-HLOOKUP(Y60,Feuil2!$C$1:$CD$9,5,FALSE)","v":{"$error":"#VALUE!"}},{"$f":"T60-HLOOKUP(Y60,Feuil2!$C$1:$CD$9,6,FALSE)","v":{"$error":"#VALUE!"}},{"$f":"T60-HLOOKUP(Y60,Feuil2!$C$1:$CD$9,7,FALSE)","v":{"$error":"#VALUE!"}},{"$f":"T60-HLOOKUP(Y60,Feuil2!$C$1:$CD$9,8,FALSE)","v":{"$error":"#VALUE!"}},{"$f":"T60-HLOOKUP(Y60,Feuil2!$C$1:$CD$9,9,FALSE)","v":{"$error":"#VALUE!"}},null,null,null,null,null,null,null,{"$error":"#VALUE!"},2017,null,{"$f":"IF(AQ60,VLOOKUP(AQ60,HOM!$AS$389:$AT$444,2))","v":4.4930000000000003}]
["H",null,null,null,null,null,null,null,null,null,null,null,null,null,"",null,null,null,"","","","","",false,{"$f":"IF(AND(H61<1920),VLOOKUP(I61,Feuil2!$F$10:$P$28,11),IF(AND(H61>=1920,H61<1939),VLOOKUP(I61,Feuil2!$F$10:$P$28,11),IF(AND(H61>=1938,H61<1943),VLOOKUP(I61,Feuil2!$F$10:$P$28,10),IF(AND(H61>=1943,H61<1948),VLOOKUP(I61,Feuil2!$F$10:$P$28,9),IF(AND(H61>=1948,H61<1953),VLOOKUP(I61,Feuil2!$F$10:$P$28,8),IF(AND(H61>=1953,H61<1958),VLOOKUP(I61,Feuil2!$F$10:$P$28,7),IF(AND(H61>=1958,H61<1963),VLOOKUP(I61,Feuil2!$F$10:$P$28,6),IF(AND(H61>=1963,H61<1968),VLOOKUP(I61,Feuil2!$F$10:$P$28,5),IF(AND(H61>=1968,H61<1973),VLOOKUP(I61,Feuil2!$F$10:$P$28,4),IF(AND(H61>=1973,H61<1978),VLOOKUP(I61,Feuil2!$F$10:$P$28,3),IF(AND(H61>=1978,H61<1983),VLOOKUP(I61,Feuil2!$F$10:$P$28,2),VLOOKUP(I61,Feuil2!$F$10:$P$28,2))))))))))))","v":{"$error":"#N/A"}},null,{"$f":"T61-HLOOKUP(Y61,Feuil2!$C$1:$CD$9,2,FALSE)","v":{"$error":"#VALUE!"}},{"$f":"T61-HLOOKUP(Y61,Feuil2!$C$1:$CD$9,3,FALSE)","v":{"$error":"#VALUE!"}},{"$f":"T61-HLOOKUP(Y61,Feuil2!$C$1:$CD$9,4,FALSE)","v":{"$error":"#VALUE!"}},{"$f":"T61-HLOOKUP(Y61,Feuil2!$C$1:$CD$9,5,FALSE)","v":{"$error":"#VALUE!"}},{"$f":"T61-HLOOKUP(Y61,Feuil2!$C$1:$CD$9,6,FALSE)","v":{"$error":"#VALUE!"}},{"$f":"T61-HLOOKUP(Y61,Feuil2!$C$1:$CD$9,7,FALSE)","v":{"$error":"#VALUE!"}},{"$f":"T61-HLOOKUP(Y61,Feuil2!$C$1:$CD$9,8,FALSE)","v":{"$error":"#VALUE!"}},{"$f":"T61-HLOOKUP(Y61,Feuil2!$C$1:$CD$9,9,FALSE)","v":{"$error":"#VALUE!"}},null,null,null,null,null,null,null,{"$error":"#VALUE!"},2017,null,{"$f":"IF(AQ61,VLOOKUP(AQ61,HOM!$AS$389:$AT$444,2))","v":4.4930000000000003}]
["H",null,null,null,null,null,null,null,null,null,null,null,null,null,"",null,null,null,"","","","","",false,{"$f":"IF(AND(H62<1920),VLOOKUP(I62,Feuil2!$F$10:$P$28,11),IF(AND(H62>=1920,H62<1939),VLOOKUP(I62,Feuil2!$F$10:$P$28,11),IF(AND(H62>=1938,H62<1943),VLOOKUP(I62,Feuil2!$F$10:$P$28,10),IF(AND(H62>=1943,H62<1948),VLOOKUP(I62,Feuil2!$F$10:$P$28,9),IF(AND(H62>=1948,H62<1953),VLOOKUP(I62,Feuil2!$F$10:$P$28,8),IF(AND(H62>=1953,H62<1958),VLOOKUP(I62,Feuil2!$F$10:$P$28,7),IF(AND(H62>=1958,H62<1963),VLOOKUP(I62,Feuil2!$F$10:$P$28,6),IF(AND(H62>=1963,H62<1968),VLOOKUP(I62,Feuil2!$F$10:$P$28,5),IF(AND(H62>=1968,H62<1973),VLOOKUP(I62,Feuil2!$F$10:$P$28,4),IF(AND(H62>=1973,H62<1978),VLOOKUP(I62,Feuil2!$F$10:$P$28,3),IF(AND(H62>=1978,H62<1983),VLOOKUP(I62,Feuil2!$F$10:$P$28,2),VLOOKUP(I62,Feuil2!$F$10:$P$28,2))))))))))))","v":{"$error":"#N/A"}},null,{"$f":"T62-HLOOKUP(Y62,Feuil2!$C$1:$CD$9,2,FALSE)","v":{"$error":"#VALUE!"}},{"$f":"T62-HLOOKUP(Y62,Feuil2!$C$1:$CD$9,3,FALSE)","v":{"$error":"#VALUE!"}},{"$f":"T62-HLOOKUP(Y62,Feuil2!$C$1:$CD$9,4,FALSE)","v":{"$error":"#VALUE!"}},{"$f":"T62-HLOOKUP(Y62,Feuil2!$C$1:$CD$9,5,FALSE)","v":{"$error":"#VALUE!"}},{"$f":"T62-HLOOKUP(Y62,Feuil2!$C$1:$CD$9,6,FALSE)","v":{"$error":"#VALUE!"}},{"$f":"T62-HLOOKUP(Y62,Feuil2!$C$1:$CD$9,7,FALSE)","v":{"$error":"#VALUE!"}},{"$f":"T62-HLOOKUP(Y62,Feuil2!$C$1:$CD$9,8,FALSE)","v":{"$error":"#VALUE!"}},{"$f":"T62-HLOOKUP(Y62,Feuil2!$C$1:$CD$9,9,FALSE)","v":{"$error":"#VALUE!"}},null,null,null,null,null,null,null,{"$error":"#VALUE!"},2017,null,{"$f":"IF(AQ62,VLOOKUP(AQ62,HOM!$AS$389:$AT$444,2))","v":4.4930000000000003}]
["H",null,null,null,null,null,null,null,null,null,null,null,null,null,"",null,null,null,"","","","","",false,{"$f":"IF(AND(H63<1920),VLOOKUP(I63,Feuil2!$F$10:$P$28,11),IF(AND(H63>=1920,H63<1939),VLOOKUP(I63,Feuil2!$F$10:$P$28,11),IF(AND(H63>=1938,H63<1943),VLOOKUP(I63,Feuil2!$F$10:$P$28,10),IF(AND(H63>=1943,H63<1948),VLOOKUP(I63,Feuil2!$F$10:$P$28,9),IF(AND(H63>=1948,H63<1953),VLOOKUP(I63,Feuil2!$F$10:$P$28,8),IF(AND(H63>=1953,H63<1958),VLOOKUP(I63,Feuil2!$F$10:$P$28,7),IF(AND(H63>=1958,H63<1963),VLOOKUP(I63,Feuil2!$F$10:$P$28,6),IF(AND(H63>=1963,H63<1968),VLOOKUP(I63,Feuil2!$F$10:$P$28,5),IF(AND(H63>=1968,H63<1973),VLOOKUP(I63,Feuil2!$F$10:$P$28,4),IF(AND(H63>=1973,H63<1978),VLOOKUP(I63,Feuil2!$F$10:$P$28,3),IF(AND(H63>=1978,H63<1983),VLOOKUP(I63,Feuil2!$F$10:$P$28,2),VLOOKUP(I63,Feuil2!$F$10:$P$28,2))))))))))))","v":{"$error":"#N/A"}},null,{"$f":"T63-HLOOKUP(Y63,Feuil2!$C$1:$CD$9,2,FALSE)","v":{"$error":"#VALUE!"}},{"$f":"T63-HLOOKUP(Y63,Feuil2!$C$1:$CD$9,3,FALSE)","v":{"$error":"#VALUE!"}},{"$f":"T63-HLOOKUP(Y63,Feuil2!$C$1:$CD$9,4,FALSE)","v":{"$error":"#VALUE!"}},{"$f":"T63-HLOOKUP(Y63,Feuil2!$C$1:$CD$9,5,FALSE)","v":{"$error":"#VALUE!"}},{"$f":"T63-HLOOKUP(Y63,Feuil2!$C$1:$CD$9,6,FALSE)","v":{"$error":"#VALUE!"}},{"$f":"T63-HLOOKUP(Y63,Feuil2!$C$1:$CD$9,7,FALSE)","v":{"$error":"#VALUE!"}},{"$f":"T63-HLOOKUP(Y63,Feuil2!$C$1:$CD$9,8,FALSE)","v":{"$error":"#VALUE!"}},{"$f":"T63-HLOOKUP(Y63,Feuil2!$C$1:$CD$9,9,FALSE)","v":{"$error":"#VALUE!"}},null,null,null,null,null,null,null,{"$error":"#VALUE!"},2017,null,{"$f":"IF(AQ63,VLOOKUP(AQ63,HOM!$AS$389:$AT$444,2))","v":4.4930000000000003}]
["H",null,null,null,null,null,null,null,null,null,null,null,null,null,"",null,null,null,"","","","","",false,{"$f":"IF(AND(H64<1920),VLOOKUP(I64,Feuil2!$F$10:$P$28,11),IF(AND(H64>=1920,H64<1939),VLOOKUP(I64,Feuil2!$F$10:$P$28,11),IF(AND(H64>=1938,H64<1943),VLOOKUP(I64,Feuil2!$F$10:$P$28,10),IF(AND(H64>=1943,H64<1948),VLOOKUP(I64,Feuil2!$F$10:$P$28,9),IF(AND(H64>=1948,H64<1953),VLOOKUP(I64,Feuil2!$F$10:$P$28,8),IF(AND(H64>=1953,H64<1958),VLOOKUP(I64,Feuil2!$F$10:$P$28,7),IF(AND(H64>=1958,H64<1963),VLOOKUP(I64,Feuil2!$F$10:$P$28,6),IF(AND(H64>=1963,H64<1968),VLOOKUP(I64,Feuil2!$F$10:$P$28,5),IF(AND(H64>=1968,H64<1973),VLOOKUP(I64,Feuil2!$F$10:$P$28,4),IF(AND(H64>=1973,H64<1978),VLOOKUP(I64,Feuil2!$F$10:$P$28,3),IF(AND(H64>=1978,H64<1983),VLOOKUP(I64,Feuil2!$F$10:$P$28,2),VLOOKUP(I64,Feuil2!$F$10:$P$28,2))))))))))))","v":{"$error":"#N/A"}},null,{"$f":"T64-HLOOKUP(Y64,Feuil2!$C$1:$CD$9,2,FALSE)","v":{"$error":"#VALUE!"}},{"$f":"T64-HLOOKUP(Y64,Feuil2!$C$1:$CD$9,3,FALSE)","v":{"$error":"#VALUE!"}},{"$f":"T64-HLOOKUP(Y64,Feuil2!$C$1:$CD$9,4,FALSE)","v":{"$error":"#VALUE!"}},{"$f":"T64-HLOOKUP(Y64,Feuil2!$C$1:$CD$9,5,FALSE)","v":{"$error":"#VALUE!"}},{"$f":"T64-HLOOKUP(Y64,Feuil2!$C$1:$CD$9,6,FALSE)","v":{"$error":"#VALUE!"}},{"$f":"T64-HLOOKUP(Y64,Feuil2!$C$1:$CD$9,7,FALSE)","v":{"$error":"#VALUE!"}},{"$f":"T64-HLOOKUP(Y64,Feuil2!$C$1:$CD$9,8,FALSE)","v":{"$error":"#VALUE!"}},{"$f":"T64-HLOOKUP(Y64,Feuil2!$C$1:$CD$9,9,FALSE)","v":{"$error":"#VALUE!"}},null,null,null,null,null,null,null,{"$error":"#VALUE!"},2017,null,{"$f":"IF(AQ64,VLOOKUP(AQ64,HOM!$AS$389:$AT$444,2))","v":4.4930000000000003}]
["H",null,null,null,null,null,null,null,null,null,null,null,null,null,"",null,null,null,"","","","","",false,{"$f":"IF(AND(H65<1920),VLOOKUP(I65,Feuil2!$F$10:$P$28,11),IF(AND(H65>=1920,H65<1939),VLOOKUP(I65,Feuil2!$F$10:$P$28,11),IF(AND(H65>=1938,H65<1943),VLOOKUP(I65,Feuil2!$F$10:$P$28,10),IF(AND(H65>=1943,H65<1948),VLOOKUP(I65,Feuil2!$F$10:$P$28,9),IF(AND(H65>=1948,H65<1953),VLOOKUP(I65,Feuil2!$F$10:$P$28,8),IF(AND(H65>=1953,H65<1958),VLOOKUP(I65,Feuil2!$F$10:$P$28,7),IF(AND(H65>=1958,H65<1963),VLOOKUP(I65,Feuil2!$F$10:$P$28,6),IF(AND(H65>=1963,H65<1968),VLOOKUP(I65,Feuil2!$F$10:$P$28,5),IF(AND(H65>=1968,H65<1973),VLOOKUP(I65,Feuil2!$F$10:$P$28,4),IF(AND(H65>=1973,H65<1978),VLOOKUP(I65,Feuil2!$F$10:$P$28,3),IF(AND(H65>=1978,H65<1983),VLOOKUP(I65,Feuil2!$F$10:$P$28,2),VLOOKUP(I65,Feuil2!$F$10:$P$28,2))))))))))))","v":{"$error":"#N/A"}},null,{"$f":"T65-HLOOKUP(Y65,Feuil2!$C$1:$CD$9,2,FALSE)","v":{"$error":"#VALUE!"}},{"$f":"T65-HLOOKUP(Y65,Feuil2!$C$1:$CD$9,3,FALSE)","v":{"$error":"#VALUE!"}},{"$f":"T65-HLOOKUP(Y65,Feuil2!$C$1:$CD$9,4,FALSE)","v":{"$error":"#VALUE!"}},{"$f":"T65-HLOOKUP(Y65,Feuil2!$C$1:$CD$9,5,FALSE)","v":{"$error":"#VALUE!"}},{"$f":"T65-HLOOKUP(Y65,Feuil2!$C$1:$CD$9,6,FALSE)","v":{"$error":"#VALUE!"}},{"$f":"T65-HLOOKUP(Y65,Feuil2!$C$1:$CD$9,7,FALSE)","v":{"$error":"#VALUE!"}},{"$f":"T65-HLOOKUP(Y65,Feuil2!$C$1:$CD$9,8,FALSE)","v":{"$error":"#VALUE!"}},{"$f":"T65-HLOOKUP(Y65,Feuil2!$C$1:$CD$9,9,FALSE)","v":{"$error":"#VALUE!"}},null,null,null,null,null,null,null,{"$error":"#VALUE!"},2017,null,{"$f":"IF(AQ65,VLOOKUP(AQ65,HOM!$AS$389:$AT$444,2))","v":4.4930000000000003}]
["H",null,null,null,null,null,null,null,null,null,null,null,null,null,"",null,null,null,"","","","","",false,{"$f":"IF(AND(H66<1920),VLOOKUP(I66,Feuil2!$F$10:$P$28,11),IF(AND(H66>=1920,H66<1939),VLOOKUP(I66,Feuil2!$F$10:$P$28,11),IF(AND(H66>=1938,H66<1943),VLOOKUP(I66,Feuil2!$F$10:$P$28,10),IF(AND(H66>=1943,H66<1948),VLOOKUP(I66,Feuil2!$F$10:$P$28,9),IF(AND(H66>=1948,H66<1953),VLOOKUP(I66,Feuil2!$F$10:$P$28,8),IF(AND(H66>=1953,H66<1958),VLOOKUP(I66,Feuil2!$F$10:$P$28,7),IF(AND(H66>=1958,H66<1963),VLOOKUP(I66,Feuil2!$F$10:$P$28,6),IF(AND(H66>=1963,H66<1968),VLOOKUP(I66,Feuil2!$F$10:$P$28,5),IF(AND(H66>=1968,H66<1973),VLOOKUP(I66,Feuil2!$F$10:$P$28,4),IF(AND(H66>=1973,H66<1978),VLOOKUP(I66,Feuil2!$F$10:$P$28,3),IF(AND(H66>=1978,H66<1983),VLOOKUP(I66,Feuil2!$F$10:$P$28,2),VLOOKUP(I66,Feuil2!$F$10:$P$28,2))))))))))))","v":{"$error":"#N/A"}},null,{"$f":"T66-HLOOKUP(Y66,Feuil2!$C$1:$CD$9,2,FALSE)","v":{"$error":"#VALUE!"}},{"$f":"T66-HLOOKUP(Y66,Feuil2!$C$1:$CD$9,3,FALSE)","v":{"$error":"#VALUE!"}},{"$f":"T66-HLOOKUP(Y66,Feuil2!$C$1:$CD$9,4,FALSE)","v":{"$error":"#VALUE!"}},{"$f":"T66-HLOOKUP(Y66,Feuil2!$C$1:$CD$9,5,FALSE)","v":{"$error":"#VALUE!"}},{"$f":"T66-HLOOKUP(Y66,Feuil2!$C$1:$CD$9,6,FALSE)","v":{"$error":"#VALUE!"}},{"$f":"T66-HLOOKUP(Y66,Feuil2!$C$1:$CD$9,7,FALSE)","v":{"$error":"#VALUE!"}},{"$f":"T66-HLOOKUP(Y66,Feuil2!$C$1:$CD$9,8,FALSE)","v":{"$error":"#VALUE!"}},{"$f":"T66-HLOOKUP(Y66,Feuil2!$C$1:$CD$9,9,FALSE)","v":{"$error":"#VALUE!"}},null,null,null,null,null,null,null,{"$error":"#VALUE!"},2017,null,{"$f":"IF(AQ66,VLOOKUP(AQ66,HOM!$AS$389:$AT$444,2))","v":4.4930000000000003}]
["H",null,null,null,null,null,null,null,null,null,null,null,null,null,"",null,null,null,"","","","","",false,{"$f":"IF(AND(H67<1920),VLOOKUP(I67,Feuil2!$F$10:$P$28,11),IF(AND(H67>=1920,H67<1939),VLOOKUP(I67,Feuil2!$F$10:$P$28,11),IF(AND(H67>=1938,H67<1943),VLOOKUP(I67,Feuil2!$F$10:$P$28,10),IF(AND(H67>=1943,H67<1948),VLOOKUP(I67,Feuil2!$F$10:$P$28,9),IF(AND(H67>=1948,H67<1953),VLOOKUP(I67,Feuil2!$F$10:$P$28,8),IF(AND(H67>=1953,H67<1958),VLOOKUP(I67,Feuil2!$F$10:$P$28,7),IF(AND(H67>=1958,H67<1963),VLOOKUP(I67,Feuil2!$F$10:$P$28,6),IF(AND(H67>=1963,H67<1968),VLOOKUP(I67,Feuil2!$F$10:$P$28,5),IF(AND(H67>=1968,H67<1973),VLOOKUP(I67,Feuil2!$F$10:$P$28,4),IF(AND(H67>=1973,H67<1978),VLOOKUP(I67,Feuil2!$F$10:$P$28,3),IF(AND(H67>=1978,H67<1983),VLOOKUP(I67,Feuil2!$F$10:$P$28,2),VLOOKUP(I67,Feuil2!$F$10:$P$28,2))))))))))))","v":{"$error":"#N/A"}},null,{"$f":"T67-HLOOKUP(Y67,Feuil2!$C$1:$CD$9,2,FALSE)","v":{"$error":"#VALUE!"}},{"$f":"T67-HLOOKUP(Y67,Feuil2!$C$1:$CD$9,3,FALSE)","v":{"$error":"#VALUE!"}},{"$f":"T67-HLOOKUP(Y67,Feuil2!$C$1:$CD$9,4,FALSE)","v":{"$error":"#VALUE!"}},{"$f":"T67-HLOOKUP(Y67,Feuil2!$C$1:$CD$9,5,FALSE)","v":{"$error":"#VALUE!"}},{"$f":"T67-HLOOKUP(Y67,Feuil2!$C$1:$CD$9,6,FALSE)","v":{"$error":"#VALUE!"}},{"$f":"T67-HLOOKUP(Y67,Feuil2!$C$1:$CD$9,7,FALSE)","v":{"$error":"#VALUE!"}},{"$f":"T67-HLOOKUP(Y67,Feuil2!$C$1:$CD$9,8,FALSE)","v":{"$error":"#VALUE!"}},{"$f":"T67-HLOOKUP(Y67,Feuil2!$C$1:$CD$9,9,FALSE)","v":{"$error":"#VALUE!"}},null,null,null,null,null,null,null,{"$error":"#VALUE!"},2017,null,{"$f":"IF(AQ67,VLOOKUP(AQ67,HOM!$AS$389:$AT$444,2))","v":4.4930000000000003}]
["H",null,null,null,null,null,null,null,null,null,null,null,null,null,"",null,null,null,"","","","","",false,{"$f":"IF(AND(H68<1920),VLOOKUP(I68,Feuil2!$F$10:$P$28,11),IF(AND(H68>=1920,H68<1939),VLOOKUP(I68,Feuil2!$F$10:$P$28,11),IF(AND(H68>=1938,H68<1943),VLOOKUP(I68,Feuil2!$F$10:$P$28,10),IF(AND(H68>=1943,H68<1948),VLOOKUP(I68,Feuil2!$F$10:$P$28,9),IF(AND(H68>=1948,H68<1953),VLOOKUP(I68,Feuil2!$F$10:$P$28,8),IF(AND(H68>=1953,H68<1958),VLOOKUP(I68,Feuil2!$F$10:$P$28,7),IF(AND(H68>=1958,H68<1963),VLOOKUP(I68,Feuil2!$F$10:$P$28,6),IF(AND(H68>=1963,H68<1968),VLOOKUP(I68,Feuil2!$F$10:$P$28,5),IF(AND(H68>=1968,H68<1973),VLOOKUP(I68,Feuil2!$F$10:$P$28,4),IF(AND(H68>=1973,H68<1978),VLOOKUP(I68,Feuil2!$F$10:$P$28,3),IF(AND(H68>=1978,H68<1983),VLOOKUP(I68,Feuil2!$F$10:$P$28,2),VLOOKUP(I68,Feuil2!$F$10:$P$28,2))))))))))))","v":{"$error":"#N/A"}},null,{"$f":"T68-HLOOKUP(Y68,Feuil2!$C$1:$CD$9,2,FALSE)","v":{"$error":"#VALUE!"}},{"$f":"T68-HLOOKUP(Y68,Feuil2!$C$1:$CD$9,3,FALSE)","v":{"$error":"#VALUE!"}},{"$f":"T68-HLOOKUP(Y68,Feuil2!$C$1:$CD$9,4,FALSE)","v":{"$error":"#VALUE!"}},{"$f":"T68-HLOOKUP(Y68,Feuil2!$C$1:$CD$9,5,FALSE)","v":{"$error":"#VALUE!"}},{"$f":"T68-HLOOKUP(Y68,Feuil2!$C$1:$CD$9,6,FALSE)","v":{"$error":"#VALUE!"}},{"$f":"T68-HLOOKUP(Y68,Feuil2!$C$1:$CD$9,7,FALSE)","v":{"$error":"#VALUE!"}},{"$f":"T68-HLOOKUP(Y68,Feuil2!$C$1:$CD$9,8,FALSE)","v":{"$error":"#VALUE!"}},{"$f":"T68-HLOOKUP(Y68,Feuil2!$C$1:$CD$9,9,FALSE)","v":{"$error":"#VALUE!"}},null,null,null,null,null,null,null,{"$error":"#VALUE!"},2017,null,{"$f":"IF(AQ68,VLOOKUP(AQ68,HOM!$AS$389:$AT$444,2))","v":4.4930000000000003}]
["H",null,null,null,null,null,null,null,null,null,null,null,null,null,"",null,null,null,"","","","","",false,{"$f":"IF(AND(H69<1920),VLOOKUP(I69,Feuil2!$F$10:$P$28,11),IF(AND(H69>=1920,H69<1939),VLOOKUP(I69,Feuil2!$F$10:$P$28,11),IF(AND(H69>=1938,H69<1943),VLOOKUP(I69,Feuil2!$F$10:$P$28,10),IF(AND(H69>=1943,H69<1948),VLOOKUP(I69,Feuil2!$F$10:$P$28,9),IF(AND(H69>=1948,H69<1953),VLOOKUP(I69,Feuil2!$F$10:$P$28,8),IF(AND(H69>=1953,H69<1958),VLOOKUP(I69,Feuil2!$F$10:$P$28,7),IF(AND(H69>=1958,H69<1963),VLOOKUP(I69,Feuil2!$F$10:$P$28,6),IF(AND(H69>=1963,H69<1968),VLOOKUP(I69,Feuil2!$F$10:$P$28,5),IF(AND(H69>=1968,H69<1973),VLOOKUP(I69,Feuil2!$F$10:$P$28,4),IF(AND(H69>=1973,H69<1978),VLOOKUP(I69,Feuil2!$F$10:$P$28,3),IF(AND(H69>=1978,H69<1983),VLOOKUP(I69,Feuil2!$F$10:$P$28,2),VLOOKUP(I69,Feuil2!$F$10:$P$28,2))))))))))))","v":{"$error":"#N/A"}},null,{"$f":"T69-HLOOKUP(Y69,Feuil2!$C$1:$CD$9,2,FALSE)","v":{"$error":"#VALUE!"}},{"$f":"T69-HLOOKUP(Y69,Feuil2!$C$1:$CD$9,3,FALSE)","v":{"$error":"#VALUE!"}},{"$f":"T69-HLOOKUP(Y69,Feuil2!$C$1:$CD$9,4,FALSE)","v":{"$error":"#VALUE!"}},{"$f":"T69-HLOOKUP(Y69,Feuil2!$C$1:$CD$9,5,FALSE)","v":{"$error":"#VALUE!"}},{"$f":"T69-HLOOKUP(Y69,Feuil2!$C$1:$CD$9,6,FALSE)","v":{"$error":"#VALUE!"}},{"$f":"T69-HLOOKUP(Y69,Feuil2!$C$1:$CD$9,7,FALSE)","v":{"$error":"#VALUE!"}},{"$f":"T69-HLOOKUP(Y69,Feuil2!$C$1:$CD$9,8,FALSE)","v":{"$error":"#VALUE!"}},{"$f":"T69-HLOOKUP(Y69,Feuil2!$C$1:$CD$9,9,FALSE)","v":{"$error":"#VALUE!"}},null,null,null,null,null,null,null,{"$error":"#VALUE!"},2017,null,{"$f":"IF(AQ69,VLOOKUP(AQ69,HOM!$AS$389:$AT$444,2))","v":4.4930000000000003}]
["H",null,null,null,null,null,null,null,null,null,null,null,null,null,{"$f":"IF(I70=\"\",\"\",IF(MAXA(L70:N70)<=0,0,MAXA(L70:N70)))","v":""},null,null,null,{"$f":"IF(I70=\"\",\"\",IF(MAXA(P70:R70)<=0,0,MAXA(P70:R70)))","v":""},{"$f":"IF(I70=\"\",\"\",IF(OR(O70=0,S70=0),0,O70+S70))","v":""},{"$f":"IF(I70=\"\",\"\",IF(A70=\"H\",10^(0.794358141*LOG(I70/174.393)^2)*T70*AS70,IF(A70=\"F\",10^(0.89726074 * LOG(I70/148.026)^2)*T70*AS70,\"\")))","v":""},{"$f":"IF(I70=\"\",\"\",AP70)","v":""},{"$f":"IF(I70=\"\",\"\",IF(AH70>=0,AH70,IF(AG70>=0,AG70,IF(AF70>=0,AF70,IF(AE70>=0,AE70,IF(AD70>=0,AD70,IF(AC70>=0,AC70,IF(AB70>=0,AB70,AA70))))))))","v":""},{"$f":"IF(AQ70<95,IF(AQ70<=90,VLOOKUP(AQ70,$AQ$255:$AR$444,2)))","v":false},{"$f":"IF(AND(H70<1920),VLOOKUP(I70,Feuil2!$F$10:$P$28,11),IF(AND(H70>=1920,H70<1939),VLOOKUP(I70,Feuil2!$F$10:$P$28,11),IF(AND(H70>=1938,H70<1943),VLOOKUP(I70,Feuil2!$F$10:$P$28,10),IF(AND(H70>=1943,H70<1948),VLOOKUP(I70,Feuil2!$F$10:$P$28,9),IF(AND(H70>=1948,H70<1953),VLOOKUP(I70,Feuil2!$F$10:$P$28,8),IF(AND(H70>=1953,H70<1958),VLOOKUP(I70,Feuil2!$F$10:$P$28,7),IF(AND(H70>=1958,H70<1963),VLOOKUP(I70,Feuil2!$F$10:$P$28,6),IF(AND(H70>=1963,H70<1968),VLOOKUP(I70,Feuil2!$F$10:$P$28,5),IF(AND(H70>=1968,H70<1973),VLOOKUP(I70,Feuil2!$F$10:$P$28,4),IF(AND(H70>=1973,H70<1978),VLOOKUP(I70,Feuil2!$F$10:$P$28,3),IF(AND(H70>=1978,H70<1983),VLOOKUP(I70,Feuil2!$F$10:$P$28,2),VLOOKUP(I70,Feuil2!$F$10:$P$28,2))))))))))))","v":{"$error":"#N/A"}},null,{"$f":"T70-HLOOKUP(Y70,Feuil2!$C$1:$CD$9,2,FALSE)","v":{"$error":"#VALUE!"}},{"$f":"T70-HLOOKUP(Y70,Feuil2!$C$1:$CD$9,3,FALSE)","v":{"$error":"#VALUE!"}},{"$f":"T70-HLOOKUP(Y70,Feuil2!$C$1:$CD$9,4,FALSE)","v":{"$error":"#VALUE!"}},{"$f":"T70-HLOOKUP(Y70,Feuil2!$C$1:$CD$9,5,FALSE)","v":{"$error":"#VALUE!"}},{"$f":"T70-HLOOKUP(Y70,Feuil2!$C$1:$CD$9,6,FALSE)","v":{"$error":"#VALUE!"}},{"$f":"T70-HLOOKUP(Y70,Feuil2!$C$1:$CD$9,7,FALSE)","v":{"$error":"#VALUE!"}},{"$f":"T70-HLOOKUP(Y70,Feuil2!$C$1:$CD$9,8,FALSE)","v":{"$error":"#VALUE!"}},{"$f":"T70-HLOOKUP(Y70,Feuil2!$C$1:$CD$9,9,FALSE)","v":{"$error":"#VALUE!"}},null,null,null,null,null,null,null,{"$f":"IF(AH70>=0,$AH$5,IF(AG70>=0,$AG$5,IF(AF70>=0,$AF$5,IF(AE70>=0,$AE$5,IF(AD70>=0,$AD$5,IF(AC70>=0,$AC$5,IF(AB70>=0,$AB$5,IF(AA70>=0,$AA$5,$AI$5))))))))","v":{"$error":"#VALUE!"}},{"$f":"2017-H70","v":2017},null,{"$f":"IF(AQ70,VLOOKUP(AQ70,HOM!$AS$389:$AT$444,2))","v":4.4930000000000003}]
["H",null,null,null,null,null,null,null,null,null,null,null,null,null,{"$f":"IF(I71=\"\",\"\",IF(MAXA(L71:N71)<=0,0,MAXA(L71:N71)))","v":""},null,null,null,"","","","","",false,{"$f":"IF(AND(H71<1920),VLOOKUP(I71,Feuil2!$F$10:$P$28,11),IF(AND(H71>=1920,H71<1939),VLOOKUP(I71,Feuil2!$F$10:$P$28,11),IF(AND(H71>=1938,H71<1943),VLOOKUP(I71,Feuil2!$F$10:$P$28,10),IF(AND(H71>=1943,H71<1948),VLOOKUP(I71,Feuil2!$F$10:$P$28,9),IF(AND(H71>=1948,H71<1953),VLOOKUP(I71,Feuil2!$F$10:$P$28,8),IF(AND(H71>=1953,H71<1958),VLOOKUP(I71,Feuil2!$F$10:$P$28,7),IF(AND(H71>=1958,H71<1963),VLOOKUP(I71,Feuil2!$F$10:$P$28,6),IF(AND(H71>=1963,H71<1968),VLOOKUP(I71,Feuil2!$F$10:$P$28,5),IF(AND(H71>=1968,H71<1973),VLOOKUP(I71,Feuil2!$F$10:$P$28,4),IF(AND(H71>=1973,H71<1978),VLOOKUP(I71,Feuil2!$F$10:$P$28,3),IF(AND(H71>=1978,H71<1983),VLOOKUP(I71,Feuil2!$F$10:$P$28,2),VLOOKUP(I71,Feuil2!$F$10:$P$28,2))))))))))))","v":{"$error":"#N/A"}},null,{"$f":"T71-HLOOKUP(Y71,Feuil2!$C$1:$CD$9,2,FALSE)","v":{"$error":"#VALUE!"}},{"$f":"T71-HLOOKUP(Y71,Feuil2!$C$1:$CD$9,3,FALSE)","v":{"$error":"#VALUE!"}},{"$f":"T71-HLOOKUP(Y71,Feuil2!$C$1:$CD$9,4,FALSE)","v":{"$error":"#VALUE!"}},{"$f":"T71-HLOOKUP(Y71,Feuil2!$C$1:$CD$9,5,FALSE)","v":{"$error":"#VALUE!"}},{"$f":"T71-HLOOKUP(Y71,Feuil2!$C$1:$CD$9,6,FALSE)","v":{"$error":"#VALUE!"}},{"$f":"T71-HLOOKUP(Y71,Feuil2!$C$1:$CD$9,7,FALSE)","v":{"$error":"#VALUE!"}},{"$f":"T71-HLOOKUP(Y71,Feuil2!$C$1:$CD$9,8,FALSE)","v":{"$error":"#VALUE!"}},{"$f":"T71-HLOOKUP(Y71,Feuil2!$C$1:$CD$9,9,FALSE)","v":{"$error":"#VALUE!"}},null,null,null,null,null,null,null,{"$error":"#VALUE!"},2017,null,{"$f":"IF(AQ71,VLOOKUP(AQ71,HOM!$AS$389:$AT$444,2))","v":4.4930000000000003}]
["H",null,null,null,null,null,null,null,null,null,null,null,null,null,"",null,null,null,"","","","","",false,{"$f":"IF(AND(H72<1920),VLOOKUP(I72,Feuil2!$F$10:$P$28,11),IF(AND(H72>=1920,H72<1939),VLOOKUP(I72,Feuil2!$F$10:$P$28,11),IF(AND(H72>=1938,H72<1943),VLOOKUP(I72,Feuil2!$F$10:$P$28,10),IF(AND(H72>=1943,H72<1948),VLOOKUP(I72,Feuil2!$F$10:$P$28,9),IF(AND(H72>=1948,H72<1953),VLOOKUP(I72,Feuil2!$F$10:$P$28,8),IF(AND(H72>=1953,H72<1958),VLOOKUP(I72,Feuil2!$F$10:$P$28,7),IF(AND(H72>=1958,H72<1963),VLOOKUP(I72,Feuil2!$F$10:$P$28,6),IF(AND(H72>=1963,H72<1968),VLOOKUP(I72,Feuil2!$F$10:$P$28,5),IF(AND(H72>=1968,H72<1973),VLOOKUP(I72,Feuil2!$F$10:$P$28,4),IF(AND(H72>=1973,H72<1978),VLOOKUP(I72,Feuil2!$F$10:$P$28,3),IF(AND(H72>=1978,H72<1983),VLOOKUP(I72,Feuil2!$F$10:$P$28,2),VLOOKUP(I72,Feuil2!$F$10:$P$28,2))))))))))))","v":{"$error":"#N/A"}},null,{"$f":"T72-HLOOKUP(Y72,Feuil2!$C$1:$CD$9,2,FALSE)","v":{"$error":"#VALUE!"}},{"$f":"T72-HLOOKUP(Y72,Feuil2!$C$1:$CD$9,3,FALSE)","v":{"$error":"#VALUE!"}},{"$f":"T72-HLOOKUP(Y72,Feuil2!$C$1:$CD$9,4,FALSE)","v":{"$error":"#VALUE!"}},{"$f":"T72-HLOOKUP(Y72,Feuil2!$C$1:$CD$9,5,FALSE)","v":{"$error":"#VALUE!"}},{"$f":"T72-HLOOKUP(Y72,Feuil2!$C$1:$CD$9,6,FALSE)","v":{"$error":"#VALUE!"}},{"$f":"T72-HLOOKUP(Y72,Feuil2!$C$1:$CD$9,7,FALSE)","v":{"$error":"#VALUE!"}},{"$f":"T72-HLOOKUP(Y72,Feuil2!$C$1:$CD$9,8,FALSE)","v":{"$error":"#VALUE!"}},{"$f":"T72-HLOOKUP(Y72,Feuil2!$C$1:$CD$9,9,FALSE)","v":{"$error":"#VALUE!"}},null,null,null,null,null,null,null,{"$error":"#VALUE!"},2017,null,{"$f":"IF(AQ72,VLOOKUP(AQ72,HOM!$AS$389:$AT$444,2))","v":4.4930000000000003}]
["H",null,null,null,null,null,null,null,null,null,null,null,null,null,"",null,null,null,"","","","","",false,{"$f":"IF(AND(H73<1920),VLOOKUP(I73,Feuil2!$F$10:$P$28,11),IF(AND(H73>=1920,H73<1939),VLOOKUP(I73,Feuil2!$F$10:$P$28,11),IF(AND(H73>=1938,H73<1943),VLOOKUP(I73,Feuil2!$F$10:$P$28,10),IF(AND(H73>=1943,H73<1948),VLOOKUP(I73,Feuil2!$F$10:$P$28,9),IF(AND(H73>=1948,H73<1953),VLOOKUP(I73,Feuil2!$F$10:$P$28,8),IF(AND(H73>=1953,H73<1958),VLOOKUP(I73,Feuil2!$F$10:$P$28,7),IF(AND(H73>=1958,H73<1963),VLOOKUP(I73,Feuil2!$F$10:$P$28,6),IF(AND(H73>=1963,H73<1968),VLOOKUP(I73,Feuil2!$F$10:$P$28,5),IF(AND(H73>=1968,H73<1973),VLOOKUP(I73,Feuil2!$F$10:$P$28,4),IF(AND(H73>=1973,H73<1978),VLOOKUP(I73,Feuil2!$F$10:$P$28,3),IF(AND(H73>=1978,H73<1983),VLOOKUP(I73,Feuil2!$F$10:$P$28,2),VLOOKUP(I73,Feuil2!$F$10:$P$28,2))))))))))))","v":{"$error":"#N/A"}},null,{"$f":"T73-HLOOKUP(Y73,Feuil2!$C$1:$CD$9,2,FALSE)","v":{"$error":"#VALUE!"}},{"$f":"T73-HLOOKUP(Y73,Feuil2!$C$1:$CD$9,3,FALSE)","v":{"$error":"#VALUE!"}},{"$f":"T73-HLOOKUP(Y73,Feuil2!$C$1:$CD$9,4,FALSE)","v":{"$error":"#VALUE!"}},{"$f":"T73-HLOOKUP(Y73,Feuil2!$C$1:$CD$9,5,FALSE)","v":{"$error":"#VALUE!"}},{"$f":"T73-HLOOKUP(Y73,Feuil2!$C$1:$CD$9,6,FALSE)","v":{"$error":"#VALUE!"}},{"$f":"T73-HLOOKUP(Y73,Feuil2!$C$1:$CD$9,7,FALSE)","v":{"$error":"#VALUE!"}},{"$f":"T73-HLOOKUP(Y73,Feuil2!$C$1:$CD$9,8,FALSE)","v":{"$error":"#VALUE!"}},{"$f":"T73-HLOOKUP(Y73,Feuil2!$C$1:$CD$9,9,FALSE)","v":{"$error":"#VALUE!"}},null,null,null,null,null,null,null,{"$error":"#VALUE!"},2017,null,{"$f":"IF(AQ73,VLOOKUP(AQ73,HOM!$AS$389:$AT$444,2))","v":4.4930000000000003}]
["H",null,null,null,null,null,null,null,null,null,null,null,null,null,"",null,null,null,"","","","","",false,{"$f":"IF(AND(H74<1920),VLOOKUP(I74,Feuil2!$F$10:$P$28,11),IF(AND(H74>=1920,H74<1939),VLOOKUP(I74,Feuil2!$F$10:$P$28,11),IF(AND(H74>=1938,H74<1943),VLOOKUP(I74,Feuil2!$F$10:$P$28,10),IF(AND(H74>=1943,H74<1948),VLOOKUP(I74,Feuil2!$F$10:$P$28,9),IF(AND(H74>=1948,H74<1953),VLOOKUP(I74,Feuil2!$F$10:$P$28,8),IF(AND(H74>=1953,H74<1958),VLOOKUP(I74,Feuil2!$F$10:$P$28,7),IF(AND(H74>=1958,H74<1963),VLOOKUP(I74,Feuil2!$F$10:$P$28,6),IF(AND(H74>=1963,H74<1968),VLOOKUP(I74,Feuil2!$F$10:$P$28,5),IF(AND(H74>=1968,H74<1973),VLOOKUP(I74,Feuil2!$F$10:$P$28,4),IF(AND(H74>=1973,H74<1978),VLOOKUP(I74,Feuil2!$F$10:$P$28,3),IF(AND(H74>=1978,H74<1983),VLOOKUP(I74,Feuil2!$F$10:$P$28,2),VLOOKUP(I74,Feuil2!$F$10:$P$28,2))))))))))))","v":{"$error":"#N/A"}},null,{"$f":"T74-HLOOKUP(Y74,Feuil2!$C$1:$CD$9,2,FALSE)","v":{"$error":"#VALUE!"}},{"$f":"T74-HLOOKUP(Y74,Feuil2!$C$1:$CD$9,3,FALSE)","v":{"$error":"#VALUE!"}},{"$f":"T74-HLOOKUP(Y74,Feuil2!$C$1:$CD$9,4,FALSE)","v":{"$error":"#VALUE!"}},{"$f":"T74-HLOOKUP(Y74,Feuil2!$C$1:$CD$9,5,FALSE)","v":{"$error":"#VALUE!"}},{"$f":"T74-HLOOKUP(Y74,Feuil2!$C$1:$CD$9,6,FALSE)","v":{"$error":"#VALUE!"}},{"$f":"T74-HLOOKUP(Y74,Feuil2!$C$1:$CD$9,7,FALSE)","v":{"$error":"#VALUE!"}},{"$f":"T74-HLOOKUP(Y74,Feuil2!$C$1:$CD$9,8,FALSE)","v":{"$error":"#VALUE!"}},{"$f":"T74-HLOOKUP(Y74,Feuil2!$C$1:$CD$9,9,FALSE)","v":{"$error":"#VALUE!"}},null,null,null,null,null,null,null,{"$error":"#VALUE!"},2017,null,{"$f":"IF(AQ74,VLOOKUP(AQ74,HOM!$AS$389:$AT$444,2))","v":4.4930000000000003}]
["H",null,null,null,null,null,null,null,null,null,null,null,null,null,"",null,null,null,"","","","","",false,{"$f":"IF(AND(H75<1920),VLOOKUP(I75,Feuil2!$F$10:$P$28,11),IF(AND(H75>=1920,H75<1939),VLOOKUP(I75,Feuil2!$F$10:$P$28,11),IF(AND(H75>=1938,H75<1943),VLOOKUP(I75,Feuil2!$F$10:$P$28,10),IF(AND(H75>=1943,H75<1948),VLOOKUP(I75,Feuil2!$F$10:$P$28,9),IF(AND(H75>=1948,H75<1953),VLOOKUP(I75,Feuil2!$F$10:$P$28,8),IF(AND(H75>=1953,H75<1958),VLOOKUP(I75,Feuil2!$F$10:$P$28,7),IF(AND(H75>=1958,H75<1963),VLOOKUP(I75,Feuil2!$F$10:$P$28,6),IF(AND(H75>=1963,H75<1968),VLOOKUP(I75,Feuil2!$F$10:$P$28,5),IF(AND(H75>=1968,H75<1973),VLOOKUP(I75,Feuil2!$F$10:$P$28,4),IF(AND(H75>=1973,H75<1978),VLOOKUP(I75,Feuil2!$F$10:$P$28,3),IF(AND(H75>=1978,H75<1983),VLOOKUP(I75,Feuil2!$F$10:$P$28,2),VLOOKUP(I75,Feuil2!$F$10:$P$28,2))))))))))))","v":{"$error":"#N/A"}},null,{"$f":"T75-HLOOKUP(Y75,Feuil2!$C$1:$CD$9,2,FALSE)","v":{"$error":"#VALUE!"}},{"$f":"T75-HLOOKUP(Y75,Feuil2!$C$1:$CD$9,3,FALSE)","v":{"$error":"#VALUE!"}},{"$f":"T75-HLOOKUP(Y75,Feuil2!$C$1:$CD$9,4,FALSE)","v":{"$error":"#VALUE!"}},{"$f":"T75-HLOOKUP(Y75,Feuil2!$C$1:$CD$9,5,FALSE)","v":{"$error":"#VALUE!"}},{"$f":"T75-HLOOKUP(Y75,Feuil2!$C$1:$CD$9,6,FALSE)","v":{"$error":"#VALUE!"}},{"$f":"T75-HLOOKUP(Y75,Feuil2!$C$1:$CD$9,7,FALSE)","v":{"$error":"#VALUE!"}},{"$f":"T75-HLOOKUP(Y75,Feuil2!$C$1:$CD$9,8,FALSE)","v":{"$error":"#VALUE!"}},{"$f":"T75-HLOOKUP(Y75,Feuil2!$C$1:$CD$9,9,FALSE)","v":{"$error":"#VALUE!"}},null,null,null,null,null,null,null,{"$error":"#VALUE!"},2017,null,{"$f":"IF(AQ75,VLOOKUP(AQ75,HOM!$AS$389:$AT$444,2))","v":4.4930000000000003}]
["H",null,null,null,null,null,null,null,null,null,null,null,null,null,"",null,null,null,"","","","","",false,{"$f":"IF(AND(H76<1920),VLOOKUP(I76,Feuil2!$F$10:$P$28,11),IF(AND(H76>=1920,H76<1939),VLOOKUP(I76,Feuil2!$F$10:$P$28,11),IF(AND(H76>=1938,H76<1943),VLOOKUP(I76,Feuil2!$F$10:$P$28,10),IF(AND(H76>=1943,H76<1948),VLOOKUP(I76,Feuil2!$F$10:$P$28,9),IF(AND(H76>=1948,H76<1953),VLOOKUP(I76,Feuil2!$F$10:$P$28,8),IF(AND(H76>=1953,H76<1958),VLOOKUP(I76,Feuil2!$F$10:$P$28,7),IF(AND(H76>=1958,H76<1963),VLOOKUP(I76,Feuil2!$F$10:$P$28,6),IF(AND(H76>=1963,H76<1968),VLOOKUP(I76,Feuil2!$F$10:$P$28,5),IF(AND(H76>=1968,H76<1973),VLOOKUP(I76,Feuil2!$F$10:$P$28,4),IF(AND(H76>=1973,H76<1978),VLOOKUP(I76,Feuil2!$F$10:$P$28,3),IF(AND(H76>=1978,H76<1983),VLOOKUP(I76,Feuil2!$F$10:$P$28,2),VLOOKUP(I76,Feuil2!$F$10:$P$28,2))))))))))))","v":{"$error":"#N/A"}},null,{"$f":"T76-HLOOKUP(Y76,Feuil2!$C$1:$CD$9,2,FALSE)","v":{"$error":"#VALUE!"}},{"$f":"T76-HLOOKUP(Y76,Feuil2!$C$1:$CD$9,3,FALSE)","v":{"$error":"#VALUE!"}},{"$f":"T76-HLOOKUP(Y76,Feuil2!$C$1:$CD$9,4,FALSE)","v":{"$error":"#VALUE!"}},{"$f":"T76-HLOOKUP(Y76,Feuil2!$C$1:$CD$9,5,FALSE)","v":{"$error":"#VALUE!"}},{"$f":"T76-HLOOKUP(Y76,Feuil2!$C$1:$CD$9,6,FALSE)","v":{"$error":"#VALUE!"}},{"$f":"T76-HLOOKUP(Y76,Feuil2!$C$1:$CD$9,7,FALSE)","v":{"$error":"#VALUE!"}},{"$f":"T76-HLOOKUP(Y76,Feuil2!$C$1:$CD$9,8,FALSE)","v":{"$error":"#VALUE!"}},{"$f":"T76-HLOOKUP(Y76,Feuil2!$C$1:$CD$9,9,FALSE)","v":{"$error":"#VALUE!"}},null,null,null,null,null,null,null,{"$error":"#VALUE!"},2017,null,{"$f":"IF(AQ76,VLOOKUP(AQ76,HOM!$AS$389:$AT$444,2))","v":4.4930000000000003}]
["H",null,null,null,null,null,null,null,null,null,null,null,null,null,"",null,null,null,"","","","","",false,{"$f":"IF(AND(H77<1920),VLOOKUP(I77,Feuil2!$F$10:$P$28,11),IF(AND(H77>=1920,H77<1939),VLOOKUP(I77,Feuil2!$F$10:$P$28,11),IF(AND(H77>=1938,H77<1943),VLOOKUP(I77,Feuil2!$F$10:$P$28,10),IF(AND(H77>=1943,H77<1948),VLOOKUP(I77,Feuil2!$F$10:$P$28,9),IF(AND(H77>=1948,H77<1953),VLOOKUP(I77,Feuil2!$F$10:$P$28,8),IF(AND(H77>=1953,H77<1958),VLOOKUP(I77,Feuil2!$F$10:$P$28,7),IF(AND(H77>=1958,H77<1963),VLOOKUP(I77,Feuil2!$F$10:$P$28,6),IF(AND(H77>=1963,H77<1968),VLOOKUP(I77,Feuil2!$F$10:$P$28,5),IF(AND(H77>=1968,H77<1973),VLOOKUP(I77,Feuil2!$F$10:$P$28,4),IF(AND(H77>=1973,H77<1978),VLOOKUP(I77,Feuil2!$F$10:$P$28,3),IF(AND(H77>=1978,H77<1983),VLOOKUP(I77,Feuil2!$F$10:$P$28,2),VLOOKUP(I77,Feuil2!$F$10:$P$28,2))))))))))))","v":{"$error":"#N/A"}},null,{"$f":"T77-HLOOKUP(Y77,Feuil2!$C$1:$CD$9,2,FALSE)","v":{"$error":"#VALUE!"}},{"$f":"T77-HLOOKUP(Y77,Feuil2!$C$1:$CD$9,3,FALSE)","v":{"$error":"#VALUE!"}},{"$f":"T77-HLOOKUP(Y77,Feuil2!$C$1:$CD$9,4,FALSE)","v":{"$error":"#VALUE!"}},{"$f":"T77-HLOOKUP(Y77,Feuil2!$C$1:$CD$9,5,FALSE)","v":{"$error":"#VALUE!"}},{"$f":"T77-HLOOKUP(Y77,Feuil2!$C$1:$CD$9,6,FALSE)","v":{"$error":"#VALUE!"}},{"$f":"T77-HLOOKUP(Y77,Feuil2!$C$1:$CD$9,7,FALSE)","v":{"$error":"#VALUE!"}},{"$f":"T77-HLOOKUP(Y77,Feuil2!$C$1:$CD$9,8,FALSE)","v":{"$error":"#VALUE!"}},{"$f":"T77-HLOOKUP(Y77,Feuil2!$C$1:$CD$9,9,FALSE)","v":{"$error":"#VALUE!"}},null,null,null,null,null,null,null,{"$error":"#VALUE!"},2017,null,{"$f":"IF(AQ77,VLOOKUP(AQ77,HOM!$AS$389:$AT$444,2))","v":4.4930000000000003}]
["H",null,null,null,null,null,null,null,null,null,null,null,null,null,"",null,null,null,"","","","","",false,{"$f":"IF(AND(H78<1920),VLOOKUP(I78,Feuil2!$F$10:$P$28,11),IF(AND(H78>=1920,H78<1939),VLOOKUP(I78,Feuil2!$F$10:$P$28,11),IF(AND(H78>=1938,H78<1943),VLOOKUP(I78,Feuil2!$F$10:$P$28,10),IF(AND(H78>=1943,H78<1948),VLOOKUP(I78,Feuil2!$F$10:$P$28,9),IF(AND(H78>=1948,H78<1953),VLOOKUP(I78,Feuil2!$F$10:$P$28,8),IF(AND(H78>=1953,H78<1958),VLOOKUP(I78,Feuil2!$F$10:$P$28,7),IF(AND(H78>=1958,H78<1963),VLOOKUP(I78,Feuil2!$F$10:$P$28,6),IF(AND(H78>=1963,H78<1968),VLOOKUP(I78,Feuil2!$F$10:$P$28,5),IF(AND(H78>=1968,H78<1973),VLOOKUP(I78,Feuil2!$F$10:$P$28,4),IF(AND(H78>=1973,H78<1978),VLOOKUP(I78,Feuil2!$F$10:$P$28,3),IF(AND(H78>=1978,H78<1983),VLOOKUP(I78,Feuil2!$F$10:$P$28,2),VLOOKUP(I78,Feuil2!$F$10:$P$28,2))))))))))))","v":{"$error":"#N/A"}},null,{"$f":"T78-HLOOKUP(Y78,Feuil2!$C$1:$CD$9,2,FALSE)","v":{"$error":"#VALUE!"}},{"$f":"T78-HLOOKUP(Y78,Feuil2!$C$1:$CD$9,3,FALSE)","v":{"$error":"#VALUE!"}},{"$f":"T78-HLOOKUP(Y78,Feuil2!$C$1:$CD$9,4,FALSE)","v":{"$error":"#VALUE!"}},{"$f":"T78-HLOOKUP(Y78,Feuil2!$C$1:$CD$9,5,FALSE)","v":{"$error":"#VALUE!"}},{"$f":"T78-HLOOKUP(Y78,Feuil2!$C$1:$CD$9,6,FALSE)","v":{"$error":"#VALUE!"}},{"$f":"T78-HLOOKUP(Y78,Feuil2!$C$1:$CD$9,7,FALSE)","v":{"$error":"#VALUE!"}},{"$f":"T78-HLOOKUP(Y78,Feuil2!$C$1:$CD$9,8,FALSE)","v":{"$error":"#VALUE!"}},{"$f":"T78-HLOOKUP(Y78,Feuil2!$C$1:$CD$9,9,FALSE)","v":{"$error":"#VALUE!"}},null,null,null,null,null,null,null,{"$error":"#VALUE!"},2017,null,{"$f":"IF(AQ78,VLOOKUP(AQ78,HOM!$AS$389:$AT$444,2))","v":4.4930000000000003}]
["H",null,null,null,null,null,null,null,null,null,null,null,null,null,"",null,null,null,"","","","","",false,{"$f":"IF(AND(H79<1920),VLOOKUP(I79,Feuil2!$F$10:$P$28,11),IF(AND(H79>=1920,H79<1939),VLOOKUP(I79,Feuil2!$F$10:$P$28,11),IF(AND(H79>=1938,H79<1943),VLOOKUP(I79,Feuil2!$F$10:$P$28,10),IF(AND(H79>=1943,H79<1948),VLOOKUP(I79,Feuil2!$F$10:$P$28,9),IF(AND(H79>=1948,H79<1953),VLOOKUP(I79,Feuil2!$F$10:$P$28,8),IF(AND(H79>=1953,H79<1958),VLOOKUP(I79,Feuil2!$F$10:$P$28,7),IF(AND(H79>=1958,H79<1963),VLOOKUP(I79,Feuil2!$F$10:$P$28,6),IF(AND(H79>=1963,H79<1968),VLOOKUP(I79,Feuil2!$F$10:$P$28,5),IF(AND(H79>=1968,H79<1973),VLOOKUP(I79,Feuil2!$F$10:$P$28,4),IF(AND(H79>=1973,H79<1978),VLOOKUP(I79,Feuil2!$F$10:$P$28,3),IF(AND(H79>=1978,H79<1983),VLOOKUP(I79,Feuil2!$F$10:$P$28,2),VLOOKUP(I79,Feuil2!$F$10:$P$28,2))))))))))))","v":{"$error":"#N/A"}},null,{"$f":"T79-HLOOKUP(Y79,Feuil2!$C$1:$CD$9,2,FALSE)","v":{"$error":"#VALUE!"}},{"$f":"T79-HLOOKUP(Y79,Feuil2!$C$1:$CD$9,3,FALSE)","v":{"$error":"#VALUE!"}},{"$f":"T79-HLOOKUP(Y79,Feuil2!$C$1:$CD$9,4,FALSE)","v":{"$error":"#VALUE!"}},{"$f":"T79-HLOOKUP(Y79,Feuil2!$C$1:$CD$9,5,FALSE)","v":{"$error":"#VALUE!"}},{"$f":"T79-HLOOKUP(Y79,Feuil2!$C$1:$CD$9,6,FALSE)","v":{"$error":"#VALUE!"}},{"$f":"T79-HLOOKUP(Y79,Feuil2!$C$1:$CD$9,7,FALSE)","v":{"$error":"#VALUE!"}},{"$f":"T79-HLOOKUP(Y79,Feuil2!$C$1:$CD$9,8,FALSE)","v":{"$error":"#VALUE!"}},{"$f":"T79-HLOOKUP(Y79,Feuil2!$C$1:$CD$9,9,FALSE)","v":{"$error":"#VALUE!"}},null,null,null,null,null,null,null,{"$error":"#VALUE!"},2017,null,{"$f":"IF(AQ79,VLOOKUP(AQ79,HOM!$AS$389:$AT$444,2))","v":4.4930000000000003}]
["H",null,null,null,null,null,null,null,null,null,null,null,null,null,"",null,null,null,"","","","","",false,{"$f":"IF(AND(H80<1920),VLOOKUP(I80,Feuil2!$F$10:$P$28,11),IF(AND(H80>=1920,H80<1939),VLOOKUP(I80,Feuil2!$F$10:$P$28,11),IF(AND(H80>=1938,H80<1943),VLOOKUP(I80,Feuil2!$F$10:$P$28,10),IF(AND(H80>=1943,H80<1948),VLOOKUP(I80,Feuil2!$F$10:$P$28,9),IF(AND(H80>=1948,H80<1953),VLOOKUP(I80,Feuil2!$F$10:$P$28,8),IF(AND(H80>=1953,H80<1958),VLOOKUP(I80,Feuil2!$F$10:$P$28,7),IF(AND(H80>=1958,H80<1963),VLOOKUP(I80,Feuil2!$F$10:$P$28,6),IF(AND(H80>=1963,H80<1968),VLOOKUP(I80,Feuil2!$F$10:$P$28,5),IF(AND(H80>=1968,H80<1973),VLOOKUP(I80,Feuil2!$F$10:$P$28,4),IF(AND(H80>=1973,H80<1978),VLOOKUP(I80,Feuil2!$F$10:$P$28,3),IF(AND(H80>=1978,H80<1983),VLOOKUP(I80,Feuil2!$F$10:$P$28,2),VLOOKUP(I80,Feuil2!$F$10:$P$28,2))))))))))))","v":{"$error":"#N/A"}},null,{"$f":"T80-HLOOKUP(Y80,Feuil2!$C$1:$CD$9,2,FALSE)","v":{"$error":"#VALUE!"}},{"$f":"T80-HLOOKUP(Y80,Feuil2!$C$1:$CD$9,3,FALSE)","v":{"$error":"#VALUE!"}},{"$f":"T80-HLOOKUP(Y80,Feuil2!$C$1:$CD$9,4,FALSE)","v":{"$error":"#VALUE!"}},{"$f":"T80-HLOOKUP(Y80,Feuil2!$C$1:$CD$9,5,FALSE)","v":{"$error":"#VALUE!"}},{"$f":"T80-HLOOKUP(Y80,Feuil2!$C$1:$CD$9,6,FALSE)","v":{"$error":"#VALUE!"}},{"$f":"T80-HLOOKUP(Y80,Feuil2!$C$1:$CD$9,7,FALSE)","v":{"$error":"#VALUE!"}},{"$f":"T80-HLOOKUP(Y80,Feuil2!$C$1:$CD$9,8,FALSE)","v":{"$error":"#VALUE!"}},{"$f":"T80-HLOOKUP(Y80,Feuil2!$C$1:$CD$9,9,FALSE)","v":{"$error":"#VALUE!"}},null,null,null,null,null,null,null,{"$error":"#VALUE!"},2017,null,{"$f":"IF(AQ80,VLOOKUP(AQ80,HOM!$AS$389:$AT$444,2))","v":4.4930000000000003}]
["H",null,null,null,null,null,null,null,null,null,null,null,null,null,"",null,null,null,"","","","","",false,{"$f":"IF(AND(H81<1920),VLOOKUP(I81,Feuil2!$F$10:$P$28,11),IF(AND(H81>=1920,H81<1939),VLOOKUP(I81,Feuil2!$F$10:$P$28,11),IF(AND(H81>=1938,H81<1943),VLOOKUP(I81,Feuil2!$F$10:$P$28,10),IF(AND(H81>=1943,H81<1948),VLOOKUP(I81,Feuil2!$F$10:$P$28,9),IF(AND(H81>=1948,H81<1953),VLOOKUP(I81,Feuil2!$F$10:$P$28,8),IF(AND(H81>=1953,H81<1958),VLOOKUP(I81,Feuil2!$F$10:$P$28,7),IF(AND(H81>=1958,H81<1963),VLOOKUP(I81,Feuil2!$F$10:$P$28,6),IF(AND(H81>=1963,H81<1968),VLOOKUP(I81,Feuil2!$F$10:$P$28,5),IF(AND(H81>=1968,H81<1973),VLOOKUP(I81,Feuil2!$F$10:$P$28,4),IF(AND(H81>=1973,H81<1978),VLOOKUP(I81,Feuil2!$F$10:$P$28,3),IF(AND(H81>=1978,H81<1983),VLOOKUP(I81,Feuil2!$F$10:$P$28,2),VLOOKUP(I81,Feuil2!$F$10:$P$28,2))))))))))))","v":{"$error":"#N/A"}},null,{"$f":"T81-HLOOKUP(Y81,Feuil2!$C$1:$CD$9,2,FALSE)","v":{"$error":"#VALUE!"}},{"$f":"T81-HLOOKUP(Y81,Feuil2!$C$1:$CD$9,3,FALSE)","v":{"$error":"#VALUE!"}},{"$f":"T81-HLOOKUP(Y81,Feuil2!$C$1:$CD$9,4,FALSE)","v":{"$error":"#VALUE!"}},{"$f":"T81-HLOOKUP(Y81,Feuil2!$C$1:$CD$9,5,FALSE)","v":{"$error":"#VALUE!"}},{"$f":"T81-HLOOKUP(Y81,Feuil2!$C$1:$CD$9,6,FALSE)","v":{"$error":"#VALUE!"}},{"$f":"T81-HLOOKUP(Y81,Feuil2!$C$1:$CD$9,7,FALSE)","v":{"$error":"#VALUE!"}},{"$f":"T81-HLOOKUP(Y81,Feuil2!$C$1:$CD$9,8,FALSE)","v":{"$error":"#VALUE!"}},{"$f":"T81-HLOOKUP(Y81,Feuil2!$C$1:$CD$9,9,FALSE)","v":{"$error":"#VALUE!"}},null,null,null,null,null,null,null,{"$error":"#VALUE!"},2017,null,{"$f":"IF(AQ81,VLOOKUP(AQ81,HOM!$AS$389:$AT$444,2))","v":4.4930000000000003}]
["H",null,null,null,null,null,null,null,null,null,null,null,null,null,"",null,null,null,"","","","","",false,{"$f":"IF(AND(H82<1920),VLOOKUP(I82,Feuil2!$F$10:$P$28,11),IF(AND(H82>=1920,H82<1939),VLOOKUP(I82,Feuil2!$F$10:$P$28,11),IF(AND(H82>=1938,H82<1943),VLOOKUP(I82,Feuil2!$F$10:$P$28,10),IF(AND(H82>=1943,H82<1948),VLOOKUP(I82,Feuil2!$F$10:$P$28,9),IF(AND(H82>=1948,H82<1953),VLOOKUP(I82,Feuil2!$F$10:$P$28,8),IF(AND(H82>=1953,H82<1958),VLOOKUP(I82,Feuil2!$F$10:$P$28,7),IF(AND(H82>=1958,H82<1963),VLOOKUP(I82,Feuil2!$F$10:$P$28,6),IF(AND(H82>=1963,H82<1968),VLOOKUP(I82,Feuil2!$F$10:$P$28,5),IF(AND(H82>=1968,H82<1973),VLOOKUP(I82,Feuil2!$F$10:$P$28,4),IF(AND(H82>=1973,H82<1978),VLOOKUP(I82,Feuil2!$F$10:$P$28,3),IF(AND(H82>=1978,H82<1983),VLOOKUP(I82,Feuil2!$F$10:$P$28,2),VLOOKUP(I82,Feuil2!$F$10:$P$28,2))))))))))))","v":{"$error":"#N/A"}},null,{"$f":"T82-HLOOKUP(Y82,Feuil2!$C$1:$CD$9,2,FALSE)","v":{"$error":"#VALUE!"}},{"$f":"T82-HLOOKUP(Y82,Feuil2!$C$1:$CD$9,3,FALSE)","v":{"$error":"#VALUE!"}},{"$f":"T82-HLOOKUP(Y82,Feuil2!$C$1:$CD$9,4,FALSE)","v":{"$error":"#VALUE!"}},{"$f":"T82-HLOOKUP(Y82,Feuil2!$C$1:$CD$9,5,FALSE)","v":{"$error":"#VALUE!"}},{"$f":"T82-HLOOKUP(Y82,Feuil2!$C$1:$CD$9,6,FALSE)","v":{"$error":"#VALUE!"}},{"$f":"T82-HLOOKUP(Y82,Feuil2!$C$1:$CD$9,7,FALSE)","v":{"$error":"#VALUE!"}},{"$f":"T82-HLOOKUP(Y82,Feuil2!$C$1:$CD$9,8,FALSE)","v":{"$error":"#VALUE!"}},{"$f":"T82-HLOOKUP(Y82,Feuil2!$C$1:$CD$9,9,FALSE)","v":{"$error":"#VALUE!"}},null,null,null,null,null,null,null,{"$error":"#VALUE!"},2017,null,{"$f":"IF(AQ82,VLOOKUP(AQ82,HOM!$AS$389:$AT$444,2))","v":4.4930000000000003}]
["H",null,null,null,null,null,null,null,null,null,null,null,null,null,"",null,null,null,"","","","","",false,{"$f":"IF(AND(H83<1920),VLOOKUP(I83,Feuil2!$F$10:$P$28,11),IF(AND(H83>=1920,H83<1939),VLOOKUP(I83,Feuil2!$F$10:$P$28,11),IF(AND(H83>=1938,H83<1943),VLOOKUP(I83,Feuil2!$F$10:$P$28,10),IF(AND(H83>=1943,H83<1948),VLOOKUP(I83,Feuil2!$F$10:$P$28,9),IF(AND(H83>=1948,H83<1953),VLOOKUP(I83,Feuil2!$F$10:$P$28,8),IF(AND(H83>=1953,H83<1958),VLOOKUP(I83,Feuil2!$F$10:$P$28,7),IF(AND(H83>=1958,H83<1963),VLOOKUP(I83,Feuil2!$F$10:$P$28,6),IF(AND(H83>=1963,H83<1968),VLOOKUP(I83,Feuil2!$F$10:$P$28,5),IF(AND(H83>=1968,H83<1973),VLOOKUP(I83,Feuil2!$F$10:$P$28,4),IF(AND(H83>=1973,H83<1978),VLOOKUP(I83,Feuil2!$F$10:$P$28,3),IF(AND(H83>=1978,H83<1983),VLOOKUP(I83,Feuil2!$F$10:$P$28,2),VLOOKUP(I83,Feuil2!$F$10:$P$28,2))))))))))))","v":{"$error":"#N/A"}},null,{"$f":"T83-HLOOKUP(Y83,Feuil2!$C$1:$CD$9,2,FALSE)","v":{"$error":"#VALUE!"}},{"$f":"T83-HLOOKUP(Y83,Feuil2!$C$1:$CD$9,3,FALSE)","v":{"$error":"#VALUE!"}},{"$f":"T83-HLOOKUP(Y83,Feuil2!$C$1:$CD$9,4,FALSE)","v":{"$error":"#VALUE!"}},{"$f":"T83-HLOOKUP(Y83,Feuil2!$C$1:$CD$9,5,FALSE)","v":{"$error":"#VALUE!"}},{"$f":"T83-HLOOKUP(Y83,Feuil2!$C$1:$CD$9,6,FALSE)","v":{"$error":"#VALUE!"}},{"$f":"T83-HLOOKUP(Y83,Feuil2!$C$1:$CD$9,7,FALSE)","v":{"$error":"#VALUE!"}},{"$f":"T83-HLOOKUP(Y83,Feuil2!$C$1:$CD$9,8,FALSE)","v":{"$error":"#VALUE!"}},{"$f":"T83-HLOOKUP(Y83,Feuil2!$C$1:$CD$9,9,FALSE)","v":{"$error":"#VALUE!"}},null,null,null,null,null,null,null,{"$error":"#VALUE!"},2017,null,{"$f":"IF(AQ83,VLOOKUP(AQ83,HOM!$AS$389:$AT$444,2))","v":4.4930000000000003}]
["H",null,null,null,null,null,null,null,null,null,null,null,null,null,"",null,null,null,"","","","","",false,{"$f":"IF(AND(H84<1920),VLOOKUP(I84,Feuil2!$F$10:$P$28,11),IF(AND(H84>=1920,H84<1939),VLOOKUP(I84,Feuil2!$F$10:$P$28,11),IF(AND(H84>=1938,H84<1943),VLOOKUP(I84,Feuil2!$F$10:$P$28,10),IF(AND(H84>=1943,H84<1948),VLOOKUP(I84,Feuil2!$F$10:$P$28,9),IF(AND(H84>=1948,H84<1953),VLOOKUP(I84,Feuil2!$F$10:$P$28,8),IF(AND(H84>=1953,H84<1958),VLOOKUP(I84,Feuil2!$F$10:$P$28,7),IF(AND(H84>=1958,H84<1963),VLOOKUP(I84,Feuil2!$F$10:$P$28,6),IF(AND(H84>=1963,H84<1968),VLOOKUP(I84,Feuil2!$F$10:$P$28,5),IF(AND(H84>=1968,H84<1973),VLOOKUP(I84,Feuil2!$F$10:$P$28,4),IF(AND(H84>=1973,H84<1978),VLOOKUP(I84,Feuil2!$F$10:$P$28,3),IF(AND(H84>=1978,H84<1983),VLOOKUP(I84,Feuil2!$F$10:$P$28,2),VLOOKUP(I84,Feuil2!$F$10:$P$28,2))))))))))))","v":{"$error":"#N/A"}},null,{"$f":"T84-HLOOKUP(Y84,Feuil2!$C$1:$CD$9,2,FALSE)","v":{"$error":"#VALUE!"}},{"$f":"T84-HLOOKUP(Y84,Feuil2!$C$1:$CD$9,3,FALSE)","v":{"$error":"#VALUE!"}},{"$f":"T84-HLOOKUP(Y84,Feuil2!$C$1:$CD$9,4,FALSE)","v":{"$error":"#VALUE!"}},{"$f":"T84-HLOOKUP(Y84,Feuil2!$C$1:$CD$9,5,FALSE)","v":{"$error":"#VALUE!"}},{"$f":"T84-HLOOKUP(Y84,Feuil2!$C$1:$CD$9,6,FALSE)","v":{"$error":"#VALUE!"}},{"$f":"T84-HLOOKUP(Y84,Feuil2!$C$1:$CD$9,7,FALSE)","v":{"$error":"#VALUE!"}},{"$f":"T84-HLOOKUP(Y84,Feuil2!$C$1:$CD$9,8,FALSE)","v":{"$error":"#VALUE!"}},{"$f":"T84-HLOOKUP(Y84,Feuil2!$C$1:$CD$9,9,FALSE)","v":{"$error":"#VALUE!"}},null,null,null,null,null,null,null,{"$error":"#VALUE!"},2017,null,{"$f":"IF(AQ84,VLOOKUP(AQ84,HOM!$AS$389:$AT$444,2))","v":4.4930000000000003}]
["H",null,null,null,null,null,null,null,null,null,null,null,null,null,"",null,null,null,"","","","","",false,{"$f":"IF(AND(H85<1920),VLOOKUP(I85,Feuil2!$F$10:$P$28,11),IF(AND(H85>=1920,H85<1939),VLOOKUP(I85,Feuil2!$F$10:$P$28,11),IF(AND(H85>=1938,H85<1943),VLOOKUP(I85,Feuil2!$F$10:$P$28,10),IF(AND(H85>=1943,H85<1948),VLOOKUP(I85,Feuil2!$F$10:$P$28,9),IF(AND(H85>=1948,H85<1953),VLOOKUP(I85,Feuil2!$F$10:$P$28,8),IF(AND(H85>=1953,H85<1958),VLOOKUP(I85,Feuil2!$F$10:$P$28,7),IF(AND(H85>=1958,H85<1963),VLOOKUP(I85,Feuil2!$F$10:$P$28,6),IF(AND(H85>=1963,H85<1968),VLOOKUP(I85,Feuil2!$F$10:$P$28,5),IF(AND(H85>=1968,H85<1973),VLOOKUP(I85,Feuil2!$F$10:$P$28,4),IF(AND(H85>=1973,H85<1978),VLOOKUP(I85,Feuil2!$F$10:$P$28,3),IF(AND(H85>=1978,H85<1983),VLOOKUP(I85,Feuil2!$F$10:$P$28,2),VLOOKUP(I85,Feuil2!$F$10:$P$28,2))))))))))))","v":{"$error":"#N/A"}},null,{"$f":"T85-HLOOKUP(Y85,Feuil2!$C$1:$CD$9,2,FALSE)","v":{"$error":"#VALUE!"}},{"$f":"T85-HLOOKUP(Y85,Feuil2!$C$1:$CD$9,3,FALSE)","v":{"$error":"#VALUE!"}},{"$f":"T85-HLOOKUP(Y85,Feuil2!$C$1:$CD$9,4,FALSE)","v":{"$error":"#VALUE!"}},{"$f":"T85-HLOOKUP(Y85,Feuil2!$C$1:$CD$9,5,FALSE)","v":{"$error":"#VALUE!"}},{"$f":"T85-HLOOKUP(Y85,Feuil2!$C$1:$CD$9,6,FALSE)","v":{"$error":"#VALUE!"}},{"$f":"T85-HLOOKUP(Y85,Feuil2!$C$1:$CD$9,7,FALSE)","v":{"$error":"#VALUE!"}},{"$f":"T85-HLOOKUP(Y85,Feuil2!$C$1:$CD$9,8,FALSE)","v":{"$error":"#VALUE!"}},{"$f":"T85-HLOOKUP(Y85,Feuil2!$C$1:$CD$9,9,FALSE)","v":{"$error":"#VALUE!"}},null,null,null,null,null,null,null,{"$error":"#VALUE!"},2017,null,{"$f":"IF(AQ85,VLOOKUP(AQ85,HOM!$AS$389:$AT$444,2))","v":4.4930000000000003}]
["H",null,null,null,null,null,null,null,null,null,null,null,null,null,"",null,null,null,"","","","","",false,{"$f":"IF(AND(H86<1920),VLOOKUP(I86,Feuil2!$F$10:$P$28,11),IF(AND(H86>=1920,H86<1939),VLOOKUP(I86,Feuil2!$F$10:$P$28,11),IF(AND(H86>=1938,H86<1943),VLOOKUP(I86,Feuil2!$F$10:$P$28,10),IF(AND(H86>=1943,H86<1948),VLOOKUP(I86,Feuil2!$F$10:$P$28,9),IF(AND(H86>=1948,H86<1953),VLOOKUP(I86,Feuil2!$F$10:$P$28,8),IF(AND(H86>=1953,H86<1958),VLOOKUP(I86,Feuil2!$F$10:$P$28,7),IF(AND(H86>=1958,H86<1963),VLOOKUP(I86,Feuil2!$F$10:$P$28,6),IF(AND(H86>=1963,H86<1968),VLOOKUP(I86,Feuil2!$F$10:$P$28,5),IF(AND(H86>=1968,H86<1973),VLOOKUP(I86,Feuil2!$F$10:$P$28,4),IF(AND(H86>=1973,H86<1978),VLOOKUP(I86,Feuil2!$F$10:$P$28,3),IF(AND(H86>=1978,H86<1983),VLOOKUP(I86,Feuil2!$F$10:$P$28,2),VLOOKUP(I86,Feuil2!$F$10:$P$28,2))))))))))))","v":{"$error":"#N/A"}},null,{"$f":"T86-HLOOKUP(Y86,Feuil2!$C$1:$CD$9,2,FALSE)","v":{"$error":"#VALUE!"}},{"$f":"T86-HLOOKUP(Y86,Feuil2!$C$1:$CD$9,3,FALSE)","v":{"$error":"#VALUE!"}},{"$f":"T86-HLOOKUP(Y86,Feuil2!$C$1:$CD$9,4,FALSE)","v":{"$error":"#VALUE!"}},{"$f":"T86-HLOOKUP(Y86,Feuil2!$C$1:$CD$9,5,FALSE)","v":{"$error":"#VALUE!"}},{"$f":"T86-HLOOKUP(Y86,Feuil2!$C$1:$CD$9,6,FALSE)","v":{"$error":"#VALUE!"}},{"$f":"T86-HLOOKUP(Y86,Feuil2!$C$1:$CD$9,7,FALSE)","v":{"$error":"#VALUE!"}},{"$f":"T86-HLOOKUP(Y86,Feuil2!$C$1:$CD$9,8,FALSE)","v":{"$error":"#VALUE!"}},{"$f":"T86-HLOOKUP(Y86,Feuil2!$C$1:$CD$9,9,FALSE)","v":{"$error":"#VALUE!"}},null,null,null,null,null,null,null,{"$error":"#VALUE!"},2017,null,{"$f":"IF(AQ86,VLOOKUP(AQ86,HOM!$AS$389:$AT$444,2))","v":4.4930000000000003}]
["H",null,null,null,null,null,null,null,null,null,null,null,null,null,"",null,null,null,"","","","","",false,{"$f":"IF(AND(H87<1920),VLOOKUP(I87,Feuil2!$F$10:$P$28,11),IF(AND(H87>=1920,H87<1939),VLOOKUP(I87,Feuil2!$F$10:$P$28,11),IF(AND(H87>=1938,H87<1943),VLOOKUP(I87,Feuil2!$F$10:$P$28,10),IF(AND(H87>=1943,H87<1948),VLOOKUP(I87,Feuil2!$F$10:$P$28,9),IF(AND(H87>=1948,H87<1953),VLOOKUP(I87,Feuil2!$F$10:$P$28,8),IF(AND(H87>=1953,H87<1958),VLOOKUP(I87,Feuil2!$F$10:$P$28,7),IF(AND(H87>=1958,H87<1963),VLOOKUP(I87,Feuil2!$F$10:$P$28,6),IF(AND(H87>=1963,H87<1968),VLOOKUP(I87,Feuil2!$F$10:$P$28,5),IF(AND(H87>=1968,H87<1973),VLOOKUP(I87,Feuil2!$F$10:$P$28,4),IF(AND(H87>=1973,H87<1978),VLOOKUP(I87,Feuil2!$F$10:$P$28,3),IF(AND(H87>=1978,H87<1983),VLOOKUP(I87,Feuil2!$F$10:$P$28,2),VLOOKUP(I87,Feuil2!$F$10:$P$28,2))))))))))))","v":{"$error":"#N/A"}},null,{"$f":"T87-HLOOKUP(Y87,Feuil2!$C$1:$CD$9,2,FALSE)","v":{"$error":"#VALUE!"}},{"$f":"T87-HLOOKUP(Y87,Feuil2!$C$1:$CD$9,3,FALSE)","v":{"$error":"#VALUE!"}},{"$f":"T87-HLOOKUP(Y87,Feuil2!$C$1:$CD$9,4,FALSE)","v":{"$error":"#VALUE!"}},{"$f":"T87-HLOOKUP(Y87,Feuil2!$C$1:$CD$9,5,FALSE)","v":{"$error":"#VALUE!"}},{"$f":"T87-HLOOKUP(Y87,Feuil2!$C$1:$CD$9,6,FALSE)","v":{"$error":"#VALUE!"}},{"$f":"T87-HLOOKUP(Y87,Feuil2!$C$1:$CD$9,7,FALSE)","v":{"$error":"#VALUE!"}},{"$f":"T87-HLOOKUP(Y87,Feuil2!$C$1:$CD$9,8,FALSE)","v":{"$error":"#VALUE!"}},{"$f":"T87-HLOOKUP(Y87,Feuil2!$C$1:$CD$9,9,FALSE)","v":{"$error":"#VALUE!"}},null,null,null,null,null,null,null,{"$error":"#VALUE!"},2017,null,{"$f":"IF(AQ87,VLOOKUP(AQ87,HOM!$AS$389:$AT$444,2))","v":4.4930000000000003}]
["H",null,null,null,null,null,null,null,null,null,null,null,null,null,"",null,null,null,"","","","","",false,{"$f":"IF(AND(H88<1920),VLOOKUP(I88,Feuil2!$F$10:$P$28,11),IF(AND(H88>=1920,H88<1939),VLOOKUP(I88,Feuil2!$F$10:$P$28,11),IF(AND(H88>=1938,H88<1943),VLOOKUP(I88,Feuil2!$F$10:$P$28,10),IF(AND(H88>=1943,H88<1948),VLOOKUP(I88,Feuil2!$F$10:$P$28,9),IF(AND(H88>=1948,H88<1953),VLOOKUP(I88,Feuil2!$F$10:$P$28,8),IF(AND(H88>=1953,H88<1958),VLOOKUP(I88,Feuil2!$F$10:$P$28,7),IF(AND(H88>=1958,H88<1963),VLOOKUP(I88,Feuil2!$F$10:$P$28,6),IF(AND(H88>=1963,H88<1968),VLOOKUP(I88,Feuil2!$F$10:$P$28,5),IF(AND(H88>=1968,H88<1973),VLOOKUP(I88,Feuil2!$F$10:$P$28,4),IF(AND(H88>=1973,H88<1978),VLOOKUP(I88,Feuil2!$F$10:$P$28,3),IF(AND(H88>=1978,H88<1983),VLOOKUP(I88,Feuil2!$F$10:$P$28,2),VLOOKUP(I88,Feuil2!$F$10:$P$28,2))))))))))))","v":{"$error":"#N/A"}},null,{"$f":"T88-HLOOKUP(Y88,Feuil2!$C$1:$CD$9,2,FALSE)","v":{"$error":"#VALUE!"}},{"$f":"T88-HLOOKUP(Y88,Feuil2!$C$1:$CD$9,3,FALSE)","v":{"$error":"#VALUE!"}},{"$f":"T88-HLOOKUP(Y88,Feuil2!$C$1:$CD$9,4,FALSE)","v":{"$error":"#VALUE!"}},{"$f":"T88-HLOOKUP(Y88,Feuil2!$C$1:$CD$9,5,FALSE)","v":{"$error":"#VALUE!"}},{"$f":"T88-HLOOKUP(Y88,Feuil2!$C$1:$CD$9,6,FALSE)","v":{"$error":"#VALUE!"}},{"$f":"T88-HLOOKUP(Y88,Feuil2!$C$1:$CD$9,7,FALSE)","v":{"$error":"#VALUE!"}},{"$f":"T88-HLOOKUP(Y88,Feuil2!$C$1:$CD$9,8,FALSE)","v":{"$error":"#VALUE!"}},{"$f":"T88-HLOOKUP(Y88,Feuil2!$C$1:$CD$9,9,FALSE)","v":{"$error":"#VALUE!"}},null,null,null,null,null,null,null,{"$error":"#VALUE!"},2017,null,{"$f":"IF(AQ88,VLOOKUP(AQ88,HOM!$AS$389:$AT$444,2))","v":4.4930000000000003}]
["H",null,null,null,null,null,null,null,null,null,null,null,null,null,"",null,null,null,"","","","","",false,{"$f":"IF(AND(H89<1920),VLOOKUP(I89,Feuil2!$F$10:$P$28,11),IF(AND(H89>=1920,H89<1939),VLOOKUP(I89,Feuil2!$F$10:$P$28,11),IF(AND(H89>=1938,H89<1943),VLOOKUP(I89,Feuil2!$F$10:$P$28,10),IF(AND(H89>=1943,H89<1948),VLOOKUP(I89,Feuil2!$F$10:$P$28,9),IF(AND(H89>=1948,H89<1953),VLOOKUP(I89,Feuil2!$F$10:$P$28,8),IF(AND(H89>=1953,H89<1958),VLOOKUP(I89,Feuil2!$F$10:$P$28,7),IF(AND(H89>=1958,H89<1963),VLOOKUP(I89,Feuil2!$F$10:$P$28,6),IF(AND(H89>=1963,H89<1968),VLOOKUP(I89,Feuil2!$F$10:$P$28,5),IF(AND(H89>=1968,H89<1973),VLOOKUP(I89,Feuil2!$F$10:$P$28,4),IF(AND(H89>=1973,H89<1978),VLOOKUP(I89,Feuil2!$F$10:$P$28,3),IF(AND(H89>=1978,H89<1983),VLOOKUP(I89,Feuil2!$F$10:$P$28,2),VLOOKUP(I89,Feuil2!$F$10:$P$28,2))))))))))))","v":{"$error":"#N/A"}},null,{"$f":"T89-HLOOKUP(Y89,Feuil2!$C$1:$CD$9,2,FALSE)","v":{"$error":"#VALUE!"}},{"$f":"T89-HLOOKUP(Y89,Feuil2!$C$1:$CD$9,3,FALSE)","v":{"$error":"#VALUE!"}},{"$f":"T89-HLOOKUP(Y89,Feuil2!$C$1:$CD$9,4,FALSE)","v":{"$error":"#VALUE!"}},{"$f":"T89-HLOOKUP(Y89,Feuil2!$C$1:$CD$9,5,FALSE)","v":{"$error":"#VALUE!"}},{"$f":"T89-HLOOKUP(Y89,Feuil2!$C$1:$CD$9,6,FALSE)","v":{"$error":"#VALUE!"}},{"$f":"T89-HLOOKUP(Y89,Feuil2!$C$1:$CD$9,7,FALSE)","v":{"$error":"#VALUE!"}},{"$f":"T89-HLOOKUP(Y89,Feuil2!$C$1:$CD$9,8,FALSE)","v":{"$error":"#VALUE!"}},{"$f":"T89-HLOOKUP(Y89,Feuil2!$C$1:$CD$9,9,FALSE)","v":{"$error":"#VALUE!"}},null,null,null,null,null,null,null,{"$error":"#VALUE!"},2017,null,{"$f":"IF(AQ89,VLOOKUP(AQ89,HOM!$AS$389:$AT$444,2))","v":4.4930000000000003}]
["H",null,null,null,null,null,null,null,null,null,null,null,null,null,"",null,null,null,"","","","","",false,{"$f":"IF(AND(H90<1920),VLOOKUP(I90,Feuil2!$F$10:$P$28,11),IF(AND(H90>=1920,H90<1939),VLOOKUP(I90,Feuil2!$F$10:$P$28,11),IF(AND(H90>=1938,H90<1943),VLOOKUP(I90,Feuil2!$F$10:$P$28,10),IF(AND(H90>=1943,H90<1948),VLOOKUP(I90,Feuil2!$F$10:$P$28,9),IF(AND(H90>=1948,H90<1953),VLOOKUP(I90,Feuil2!$F$10:$P$28,8),IF(AND(H90>=1953,H90<1958),VLOOKUP(I90,Feuil2!$F$10:$P$28,7),IF(AND(H90>=1958,H90<1963),VLOOKUP(I90,Feuil2!$F$10:$P$28,6),IF(AND(H90>=1963,H90<1968),VLOOKUP(I90,Feuil2!$F$10:$P$28,5),IF(AND(H90>=1968,H90<1973),VLOOKUP(I90,Feuil2!$F$10:$P$28,4),IF(AND(H90>=1973,H90<1978),VLOOKUP(I90,Feuil2!$F$10:$P$28,3),IF(AND(H90>=1978,H90<1983),VLOOKUP(I90,Feuil2!$F$10:$P$28,2),VLOOKUP(I90,Feuil2!$F$10:$P$28,2))))))))))))","v":{"$error":"#N/A"}},null,{"$f":"T90-HLOOKUP(Y90,Feuil2!$C$1:$CD$9,2,FALSE)","v":{"$error":"#VALUE!"}},{"$f":"T90-HLOOKUP(Y90,Feuil2!$C$1:$CD$9,3,FALSE)","v":{"$error":"#VALUE!"}},{"$f":"T90-HLOOKUP(Y90,Feuil2!$C$1:$CD$9,4,FALSE)","v":{"$error":"#VALUE!"}},{"$f":"T90-HLOOKUP(Y90,Feuil2!$C$1:$CD$9,5,FALSE)","v":{"$error":"#VALUE!"}},{"$f":"T90-HLOOKUP(Y90,Feuil2!$C$1:$CD$9,6,FALSE)","v":{"$error":"#VALUE!"}},{"$f":"T90-HLOOKUP(Y90,Feuil2!$C$1:$CD$9,7,FALSE)","v":{"$error":"#VALUE!"}},{"$f":"T90-HLOOKUP(Y90,Feuil2!$C$1:$CD$9,8,FALSE)","v":{"$error":"#VALUE!"}},{"$f":"T90-HLOOKUP(Y90,Feuil2!$C$1:$CD$9,9,FALSE)","v":{"$error":"#VALUE!"}},null,null,null,null,null,null,null,{"$error":"#VALUE!"},2017,null,{"$f":"IF(AQ90,VLOOKUP(AQ90,HOM!$AS$389:$AT$444,2))","v":4.4930000000000003}]
["H",null,null,null,null,null,null,null,null,null,null,null,null,null,"",null,null,null,"","","","","",false,{"$f":"IF(AND(H91<1920),VLOOKUP(I91,Feuil2!$F$10:$P$28,11),IF(AND(H91>=1920,H91<1939),VLOOKUP(I91,Feuil2!$F$10:$P$28,11),IF(AND(H91>=1938,H91<1943),VLOOKUP(I91,Feuil2!$F$10:$P$28,10),IF(AND(H91>=1943,H91<1948),VLOOKUP(I91,Feuil2!$F$10:$P$28,9),IF(AND(H91>=1948,H91<1953),VLOOKUP(I91,Feuil2!$F$10:$P$28,8),IF(AND(H91>=1953,H91<1958),VLOOKUP(I91,Feuil2!$F$10:$P$28,7),IF(AND(H91>=1958,H91<1963),VLOOKUP(I91,Feuil2!$F$10:$P$28,6),IF(AND(H91>=1963,H91<1968),VLOOKUP(I91,Feuil2!$F$10:$P$28,5),IF(AND(H91>=1968,H91<1973),VLOOKUP(I91,Feuil2!$F$10:$P$28,4),IF(AND(H91>=1973,H91<1978),VLOOKUP(I91,Feuil2!$F$10:$P$28,3),IF(AND(H91>=1978,H91<1983),VLOOKUP(I91,Feuil2!$F$10:$P$28,2),VLOOKUP(I91,Feuil2!$F$10:$P$28,2))))))))))))","v":{"$error":"#N/A"}},null,{"$f":"T91-HLOOKUP(Y91,Feuil2!$C$1:$CD$9,2,FALSE)","v":{"$error":"#VALUE!"}},{"$f":"T91-HLOOKUP(Y91,Feuil2!$C$1:$CD$9,3,FALSE)","v":{"$error":"#VALUE!"}},{"$f":"T91-HLOOKUP(Y91,Feuil2!$C$1:$CD$9,4,FALSE)","v":{"$error":"#VALUE!"}},{"$f":"T91-HLOOKUP(Y91,Feuil2!$C$1:$CD$9,5,FALSE)","v":{"$error":"#VALUE!"}},{"$f":"T91-HLOOKUP(Y91,Feuil2!$C$1:$CD$9,6,FALSE)","v":{"$error":"#VALUE!"}},{"$f":"T91-HLOOKUP(Y91,Feuil2!$C$1:$CD$9,7,FALSE)","v":{"$error":"#VALUE!"}},{"$f":"T91-HLOOKUP(Y91,Feuil2!$C$1:$CD$9,8,FALSE)","v":{"$error":"#VALUE!"}},{"$f":"T91-HLOOKUP(Y91,Feuil2!$C$1:$CD$9,9,FALSE)","v":{"$error":"#VALUE!"}},null,null,null,null,null,null,null,{"$error":"#VALUE!"},2017,null,{"$f":"IF(AQ91,VLOOKUP(AQ91,HOM!$AS$389:$AT$444,2))","v":4.4930000000000003}]
["H",null,null,null,null,null,null,null,null,null,null,null,null,null,"",null,null,null,"","","","","",false,{"$f":"IF(AND(H92<1920),VLOOKUP(I92,Feuil2!$F$10:$P$28,11),IF(AND(H92>=1920,H92<1939),VLOOKUP(I92,Feuil2!$F$10:$P$28,11),IF(AND(H92>=1938,H92<1943),VLOOKUP(I92,Feuil2!$F$10:$P$28,10),IF(AND(H92>=1943,H92<1948),VLOOKUP(I92,Feuil2!$F$10:$P$28,9),IF(AND(H92>=1948,H92<1953),VLOOKUP(I92,Feuil2!$F$10:$P$28,8),IF(AND(H92>=1953,H92<1958),VLOOKUP(I92,Feuil2!$F$10:$P$28,7),IF(AND(H92>=1958,H92<1963),VLOOKUP(I92,Feuil2!$F$10:$P$28,6),IF(AND(H92>=1963,H92<1968),VLOOKUP(I92,Feuil2!$F$10:$P$28,5),IF(AND(H92>=1968,H92<1973),VLOOKUP(I92,Feuil2!$F$10:$P$28,4),IF(AND(H92>=1973,H92<1978),VLOOKUP(I92,Feuil2!$F$10:$P$28,3),IF(AND(H92>=1978,H92<1983),VLOOKUP(I92,Feuil2!$F$10:$P$28,2),VLOOKUP(I92,Feuil2!$F$10:$P$28,2))))))))))))","v":{"$error":"#N/A"}},null,{"$f":"T92-HLOOKUP(Y92,Feuil2!$C$1:$CD$9,2,FALSE)","v":{"$error":"#VALUE!"}},{"$f":"T92-HLOOKUP(Y92,Feuil2!$C$1:$CD$9,3,FALSE)","v":{"$error":"#VALUE!"}},{"$f":"T92-HLOOKUP(Y92,Feuil2!$C$1:$CD$9,4,FALSE)","v":{"$error":"#VALUE!"}},{"$f":"T92-HLOOKUP(Y92,Feuil2!$C$1:$CD$9,5,FALSE)","v":{"$error":"#VALUE!"}},{"$f":"T92-HLOOKUP(Y92,Feuil2!$C$1:$CD$9,6,FALSE)","v":{"$error":"#VALUE!"}},{"$f":"T92-HLOOKUP(Y92,Feuil2!$C$1:$CD$9,7,FALSE)","v":{"$error":"#VALUE!"}},{"$f":"T92-HLOOKUP(Y92,Feuil2!$C$1:$CD$9,8,FALSE)","v":{"$error":"#VALUE!"}},{"$f":"T92-HLOOKUP(Y92,Feuil2!$C$1:$CD$9,9,FALSE)","v":{"$error":"#VALUE!"}},null,null,null,null,null,null,null,{"$error":"#VALUE!"},2017,null,{"$f":"IF(AQ92,VLOOKUP(AQ92,HOM!$AS$389:$AT$444,2))","v":4.4930000000000003}]
["H",null,null,null,null,null,null,null,null,null,null,null,null,null,"",null,null,null,"","","","","",false,{"$f":"IF(AND(H93<1920),VLOOKUP(I93,Feuil2!$F$10:$P$28,11),IF(AND(H93>=1920,H93<1939),VLOOKUP(I93,Feuil2!$F$10:$P$28,11),IF(AND(H93>=1938,H93<1943),VLOOKUP(I93,Feuil2!$F$10:$P$28,10),IF(AND(H93>=1943,H93<1948),VLOOKUP(I93,Feuil2!$F$10:$P$28,9),IF(AND(H93>=1948,H93<1953),VLOOKUP(I93,Feuil2!$F$10:$P$28,8),IF(AND(H93>=1953,H93<1958),VLOOKUP(I93,Feuil2!$F$10:$P$28,7),IF(AND(H93>=1958,H93<1963),VLOOKUP(I93,Feuil2!$F$10:$P$28,6),IF(AND(H93>=1963,H93<1968),VLOOKUP(I93,Feuil2!$F$10:$P$28,5),IF(AND(H93>=1968,H93<1973),VLOOKUP(I93,Feuil2!$F$10:$P$28,4),IF(AND(H93>=1973,H93<1978),VLOOKUP(I93,Feuil2!$F$10:$P$28,3),IF(AND(H93>=1978,H93<1983),VLOOKUP(I93,Feuil2!$F$10:$P$28,2),VLOOKUP(I93,Feuil2!$F$10:$P$28,2))))))))))))","v":{"$error":"#N/A"}},null,{"$f":"T93-HLOOKUP(Y93,Feuil2!$C$1:$CD$9,2,FALSE)","v":{"$error":"#VALUE!"}},{"$f":"T93-HLOOKUP(Y93,Feuil2!$C$1:$CD$9,3,FALSE)","v":{"$error":"#VALUE!"}},{"$f":"T93-HLOOKUP(Y93,Feuil2!$C$1:$CD$9,4,FALSE)","v":{"$error":"#VALUE!"}},{"$f":"T93-HLOOKUP(Y93,Feuil2!$C$1:$CD$9,5,FALSE)","v":{"$error":"#VALUE!"}},{"$f":"T93-HLOOKUP(Y93,Feuil2!$C$1:$CD$9,6,FALSE)","v":{"$error":"#VALUE!"}},{"$f":"T93-HLOOKUP(Y93,Feuil2!$C$1:$CD$9,7,FALSE)","v":{"$error":"#VALUE!"}},{"$f":"T93-HLOOKUP(Y93,Feuil2!$C$1:$CD$9,8,FALSE)","v":{"$error":"#VALUE!"}},{"$f":"T93-HLOOKUP(Y93,Feuil2!$C$1:$CD$9,9,FALSE)","v":{"$error":"#VALUE!"}},null,null,null,null,null,null,null,{"$error":"#VALUE!"},2017,null,{"$f":"IF(AQ93,VLOOKUP(AQ93,HOM!$AS$389:$AT$444,2))","v":4.4930000000000003}]
["H",null,null,null,null,null,null,null,null,null,null,null,null,null,"",null,null,null,"","","","","",false,{"$f":"IF(AND(H94<1920),VLOOKUP(I94,Feuil2!$F$10:$P$28,11),IF(AND(H94>=1920,H94<1939),VLOOKUP(I94,Feuil2!$F$10:$P$28,11),IF(AND(H94>=1938,H94<1943),VLOOKUP(I94,Feuil2!$F$10:$P$28,10),IF(AND(H94>=1943,H94<1948),VLOOKUP(I94,Feuil2!$F$10:$P$28,9),IF(AND(H94>=1948,H94<1953),VLOOKUP(I94,Feuil2!$F$10:$P$28,8),IF(AND(H94>=1953,H94<1958),VLOOKUP(I94,Feuil2!$F$10:$P$28,7),IF(AND(H94>=1958,H94<1963),VLOOKUP(I94,Feuil2!$F$10:$P$28,6),IF(AND(H94>=1963,H94<1968),VLOOKUP(I94,Feuil2!$F$10:$P$28,5),IF(AND(H94>=1968,H94<1973),VLOOKUP(I94,Feuil2!$F$10:$P$28,4),IF(AND(H94>=1973,H94<1978),VLOOKUP(I94,Feuil2!$F$10:$P$28,3),IF(AND(H94>=1978,H94<1983),VLOOKUP(I94,Feuil2!$F$10:$P$28,2),VLOOKUP(I94,Feuil2!$F$10:$P$28,2))))))))))))","v":{"$error":"#N/A"}},null,{"$f":"T94-HLOOKUP(Y94,Feuil2!$C$1:$CD$9,2,FALSE)","v":{"$error":"#VALUE!"}},{"$f":"T94-HLOOKUP(Y94,Feuil2!$C$1:$CD$9,3,FALSE)","v":{"$error":"#VALUE!"}},{"$f":"T94-HLOOKUP(Y94,Feuil2!$C$1:$CD$9,4,FALSE)","v":{"$error":"#VALUE!"}},{"$f":"T94-HLOOKUP(Y94,Feuil2!$C$1:$CD$9,5,FALSE)","v":{"$error":"#VALUE!"}},{"$f":"T94-HLOOKUP(Y94,Feuil2!$C$1:$CD$9,6,FALSE)","v":{"$error":"#VALUE!"}},{"$f":"T94-HLOOKUP(Y94,Feuil2!$C$1:$CD$9,7,FALSE)","v":{"$error":"#VALUE!"}},{"$f":"T94-HLOOKUP(Y94,Feuil2!$C$1:$CD$9,8,FALSE)","v":{"$error":"#VALUE!"}},{"$f":"T94-HLOOKUP(Y94,Feuil2!$C$1:$CD$9,9,FALSE)","v":{"$error":"#VALUE!"}},null,null,null,null,null,null,null,{"$error":"#VALUE!"},2017,null,{"$f":"IF(AQ94,VLOOKUP(AQ94,HOM!$AS$389:$AT$444,2))","v":4.4930000000000003}]
["H",null,null,null,null,null,null,null,null,null,null,null,null,null,"",null,null,null,"","","","","",false,{"$f":"IF(AND(H95<1920),VLOOKUP(I95,Feuil2!$F$10:$P$28,11),IF(AND(H95>=1920,H95<1939),VLOOKUP(I95,Feuil2!$F$10:$P$28,11),IF(AND(H95>=1938,H95<1943),VLOOKUP(I95,Feuil2!$F$10:$P$28,10),IF(AND(H95>=1943,H95<1948),VLOOKUP(I95,Feuil2!$F$10:$P$28,9),IF(AND(H95>=1948,H95<1953),VLOOKUP(I95,Feuil2!$F$10:$P$28,8),IF(AND(H95>=1953,H95<1958),VLOOKUP(I95,Feuil2!$F$10:$P$28,7),IF(AND(H95>=1958,H95<1963),VLOOKUP(I95,Feuil2!$F$10:$P$28,6),IF(AND(H95>=1963,H95<1968),VLOOKUP(I95,Feuil2!$F$10:$P$28,5),IF(AND(H95>=1968,H95<1973),VLOOKUP(I95,Feuil2!$F$10:$P$28,4),IF(AND(H95>=1973,H95<1978),VLOOKUP(I95,Feuil2!$F$10:$P$28,3),IF(AND(H95>=1978,H95<1983),VLOOKUP(I95,Feuil2!$F$10:$P$28,2),VLOOKUP(I95,Feuil2!$F$10:$P$28,2))))))))))))","v":{"$error":"#N/A"}},null,{"$f":"T95-HLOOKUP(Y95,Feuil2!$C$1:$CD$9,2,FALSE)","v":{"$error":"#VALUE!"}},{"$f":"T95-HLOOKUP(Y95,Feuil2!$C$1:$CD$9,3,FALSE)","v":{"$error":"#VALUE!"}},{"$f":"T95-HLOOKUP(Y95,Feuil2!$C$1:$CD$9,4,FALSE)","v":{"$error":"#VALUE!"}},{"$f":"T95-HLOOKUP(Y95,Feuil2!$C$1:$CD$9,5,FALSE)","v":{"$error":"#VALUE!"}},{"$f":"T95-HLOOKUP(Y95,Feuil2!$C$1:$CD$9,6,FALSE)","v":{"$error":"#VALUE!"}},{"$f":"T95-HLOOKUP(Y95,Feuil2!$C$1:$CD$9,7,FALSE)","v":{"$error":"#VALUE!"}},{"$f":"T95-HLOOKUP(Y95,Feuil2!$C$1:$CD$9,8,FALSE)","v":{"$error":"#VALUE!"}},{"$f":"T95-HLOOKUP(Y95,Feuil2!$C$1:$CD$9,9,FALSE)","v":{"$error":"#VALUE!"}},null,null,null,null,null,null,null,{"$error":"#VALUE!"},2017,null,{"$f":"IF(AQ95,VLOOKUP(AQ95,HOM!$AS$389:$AT$444,2))","v":4.4930000000000003}]
["H",null,null,null,null,null,null,null,null,null,null,null,null,null,"",null,null,null,"","","","","",false,{"$f":"IF(AND(H96<1920),VLOOKUP(I96,Feuil2!$F$10:$P$28,11),IF(AND(H96>=1920,H96<1939),VLOOKUP(I96,Feuil2!$F$10:$P$28,11),IF(AND(H96>=1938,H96<1943),VLOOKUP(I96,Feuil2!$F$10:$P$28,10),IF(AND(H96>=1943,H96<1948),VLOOKUP(I96,Feuil2!$F$10:$P$28,9),IF(AND(H96>=1948,H96<1953),VLOOKUP(I96,Feuil2!$F$10:$P$28,8),IF(AND(H96>=1953,H96<1958),VLOOKUP(I96,Feuil2!$F$10:$P$28,7),IF(AND(H96>=1958,H96<1963),VLOOKUP(I96,Feuil2!$F$10:$P$28,6),IF(AND(H96>=1963,H96<1968),VLOOKUP(I96,Feuil2!$F$10:$P$28,5),IF(AND(H96>=1968,H96<1973),VLOOKUP(I96,Feuil2!$F$10:$P$28,4),IF(AND(H96>=1973,H96<1978),VLOOKUP(I96,Feuil2!$F$10:$P$28,3),IF(AND(H96>=1978,H96<1983),VLOOKUP(I96,Feuil2!$F$10:$P$28,2),VLOOKUP(I96,Feuil2!$F$10:$P$28,2))))))))))))","v":{"$error":"#N/A"}},null,{"$f":"T96-HLOOKUP(Y96,Feuil2!$C$1:$CD$9,2,FALSE)","v":{"$error":"#VALUE!"}},{"$f":"T96-HLOOKUP(Y96,Feuil2!$C$1:$CD$9,3,FALSE)","v":{"$error":"#VALUE!"}},{"$f":"T96-HLOOKUP(Y96,Feuil2!$C$1:$CD$9,4,FALSE)","v":{"$error":"#VALUE!"}},{"$f":"T96-HLOOKUP(Y96,Feuil2!$C$1:$CD$9,5,FALSE)","v":{"$error":"#VALUE!"}},{"$f":"T96-HLOOKUP(Y96,Feuil2!$C$1:$CD$9,6,FALSE)","v":{"$error":"#VALUE!"}},{"$f":"T96-HLOOKUP(Y96,Feuil2!$C$1:$CD$9,7,FALSE)","v":{"$error":"#VALUE!"}},{"$f":"T96-HLOOKUP(Y96,Feuil2!$C$1:$CD$9,8,FALSE)","v":{"$error":"#VALUE!"}},{"$f":"T96-HLOOKUP(Y96,Feuil2!$C$1:$CD$9,9,FALSE)","v":{"$error":"#VALUE!"}},null,null,null,null,null,null,null,{"$error":"#VALUE!"},2017,null,{"$f":"IF(AQ96,VLOOKUP(AQ96,HOM!$AS$389:$AT$444,2))","v":4.4930000000000003}]
["H",null,null,null,null,null,null,null,null,null,null,null,null,null,"",null,null,null,"","","","","",false,{"$f":"IF(AND(H97<1920),VLOOKUP(I97,Feuil2!$F$10:$P$28,11),IF(AND(H97>=1920,H97<1939),VLOOKUP(I97,Feuil2!$F$10:$P$28,11),IF(AND(H97>=1938,H97<1943),VLOOKUP(I97,Feuil2!$F$10:$P$28,10),IF(AND(H97>=1943,H97<1948),VLOOKUP(I97,Feuil2!$F$10:$P$28,9),IF(AND(H97>=1948,H97<1953),VLOOKUP(I97,Feuil2!$F$10:$P$28,8),IF(AND(H97>=1953,H97<1958),VLOOKUP(I97,Feuil2!$F$10:$P$28,7),IF(AND(H97>=1958,H97<1963),VLOOKUP(I97,Feuil2!$F$10:$P$28,6),IF(AND(H97>=1963,H97<1968),VLOOKUP(I97,Feuil2!$F$10:$P$28,5),IF(AND(H97>=1968,H97<1973),VLOOKUP(I97,Feuil2!$F$10:$P$28,4),IF(AND(H97>=1973,H97<1978),VLOOKUP(I97,Feuil2!$F$10:$P$28,3),IF(AND(H97>=1978,H97<1983),VLOOKUP(I97,Feuil2!$F$10:$P$28,2),VLOOKUP(I97,Feuil2!$F$10:$P$28,2))))))))))))","v":{"$error":"#N/A"}},null,{"$f":"T97-HLOOKUP(Y97,Feuil2!$C$1:$CD$9,2,FALSE)","v":{"$error":"#VALUE!"}},{"$f":"T97-HLOOKUP(Y97,Feuil2!$C$1:$CD$9,3,FALSE)","v":{"$error":"#VALUE!"}},{"$f":"T97-HLOOKUP(Y97,Feuil2!$C$1:$CD$9,4,FALSE)","v":{"$error":"#VALUE!"}},{"$f":"T97-HLOOKUP(Y97,Feuil2!$C$1:$CD$9,5,FALSE)","v":{"$error":"#VALUE!"}},{"$f":"T97-HLOOKUP(Y97,Feuil2!$C$1:$CD$9,6,FALSE)","v":{"$error":"#VALUE!"}},{"$f":"T97-HLOOKUP(Y97,Feuil2!$C$1:$CD$9,7,FALSE)","v":{"$error":"#VALUE!"}},{"$f":"T97-HLOOKUP(Y97,Feuil2!$C$1:$CD$9,8,FALSE)","v":{"$error":"#VALUE!"}},{"$f":"T97-HLOOKUP(Y97,Feuil2!$C$1:$CD$9,9,FALSE)","v":{"$error":"#VALUE!"}},null,null,null,null,null,null,null,{"$error":"#VALUE!"},2017,null,{"$f":"IF(AQ97,VLOOKUP(AQ97,HOM!$AS$389:$AT$444,2))","v":4.4930000000000003}]
["H",null,null,null,null,null,null,null,null,null,null,null,null,null,"",null,null,null,"","","","","",false,{"$f":"IF(AND(H98<1920),VLOOKUP(I98,Feuil2!$F$10:$P$28,11),IF(AND(H98>=1920,H98<1939),VLOOKUP(I98,Feuil2!$F$10:$P$28,11),IF(AND(H98>=1938,H98<1943),VLOOKUP(I98,Feuil2!$F$10:$P$28,10),IF(AND(H98>=1943,H98<1948),VLOOKUP(I98,Feuil2!$F$10:$P$28,9),IF(AND(H98>=1948,H98<1953),VLOOKUP(I98,Feuil2!$F$10:$P$28,8),IF(AND(H98>=1953,H98<1958),VLOOKUP(I98,Feuil2!$F$10:$P$28,7),IF(AND(H98>=1958,H98<1963),VLOOKUP(I98,Feuil2!$F$10:$P$28,6),IF(AND(H98>=1963,H98<1968),VLOOKUP(I98,Feuil2!$F$10:$P$28,5),IF(AND(H98>=1968,H98<1973),VLOOKUP(I98,Feuil2!$F$10:$P$28,4),IF(AND(H98>=1973,H98<1978),VLOOKUP(I98,Feuil2!$F$10:$P$28,3),IF(AND(H98>=1978,H98<1983),VLOOKUP(I98,Feuil2!$F$10:$P$28,2),VLOOKUP(I98,Feuil2!$F$10:$P$28,2))))))))))))","v":{"$error":"#N/A"}},null,{"$f":"T98-HLOOKUP(Y98,Feuil2!$C$1:$CD$9,2,FALSE)","v":{"$error":"#VALUE!"}},{"$f":"T98-HLOOKUP(Y98,Feuil2!$C$1:$CD$9,3,FALSE)","v":{"$error":"#VALUE!"}},{"$f":"T98-HLOOKUP(Y98,Feuil2!$C$1:$CD$9,4,FALSE)","v":{"$error":"#VALUE!"}},{"$f":"T98-HLOOKUP(Y98,Feuil2!$C$1:$CD$9,5,FALSE)","v":{"$error":"#VALUE!"}},{"$f":"T98-HLOOKUP(Y98,Feuil2!$C$1:$CD$9,6,FALSE)","v":{"$error":"#VALUE!"}},{"$f":"T98-HLOOKUP(Y98,Feuil2!$C$1:$CD$9,7,FALSE)","v":{"$error":"#VALUE!"}},{"$f":"T98-HLOOKUP(Y98,Feuil2!$C$1:$CD$9,8,FALSE)","v":{"$error":"#VALUE!"}},{"$f":"T98-HLOOKUP(Y98,Feuil2!$C$1:$CD$9,9,FALSE)","v":{"$error":"#VALUE!"}},null,null,null,null,null,null,null,{"$error":"#VALUE!"},2017,null,{"$f":"IF(AQ98,VLOOKUP(AQ98,HOM!$AS$389:$AT$444,2))","v":4.4930000000000003}]
["H",null,null,null,null,null,null,null,null,null,null,null,null,null,"",null,null,null,"","","","","",false,{"$f":"IF(AND(H99<1920),VLOOKUP(I99,Feuil2!$F$10:$P$28,11),IF(AND(H99>=1920,H99<1939),VLOOKUP(I99,Feuil2!$F$10:$P$28,11),IF(AND(H99>=1938,H99<1943),VLOOKUP(I99,Feuil2!$F$10:$P$28,10),IF(AND(H99>=1943,H99<1948),VLOOKUP(I99,Feuil2!$F$10:$P$28,9),IF(AND(H99>=1948,H99<1953),VLOOKUP(I99,Feuil2!$F$10:$P$28,8),IF(AND(H99>=1953,H99<1958),VLOOKUP(I99,Feuil2!$F$10:$P$28,7),IF(AND(H99>=1958,H99<1963),VLOOKUP(I99,Feuil2!$F$10:$P$28,6),IF(AND(H99>=1963,H99<1968),VLOOKUP(I99,Feuil2!$F$10:$P$28,5),IF(AND(H99>=1968,H99<1973),VLOOKUP(I99,Feuil2!$F$10:$P$28,4),IF(AND(H99>=1973,H99<1978),VLOOKUP(I99,Feuil2!$F$10:$P$28,3),IF(AND(H99>=1978,H99<1983),VLOOKUP(I99,Feuil2!$F$10:$P$28,2),VLOOKUP(I99,Feuil2!$F$10:$P$28,2))))))))))))","v":{"$error":"#N/A"}},null,{"$f":"T99-HLOOKUP(Y99,Feuil2!$C$1:$CD$9,2,FALSE)","v":{"$error":"#VALUE!"}},{"$f":"T99-HLOOKUP(Y99,Feuil2!$C$1:$CD$9,3,FALSE)","v":{"$error":"#VALUE!"}},{"$f":"T99-HLOOKUP(Y99,Feuil2!$C$1:$CD$9,4,FALSE)","v":{"$error":"#VALUE!"}},{"$f":"T99-HLOOKUP(Y99,Feuil2!$C$1:$CD$9,5,FALSE)","v":{"$error":"#VALUE!"}},{"$f":"T99-HLOOKUP(Y99,Feuil2!$C$1:$CD$9,6,FALSE)","v":{"$error":"#VALUE!"}},{"$f":"T99-HLOOKUP(Y99,Feuil2!$C$1:$CD$9,7,FALSE)","v":{"$error":"#VALUE!"}},{"$f":"T99-HLOOKUP(Y99,Feuil2!$C$1:$CD$9,8,FALSE)","v":{"$error":"#VALUE!"}},{"$f":"T99-HLOOKUP(Y99,Feuil2!$C$1:$CD$9,9,FALSE)","v":{"$error":"#VALUE!"}},null,null,null,null,null,null,null,{"$error":"#VALUE!"},2017,null,{"$f":"IF(AQ99,VLOOKUP(AQ99,HOM!$AS$389:$AT$444,2))","v":4.4930000000000003}]
["H",null,null,null,null,null,null,null,null,null,null,null,null,null,"",null,null,null,"","","","","",false,{"$f":"IF(AND(H100<1920),VLOOKUP(I100,Feuil2!$F$10:$P$28,11),IF(AND(H100>=1920,H100<1939),VLOOKUP(I100,Feuil2!$F$10:$P$28,11),IF(AND(H100>=1938,H100<1943),VLOOKUP(I100,Feuil2!$F$10:$P$28,10),IF(AND(H100>=1943,H100<1948),VLOOKUP(I100,Feuil2!$F$10:$P$28,9),IF(AND(H100>=1948,H100<1953),VLOOKUP(I100,Feuil2!$F$10:$P$28,8),IF(AND(H100>=1953,H100<1958),VLOOKUP(I100,Feuil2!$F$10:$P$28,7),IF(AND(H100>=1958,H100<1963),VLOOKUP(I100,Feuil2!$F$10:$P$28,6),IF(AND(H100>=1963,H100<1968),VLOOKUP(I100,Feuil2!$F$10:$P$28,5),IF(AND(H100>=1968,H100<1973),VLOOKUP(I100,Feuil2!$F$10:$P$28,4),IF(AND(H100>=1973,H100<1978),VLOOKUP(I100,Feuil2!$F$10:$P$28,3),IF(AND(H100>=1978,H100<1983),VLOOKUP(I100,Feuil2!$F$10:$P$28,2),VLOOKUP(I100,Feuil2!$F$10:$P$28,2))))))))))))","v":{"$error":"#N/A"}},null,{"$f":"T100-HLOOKUP(Y100,Feuil2!$C$1:$CD$9,2,FALSE)","v":{"$error":"#VALUE!"}},{"$f":"T100-HLOOKUP(Y100,Feuil2!$C$1:$CD$9,3,FALSE)","v":{"$error":"#VALUE!"}},{"$f":"T100-HLOOKUP(Y100,Feuil2!$C$1:$CD$9,4,FALSE)","v":{"$error":"#VALUE!"}},{"$f":"T100-HLOOKUP(Y100,Feuil2!$C$1:$CD$9,5,FALSE)","v":{"$error":"#VALUE!"}},{"$f":"T100-HLOOKUP(Y100,Feuil2!$C$1:$CD$9,6,FALSE)","v":{"$error":"#VALUE!"}},{"$f":"T100-HLOOKUP(Y100,Feuil2!$C$1:$CD$9,7,FALSE)","v":{"$error":"#VALUE!"}},{"$f":"T100-HLOOKUP(Y100,Feuil2!$C$1:$CD$9,8,FALSE)","v":{"$error":"#VALUE!"}},{"$f":"T100-HLOOKUP(Y100,Feuil2!$C$1:$CD$9,9,FALSE)","v":{"$error":"#VALUE!"}},null,null,null,null,null,null,null,{"$error":"#VALUE!"},2017,null,{"$f":"IF(AQ100,VLOOKUP(AQ100,HOM!$AS$389:$AT$444,2))","v":4.4930000000000003}]
["H",null,null,null,null,null,null,null,null,null,null,null,null,null,"",null,null,null,"","","","","",false,{"$f":"IF(AND(H101<1920),VLOOKUP(I101,Feuil2!$F$10:$P$28,11),IF(AND(H101>=1920,H101<1939),VLOOKUP(I101,Feuil2!$F$10:$P$28,11),IF(AND(H101>=1938,H101<1943),VLOOKUP(I101,Feuil2!$F$10:$P$28,10),IF(AND(H101>=1943,H101<1948),VLOOKUP(I101,Feuil2!$F$10:$P$28,9),IF(AND(H101>=1948,H101<1953),VLOOKUP(I101,Feuil2!$F$10:$P$28,8),IF(AND(H101>=1953,H101<1958),VLOOKUP(I101,Feuil2!$F$10:$P$28,7),IF(AND(H101>=1958,H101<1963),VLOOKUP(I101,Feuil2!$F$10:$P$28,6),IF(AND(H101>=1963,H101<1968),VLOOKUP(I101,Feuil2!$F$10:$P$28,5),IF(AND(H101>=1968,H101<1973),VLOOKUP(I101,Feuil2!$F$10:$P$28,4),IF(AND(H101>=1973,H101<1978),VLOOKUP(I101,Feuil2!$F$10:$P$28,3),IF(AND(H101>=1978,H101<1983),VLOOKUP(I101,Feuil2!$F$10:$P$28,2),VLOOKUP(I101,Feuil2!$F$10:$P$28,2))))))))))))","v":{"$error":"#N/A"}},null,{"$f":"T101-HLOOKUP(Y101,Feuil2!$C$1:$CD$9,2,FALSE)","v":{"$error":"#VALUE!"}},{"$f":"T101-HLOOKUP(Y101,Feuil2!$C$1:$CD$9,3,FALSE)","v":{"$error":"#VALUE!"}},{"$f":"T101-HLOOKUP(Y101,Feuil2!$C$1:$CD$9,4,FALSE)","v":{"$error":"#VALUE!"}},{"$f":"T101-HLOOKUP(Y101,Feuil2!$C$1:$CD$9,5,FALSE)","v":{"$error":"#VALUE!"}},{"$f":"T101-HLOOKUP(Y101,Feuil2!$C$1:$CD$9,6,FALSE)","v":{"$error":"#VALUE!"}},{"$f":"T101-HLOOKUP(Y101,Feuil2!$C$1:$CD$9,7,FALSE)","v":{"$error":"#VALUE!"}},{"$f":"T101-HLOOKUP(Y101,Feuil2!$C$1:$CD$9,8,FALSE)","v":{"$error":"#VALUE!"}},{"$f":"T101-HLOOKUP(Y101,Feuil2!$C$1:$CD$9,9,FALSE)","v":{"$error":"#VALUE!"}},null,null,null,null,null,null,null,{"$error":"#VALUE!"},2017,null,{"$f":"IF(AQ101,VLOOKUP(AQ101,HOM!$AS$389:$AT$444,2))","v":4.4930000000000003}]
["H",null,null,null,null,null,null,null,null,null,null,null,null,null,"",null,null,null,{"$f":"IF(I102=\"\",\"\",IF(MAXA(P102:R102)<=0,0,MAXA(P102:R102)))","v":""},{"$f":"IF(I102=\"\",\"\",IF(OR(O102=0,S102=0),0,O102+S102))","v":""},"",{"$f":"IF(I102=\"\",\"\",AP102)","v":""},{"$f":"IF(I102=\"\",\"\",IF(AH102>=0,AH102,IF(AG102>=0,AG102,IF(AF102>=0,AF102,IF(AE102>=0,AE102,IF(AD102>=0,AD102,IF(AC102>=0,AC102,IF(AB102>=0,AB102,AA102))))))))","v":""},{"$f":"IF(AQ102<95,IF(AQ102<=90,VLOOKUP(AQ102,$AQ$255:$AR$444,2)))","v":false},{"$f":"IF(AND(H102<1920),VLOOKUP(I102,Feuil2!$F$10:$P$28,11),IF(AND(H102>=1920,H102<1939),VLOOKUP(I102,Feuil2!$F$10:$P$28,11),IF(AND(H102>=1938,H102<1943),VLOOKUP(I102,Feuil2!$F$10:$P$28,10),IF(AND(H102>=1943,H102<1948),VLOOKUP(I102,Feuil2!$F$10:$P$28,9),IF(AND(H102>=1948,H102<1953),VLOOKUP(I102,Feuil2!$F$10:$P$28,8),IF(AND(H102>=1953,H102<1958),VLOOKUP(I102,Feuil2!$F$10:$P$28,7),IF(AND(H102>=1958,H102<1963),VLOOKUP(I102,Feuil2!$F$10:$P$28,6),IF(AND(H102>=1963,H102<1968),VLOOKUP(I102,Feuil2!$F$10:$P$28,5),IF(AND(H102>=1968,H102<1973),VLOOKUP(I102,Feuil2!$F$10:$P$28,4),IF(AND(H102>=1973,H102<1978),VLOOKUP(I102,Feuil2!$F$10:$P$28,3),IF(AND(H102>=1978,H102<1983),VLOOKUP(I102,Feuil2!$F$10:$P$28,2),VLOOKUP(I102,Feuil2!$F$10:$P$28,2))))))))))))","v":{"$error":"#N/A"}},null,{"$f":"T102-HLOOKUP(Y102,Feuil2!$C$1:$CD$9,2,FALSE)","v":{"$error":"#VALUE!"}},{"$f":"T102-HLOOKUP(Y102,Feuil2!$C$1:$CD$9,3,FALSE)","v":{"$error":"#VALUE!"}},{"$f":"T102-HLOOKUP(Y102,Feuil2!$C$1:$CD$9,4,FALSE)","v":{"$error":"#VALUE!"}},{"$f":"T102-HLOOKUP(Y102,Feuil2!$C$1:$CD$9,5,FALSE)","v":{"$error":"#VALUE!"}},{"$f":"T102-HLOOKUP(Y102,Feuil2!$C$1:$CD$9,6,FALSE)","v":{"$error":"#VALUE!"}},{"$f":"T102-HLOOKUP(Y102,Feuil2!$C$1:$CD$9,7,FALSE)","v":{"$error":"#VALUE!"}},{"$f":"T102-HLOOKUP(Y102,Feuil2!$C$1:$CD$9,8,FALSE)","v":{"$error":"#VALUE!"}},{"$f":"T102-HLOOKUP(Y102,Feuil2!$C$1:$CD$9,9,FALSE)","v":{"$error":"#VALUE!"}},null,null,null,null,null,null,null,{"$f":"IF(AH102>=0,$AH$5,IF(AG102>=0,$AG$5,IF(AF102>=0,$AF$5,IF(AE102>=0,$AE$5,IF(AD102>=0,$AD$5,IF(AC102>=0,$AC$5,IF(AB102>=0,$AB$5,IF(AA102>=0,$AA$5,$AI$5))))))))","v":{"$error":"#VALUE!"}},{"$f":"2017-H102","v":2017},null,{"$f":"IF(AQ102,VLOOKUP(AQ102,HOM!$AS$389:$AT$444,2))","v":4.4930000000000003}]
["H",null,null,null,null,null,null,null,null,null,null,null,null,null,"",null,null,null,"","","","","",false,{"$f":"IF(AND(H103<1920),VLOOKUP(I103,Feuil2!$F$10:$P$28,11),IF(AND(H103>=1920,H103<1939),VLOOKUP(I103,Feuil2!$F$10:$P$28,11),IF(AND(H103>=1938,H103<1943),VLOOKUP(I103,Feuil2!$F$10:$P$28,10),IF(AND(H103>=1943,H103<1948),VLOOKUP(I103,Feuil2!$F$10:$P$28,9),IF(AND(H103>=1948,H103<1953),VLOOKUP(I103,Feuil2!$F$10:$P$28,8),IF(AND(H103>=1953,H103<1958),VLOOKUP(I103,Feuil2!$F$10:$P$28,7),IF(AND(H103>=1958,H103<1963),VLOOKUP(I103,Feuil2!$F$10:$P$28,6),IF(AND(H103>=1963,H103<1968),VLOOKUP(I103,Feuil2!$F$10:$P$28,5),IF(AND(H103>=1968,H103<1973),VLOOKUP(I103,Feuil2!$F$10:$P$28,4),IF(AND(H103>=1973,H103<1978),VLOOKUP(I103,Feuil2!$F$10:$P$28,3),IF(AND(H103>=1978,H103<1983),VLOOKUP(I103,Feuil2!$F$10:$P$28,2),VLOOKUP(I103,Feuil2!$F$10:$P$28,2))))))))))))","v":{"$error":"#N/A"}},null,{"$f":"T103-HLOOKUP(Y103,Feuil2!$C$1:$CD$9,2,FALSE)","v":{"$error":"#VALUE!"}},{"$f":"T103-HLOOKUP(Y103,Feuil2!$C$1:$CD$9,3,FALSE)","v":{"$error":"#VALUE!"}},{"$f":"T103-HLOOKUP(Y103,Feuil2!$C$1:$CD$9,4,FALSE)","v":{"$error":"#VALUE!"}},{"$f":"T103-HLOOKUP(Y103,Feuil2!$C$1:$CD$9,5,FALSE)","v":{"$error":"#VALUE!"}},{"$f":"T103-HLOOKUP(Y103,Feuil2!$C$1:$CD$9,6,FALSE)","v":{"$error":"#VALUE!"}},{"$f":"T103-HLOOKUP(Y103,Feuil2!$C$1:$CD$9,7,FALSE)","v":{"$error":"#VALUE!"}},{"$f":"T103-HLOOKUP(Y103,Feuil2!$C$1:$CD$9,8,FALSE)","v":{"$error":"#VALUE!"}},{"$f":"T103-HLOOKUP(Y103,Feuil2!$C$1:$CD$9,9,FALSE)","v":{"$error":"#VALUE!"}},null,null,null,null,null,null,null,{"$error":"#VALUE!"},2017,null,{"$f":"IF(AQ103,VLOOKUP(AQ103,HOM!$AS$389:$AT$444,2))","v":4.4930000000000003}]
["H",null,null,null,null,null,null,null,null,null,null,null,null,null,"",null,null,null,"","","","","",false,{"$f":"IF(AND(H104<1920),VLOOKUP(I104,Feuil2!$F$10:$P$28,11),IF(AND(H104>=1920,H104<1939),VLOOKUP(I104,Feuil2!$F$10:$P$28,11),IF(AND(H104>=1938,H104<1943),VLOOKUP(I104,Feuil2!$F$10:$P$28,10),IF(AND(H104>=1943,H104<1948),VLOOKUP(I104,Feuil2!$F$10:$P$28,9),IF(AND(H104>=1948,H104<1953),VLOOKUP(I104,Feuil2!$F$10:$P$28,8),IF(AND(H104>=1953,H104<1958),VLOOKUP(I104,Feuil2!$F$10:$P$28,7),IF(AND(H104>=1958,H104<1963),VLOOKUP(I104,Feuil2!$F$10:$P$28,6),IF(AND(H104>=1963,H104<1968),VLOOKUP(I104,Feuil2!$F$10:$P$28,5),IF(AND(H104>=1968,H104<1973),VLOOKUP(I104,Feuil2!$F$10:$P$28,4),IF(AND(H104>=1973,H104<1978),VLOOKUP(I104,Feuil2!$F$10:$P$28,3),IF(AND(H104>=1978,H104<1983),VLOOKUP(I104,Feuil2!$F$10:$P$28,2),VLOOKUP(I104,Feuil2!$F$10:$P$28,2))))))))))))","v":{"$error":"#N/A"}},null,{"$f":"T104-HLOOKUP(Y104,Feuil2!$C$1:$CD$9,2,FALSE)","v":{"$error":"#VALUE!"}},{"$f":"T104-HLOOKUP(Y104,Feuil2!$C$1:$CD$9,3,FALSE)","v":{"$error":"#VALUE!"}},{"$f":"T104-HLOOKUP(Y104,Feuil2!$C$1:$CD$9,4,FALSE)","v":{"$error":"#VALUE!"}},{"$f":"T104-HLOOKUP(Y104,Feuil2!$C$1:$CD$9,5,FALSE)","v":{"$error":"#VALUE!"}},{"$f":"T104-HLOOKUP(Y104,Feuil2!$C$1:$CD$9,6,FALSE)","v":{"$error":"#VALUE!"}},{"$f":"T104-HLOOKUP(Y104,Feuil2!$C$1:$CD$9,7,FALSE)","v":{"$error":"#VALUE!"}},{"$f":"T104-HLOOKUP(Y104,Feuil2!$C$1:$CD$9,8,FALSE)","v":{"$error":"#VALUE!"}},{"$f":"T104-HLOOKUP(Y104,Feuil2!$C$1:$CD$9,9,FALSE)","v":{"$error":"#VALUE!"}},null,null,null,null,null,null,null,{"$error":"#VALUE!"},2017,null,{"$f":"IF(AQ104,VLOOKUP(AQ104,HOM!$AS$389:$AT$444,2))","v":4.4930000000000003}]
["H",null,null,null,null,null,null,null,null,null,null,null,null,null,"",null,null,null,"","","","","",false,{"$f":"IF(AND(H105<1920),VLOOKUP(I105,Feuil2!$F$10:$P$28,11),IF(AND(H105>=1920,H105<1939),VLOOKUP(I105,Feuil2!$F$10:$P$28,11),IF(AND(H105>=1938,H105<1943),VLOOKUP(I105,Feuil2!$F$10:$P$28,10),IF(AND(H105>=1943,H105<1948),VLOOKUP(I105,Feuil2!$F$10:$P$28,9),IF(AND(H105>=1948,H105<1953),VLOOKUP(I105,Feuil2!$F$10:$P$28,8),IF(AND(H105>=1953,H105<1958),VLOOKUP(I105,Feuil2!$F$10:$P$28,7),IF(AND(H105>=1958,H105<1963),VLOOKUP(I105,Feuil2!$F$10:$P$28,6),IF(AND(H105>=1963,H105<1968),VLOOKUP(I105,Feuil2!$F$10:$P$28,5),IF(AND(H105>=1968,H105<1973),VLOOKUP(I105,Feuil2!$F$10:$P$28,4),IF(AND(H105>=1973,H105<1978),VLOOKUP(I105,Feuil2!$F$10:$P$28,3),IF(AND(H105>=1978,H105<1983),VLOOKUP(I105,Feuil2!$F$10:$P$28,2),VLOOKUP(I105,Feuil2!$F$10:$P$28,2))))))))))))","v":{"$error":"#N/A"}},null,{"$f":"T105-HLOOKUP(Y105,Feuil2!$C$1:$CD$9,2,FALSE)","v":{"$error":"#VALUE!"}},{"$f":"T105-HLOOKUP(Y105,Feuil2!$C$1:$CD$9,3,FALSE)","v":{"$error":"#VALUE!"}},{"$f":"T105-HLOOKUP(Y105,Feuil2!$C$1:$CD$9,4,FALSE)","v":{"$error":"#VALUE!"}},{"$f":"T105-HLOOKUP(Y105,Feuil2!$C$1:$CD$9,5,FALSE)","v":{"$error":"#VALUE!"}},{"$f":"T105-HLOOKUP(Y105,Feuil2!$C$1:$CD$9,6,FALSE)","v":{"$error":"#VALUE!"}},{"$f":"T105-HLOOKUP(Y105,Feuil2!$C$1:$CD$9,7,FALSE)","v":{"$error":"#VALUE!"}},{"$f":"T105-HLOOKUP(Y105,Feuil2!$C$1:$CD$9,8,FALSE)","v":{"$error":"#VALUE!"}},{"$f":"T105-HLOOKUP(Y105,Feuil2!$C$1:$CD$9,9,FALSE)","v":{"$error":"#VALUE!"}},null,null,null,null,null,null,null,{"$error":"#VALUE!"},2017,null,{"$f":"IF(AQ105,VLOOKUP(AQ105,HOM!$AS$389:$AT$444,2))","v":4.4930000000000003}]
["H",null,null,null,null,null,null,null,null,null,null,null,null,null,"",null,null,null,"","","","","",false,{"$f":"IF(AND(H106<1920),VLOOKUP(I106,Feuil2!$F$10:$P$28,11),IF(AND(H106>=1920,H106<1939),VLOOKUP(I106,Feuil2!$F$10:$P$28,11),IF(AND(H106>=1938,H106<1943),VLOOKUP(I106,Feuil2!$F$10:$P$28,10),IF(AND(H106>=1943,H106<1948),VLOOKUP(I106,Feuil2!$F$10:$P$28,9),IF(AND(H106>=1948,H106<1953),VLOOKUP(I106,Feuil2!$F$10:$P$28,8),IF(AND(H106>=1953,H106<1958),VLOOKUP(I106,Feuil2!$F$10:$P$28,7),IF(AND(H106>=1958,H106<1963),VLOOKUP(I106,Feuil2!$F$10:$P$28,6),IF(AND(H106>=1963,H106<1968),VLOOKUP(I106,Feuil2!$F$10:$P$28,5),IF(AND(H106>=1968,H106<1973),VLOOKUP(I106,Feuil2!$F$10:$P$28,4),IF(AND(H106>=1973,H106<1978),VLOOKUP(I106,Feuil2!$F$10:$P$28,3),IF(AND(H106>=1978,H106<1983),VLOOKUP(I106,Feuil2!$F$10:$P$28,2),VLOOKUP(I106,Feuil2!$F$10:$P$28,2))))))))))))","v":{"$error":"#N/A"}},null,{"$f":"T106-HLOOKUP(Y106,Feuil2!$C$1:$CD$9,2,FALSE)","v":{"$error":"#VALUE!"}},{"$f":"T106-HLOOKUP(Y106,Feuil2!$C$1:$CD$9,3,FALSE)","v":{"$error":"#VALUE!"}},{"$f":"T106-HLOOKUP(Y106,Feuil2!$C$1:$CD$9,4,FALSE)","v":{"$error":"#VALUE!"}},{"$f":"T106-HLOOKUP(Y106,Feuil2!$C$1:$CD$9,5,FALSE)","v":{"$error":"#VALUE!"}},{"$f":"T106-HLOOKUP(Y106,Feuil2!$C$1:$CD$9,6,FALSE)","v":{"$error":"#VALUE!"}},{"$f":"T106-HLOOKUP(Y106,Feuil2!$C$1:$CD$9,7,FALSE)","v":{"$error":"#VALUE!"}},{"$f":"T106-HLOOKUP(Y106,Feuil2!$C$1:$CD$9,8,FALSE)","v":{"$error":"#VALUE!"}},{"$f":"T106-HLOOKUP(Y106,Feuil2!$C$1:$CD$9,9,FALSE)","v":{"$error":"#VALUE!"}},null,null,null,null,null,null,null,{"$error":"#VALUE!"},2017,null,{"$f":"IF(AQ106,VLOOKUP(AQ106,HOM!$AS$389:$AT$444,2))","v":4.4930000000000003}]
["H",null,null,null,null,null,null,null,null,null,null,null,null,null,"",null,null,null,"","","","","",false,{"$f":"IF(AND(H107<1920),VLOOKUP(I107,Feuil2!$F$10:$P$28,11),IF(AND(H107>=1920,H107<1939),VLOOKUP(I107,Feuil2!$F$10:$P$28,11),IF(AND(H107>=1938,H107<1943),VLOOKUP(I107,Feuil2!$F$10:$P$28,10),IF(AND(H107>=1943,H107<1948),VLOOKUP(I107,Feuil2!$F$10:$P$28,9),IF(AND(H107>=1948,H107<1953),VLOOKUP(I107,Feuil2!$F$10:$P$28,8),IF(AND(H107>=1953,H107<1958),VLOOKUP(I107,Feuil2!$F$10:$P$28,7),IF(AND(H107>=1958,H107<1963),VLOOKUP(I107,Feuil2!$F$10:$P$28,6),IF(AND(H107>=1963,H107<1968),VLOOKUP(I107,Feuil2!$F$10:$P$28,5),IF(AND(H107>=1968,H107<1973),VLOOKUP(I107,Feuil2!$F$10:$P$28,4),IF(AND(H107>=1973,H107<1978),VLOOKUP(I107,Feuil2!$F$10:$P$28,3),IF(AND(H107>=1978,H107<1983),VLOOKUP(I107,Feuil2!$F$10:$P$28,2),VLOOKUP(I107,Feuil2!$F$10:$P$28,2))))))))))))","v":{"$error":"#N/A"}},null,{"$f":"T107-HLOOKUP(Y107,Feuil2!$C$1:$CD$9,2,FALSE)","v":{"$error":"#VALUE!"}},{"$f":"T107-HLOOKUP(Y107,Feuil2!$C$1:$CD$9,3,FALSE)","v":{"$error":"#VALUE!"}},{"$f":"T107-HLOOKUP(Y107,Feuil2!$C$1:$CD$9,4,FALSE)","v":{"$error":"#VALUE!"}},{"$f":"T107-HLOOKUP(Y107,Feuil2!$C$1:$CD$9,5,FALSE)","v":{"$error":"#VALUE!"}},{"$f":"T107-HLOOKUP(Y107,Feuil2!$C$1:$CD$9,6,FALSE)","v":{"$error":"#VALUE!"}},{"$f":"T107-HLOOKUP(Y107,Feuil2!$C$1:$CD$9,7,FALSE)","v":{"$error":"#VALUE!"}},{"$f":"T107-HLOOKUP(Y107,Feuil2!$C$1:$CD$9,8,FALSE)","v":{"$error":"#VALUE!"}},{"$f":"T107-HLOOKUP(Y107,Feuil2!$C$1:$CD$9,9,FALSE)","v":{"$error":"#VALUE!"}},null,null,null,null,null,null,null,{"$error":"#VALUE!"},2017,null,{"$f":"IF(AQ107,VLOOKUP(AQ107,HOM!$AS$389:$AT$444,2))","v":4.4930000000000003}]
["H",null,null,null,null,null,null,null,null,null,null,null,null,null,"",null,null,null,"","","","","",false,{"$f":"IF(AND(H108<1920),VLOOKUP(I108,Feuil2!$F$10:$P$28,11),IF(AND(H108>=1920,H108<1939),VLOOKUP(I108,Feuil2!$F$10:$P$28,11),IF(AND(H108>=1938,H108<1943),VLOOKUP(I108,Feuil2!$F$10:$P$28,10),IF(AND(H108>=1943,H108<1948),VLOOKUP(I108,Feuil2!$F$10:$P$28,9),IF(AND(H108>=1948,H108<1953),VLOOKUP(I108,Feuil2!$F$10:$P$28,8),IF(AND(H108>=1953,H108<1958),VLOOKUP(I108,Feuil2!$F$10:$P$28,7),IF(AND(H108>=1958,H108<1963),VLOOKUP(I108,Feuil2!$F$10:$P$28,6),IF(AND(H108>=1963,H108<1968),VLOOKUP(I108,Feuil2!$F$10:$P$28,5),IF(AND(H108>=1968,H108<1973),VLOOKUP(I108,Feuil2!$F$10:$P$28,4),IF(AND(H108>=1973,H108<1978),VLOOKUP(I108,Feuil2!$F$10:$P$28,3),IF(AND(H108>=1978,H108<1983),VLOOKUP(I108,Feuil2!$F$10:$P$28,2),VLOOKUP(I108,Feuil2!$F$10:$P$28,2))))))))))))","v":{"$error":"#N/A"}},null,{"$f":"T108-HLOOKUP(Y108,Feuil2!$C$1:$CD$9,2,FALSE)","v":{"$error":"#VALUE!"}},{"$f":"T108-HLOOKUP(Y108,Feuil2!$C$1:$CD$9,3,FALSE)","v":{"$error":"#VALUE!"}},{"$f":"T108-HLOOKUP(Y108,Feuil2!$C$1:$CD$9,4,FALSE)","v":{"$error":"#VALUE!"}},{"$f":"T108-HLOOKUP(Y108,Feuil2!$C$1:$CD$9,5,FALSE)","v":{"$error":"#VALUE!"}},{"$f":"T108-HLOOKUP(Y108,Feuil2!$C$1:$CD$9,6,FALSE)","v":{"$error":"#VALUE!"}},{"$f":"T108-HLOOKUP(Y108,Feuil2!$C$1:$CD$9,7,FALSE)","v":{"$error":"#VALUE!"}},{"$f":"T108-HLOOKUP(Y108,Feuil2!$C$1:$CD$9,8,FALSE)","v":{"$error":"#VALUE!"}},{"$f":"T108-HLOOKUP(Y108,Feuil2!$C$1:$CD$9,9,FALSE)","v":{"$error":"#VALUE!"}},null,null,null,null,null,null,null,{"$error":"#VALUE!"},2017,null,{"$f":"IF(AQ108,VLOOKUP(AQ108,HOM!$AS$389:$AT$444,2))","v":4.4930000000000003}]
["H",null,null,null,null,null,null,null,null,null,null,null,null,null,"",null,null,null,"","","","","",false,{"$f":"IF(AND(H109<1920),VLOOKUP(I109,Feuil2!$F$10:$P$28,11),IF(AND(H109>=1920,H109<1939),VLOOKUP(I109,Feuil2!$F$10:$P$28,11),IF(AND(H109>=1938,H109<1943),VLOOKUP(I109,Feuil2!$F$10:$P$28,10),IF(AND(H109>=1943,H109<1948),VLOOKUP(I109,Feuil2!$F$10:$P$28,9),IF(AND(H109>=1948,H109<1953),VLOOKUP(I109,Feuil2!$F$10:$P$28,8),IF(AND(H109>=1953,H109<1958),VLOOKUP(I109,Feuil2!$F$10:$P$28,7),IF(AND(H109>=1958,H109<1963),VLOOKUP(I109,Feuil2!$F$10:$P$28,6),IF(AND(H109>=1963,H109<1968),VLOOKUP(I109,Feuil2!$F$10:$P$28,5),IF(AND(H109>=1968,H109<1973),VLOOKUP(I109,Feuil2!$F$10:$P$28,4),IF(AND(H109>=1973,H109<1978),VLOOKUP(I109,Feuil2!$F$10:$P$28,3),IF(AND(H109>=1978,H109<1983),VLOOKUP(I109,Feuil2!$F$10:$P$28,2),VLOOKUP(I109,Feuil2!$F$10:$P$28,2))))))))))))","v":{"$error":"#N/A"}},null,{"$f":"T109-HLOOKUP(Y109,Feuil2!$C$1:$CD$9,2,FALSE)","v":{"$error":"#VALUE!"}},{"$f":"T109-HLOOKUP(Y109,Feuil2!$C$1:$CD$9,3,FALSE)","v":{"$error":"#VALUE!"}},{"$f":"T109-HLOOKUP(Y109,Feuil2!$C$1:$CD$9,4,FALSE)","v":{"$error":"#VALUE!"}},{"$f":"T109-HLOOKUP(Y109,Feuil2!$C$1:$CD$9,5,FALSE)","v":{"$error":"#VALUE!"}},{"$f":"T109-HLOOKUP(Y109,Feuil2!$C$1:$CD$9,6,FALSE)","v":{"$error":"#VALUE!"}},{"$f":"T109-HLOOKUP(Y109,Feuil2!$C$1:$CD$9,7,FALSE)","v":{"$error":"#VALUE!"}},{"$f":"T109-HLOOKUP(Y109,Feuil2!$C$1:$CD$9,8,FALSE)","v":{"$error":"#VALUE!"}},{"$f":"T109-HLOOKUP(Y109,Feuil2!$C$1:$CD$9,9,FALSE)","v":{"$error":"#VALUE!"}},null,null,null,null,null,null,null,{"$error":"#VALUE!"},2017,null,{"$f":"IF(AQ109,VLOOKUP(AQ109,HOM!$AS$389:$AT$444,2))","v":4.4930000000000003}]
["H",null,null,null,null,null,null,null,null,null,null,null,null,null,"",null,null,null,"","","","","",false,{"$f":"IF(AND(H110<1920),VLOOKUP(I110,Feuil2!$F$10:$P$28,11),IF(AND(H110>=1920,H110<1939),VLOOKUP(I110,Feuil2!$F$10:$P$28,11),IF(AND(H110>=1938,H110<1943),VLOOKUP(I110,Feuil2!$F$10:$P$28,10),IF(AND(H110>=1943,H110<1948),VLOOKUP(I110,Feuil2!$F$10:$P$28,9),IF(AND(H110>=1948,H110<1953),VLOOKUP(I110,Feuil2!$F$10:$P$28,8),IF(AND(H110>=1953,H110<1958),VLOOKUP(I110,Feuil2!$F$10:$P$28,7),IF(AND(H110>=1958,H110<1963),VLOOKUP(I110,Feuil2!$F$10:$P$28,6),IF(AND(H110>=1963,H110<1968),VLOOKUP(I110,Feuil2!$F$10:$P$28,5),IF(AND(H110>=1968,H110<1973),VLOOKUP(I110,Feuil2!$F$10:$P$28,4),IF(AND(H110>=1973,H110<1978),VLOOKUP(I110,Feuil2!$F$10:$P$28,3),IF(AND(H110>=1978,H110<1983),VLOOKUP(I110,Feuil2!$F$10:$P$28,2),VLOOKUP(I110,Feuil2!$F$10:$P$28,2))))))))))))","v":{"$error":"#N/A"}},null,{"$f":"T110-HLOOKUP(Y110,Feuil2!$C$1:$CD$9,2,FALSE)","v":{"$error":"#VALUE!"}},{"$f":"T110-HLOOKUP(Y110,Feuil2!$C$1:$CD$9,3,FALSE)","v":{"$error":"#VALUE!"}},{"$f":"T110-HLOOKUP(Y110,Feuil2!$C$1:$CD$9,4,FALSE)","v":{"$error":"#VALUE!"}},{"$f":"T110-HLOOKUP(Y110,Feuil2!$C$1:$CD$9,5,FALSE)","v":{"$error":"#VALUE!"}},{"$f":"T110-HLOOKUP(Y110,Feuil2!$C$1:$CD$9,6,FALSE)","v":{"$error":"#VALUE!"}},{"$f":"T110-HLOOKUP(Y110,Feuil2!$C$1:$CD$9,7,FALSE)","v":{"$error":"#VALUE!"}},{"$f":"T110-HLOOKUP(Y110,Feuil2!$C$1:$CD$9,8,FALSE)","v":{"$error":"#VALUE!"}},{"$f":"T110-HLOOKUP(Y110,Feuil2!$C$1:$CD$9,9,FALSE)","v":{"$error":"#VALUE!"}},null,null,null,null,null,null,null,{"$error":"#VALUE!"},2017,null,{"$f":"IF(AQ110,VLOOKUP(AQ110,HOM!$AS$389:$AT$444,2))","v":4.4930000000000003}]
["H",null,null,null,null,null,null,null,null,null,null,null,null,null,"",null,null,null,"","","","","",false,{"$f":"IF(AND(H111<1920),VLOOKUP(I111,Feuil2!$F$10:$P$28,11),IF(AND(H111>=1920,H111<1939),VLOOKUP(I111,Feuil2!$F$10:$P$28,11),IF(AND(H111>=1938,H111<1943),VLOOKUP(I111,Feuil2!$F$10:$P$28,10),IF(AND(H111>=1943,H111<1948),VLOOKUP(I111,Feuil2!$F$10:$P$28,9),IF(AND(H111>=1948,H111<1953),VLOOKUP(I111,Feuil2!$F$10:$P$28,8),IF(AND(H111>=1953,H111<1958),VLOOKUP(I111,Feuil2!$F$10:$P$28,7),IF(AND(H111>=1958,H111<1963),VLOOKUP(I111,Feuil2!$F$10:$P$28,6),IF(AND(H111>=1963,H111<1968),VLOOKUP(I111,Feuil2!$F$10:$P$28,5),IF(AND(H111>=1968,H111<1973),VLOOKUP(I111,Feuil2!$F$10:$P$28,4),IF(AND(H111>=1973,H111<1978),VLOOKUP(I111,Feuil2!$F$10:$P$28,3),IF(AND(H111>=1978,H111<1983),VLOOKUP(I111,Feuil2!$F$10:$P$28,2),VLOOKUP(I111,Feuil2!$F$10:$P$28,2))))))))))))","v":{"$error":"#N/A"}},null,{"$f":"T111-HLOOKUP(Y111,Feuil2!$C$1:$CD$9,2,FALSE)","v":{"$error":"#VALUE!"}},{"$f":"T111-HLOOKUP(Y111,Feuil2!$C$1:$CD$9,3,FALSE)","v":{"$error":"#VALUE!"}},{"$f":"T111-HLOOKUP(Y111,Feuil2!$C$1:$CD$9,4,FALSE)","v":{"$error":"#VALUE!"}},{"$f":"T111-HLOOKUP(Y111,Feuil2!$C$1:$CD$9,5,FALSE)","v":{"$error":"#VALUE!"}},{"$f":"T111-HLOOKUP(Y111,Feuil2!$C$1:$CD$9,6,FALSE)","v":{"$error":"#VALUE!"}},{"$f":"T111-HLOOKUP(Y111,Feuil2!$C$1:$CD$9,7,FALSE)","v":{"$error":"#VALUE!"}},{"$f":"T111-HLOOKUP(Y111,Feuil2!$C$1:$CD$9,8,FALSE)","v":{"$error":"#VALUE!"}},{"$f":"T111-HLOOKUP(Y111,Feuil2!$C$1:$CD$9,9,FALSE)","v":{"$error":"#VALUE!"}},null,null,null,null,null,null,null,{"$error":"#VALUE!"},2017,null,{"$f":"IF(AQ111,VLOOKUP(AQ111,HOM!$AS$389:$AT$444,2))","v":4.4930000000000003}]
["H",null,null,null,null,null,null,null,null,null,null,null,null,null,"",null,null,null,"","","","","",false,{"$f":"IF(AND(H112<1920),VLOOKUP(I112,Feuil2!$F$10:$P$28,11),IF(AND(H112>=1920,H112<1939),VLOOKUP(I112,Feuil2!$F$10:$P$28,11),IF(AND(H112>=1938,H112<1943),VLOOKUP(I112,Feuil2!$F$10:$P$28,10),IF(AND(H112>=1943,H112<1948),VLOOKUP(I112,Feuil2!$F$10:$P$28,9),IF(AND(H112>=1948,H112<1953),VLOOKUP(I112,Feuil2!$F$10:$P$28,8),IF(AND(H112>=1953,H112<1958),VLOOKUP(I112,Feuil2!$F$10:$P$28,7),IF(AND(H112>=1958,H112<1963),VLOOKUP(I112,Feuil2!$F$10:$P$28,6),IF(AND(H112>=1963,H112<1968),VLOOKUP(I112,Feuil2!$F$10:$P$28,5),IF(AND(H112>=1968,H112<1973),VLOOKUP(I112,Feuil2!$F$10:$P$28,4),IF(AND(H112>=1973,H112<1978),VLOOKUP(I112,Feuil2!$F$10:$P$28,3),IF(AND(H112>=1978,H112<1983),VLOOKUP(I112,Feuil2!$F$10:$P$28,2),VLOOKUP(I112,Feuil2!$F$10:$P$28,2))))))))))))","v":{"$error":"#N/A"}},null,{"$f":"T112-HLOOKUP(Y112,Feuil2!$C$1:$CD$9,2,FALSE)","v":{"$error":"#VALUE!"}},{"$f":"T112-HLOOKUP(Y112,Feuil2!$C$1:$CD$9,3,FALSE)","v":{"$error":"#VALUE!"}},{"$f":"T112-HLOOKUP(Y112,Feuil2!$C$1:$CD$9,4,FALSE)","v":{"$error":"#VALUE!"}},{"$f":"T112-HLOOKUP(Y112,Feuil2!$C$1:$CD$9,5,FALSE)","v":{"$error":"#VALUE!"}},{"$f":"T112-HLOOKUP(Y112,Feuil2!$C$1:$CD$9,6,FALSE)","v":{"$error":"#VALUE!"}},{"$f":"T112-HLOOKUP(Y112,Feuil2!$C$1:$CD$9,7,FALSE)","v":{"$error":"#VALUE!"}},{"$f":"T112-HLOOKUP(Y112,Feuil2!$C$1:$CD$9,8,FALSE)","v":{"$error":"#VALUE!"}},{"$f":"T112-HLOOKUP(Y112,Feuil2!$C$1:$CD$9,9,FALSE)","v":{"$error":"#VALUE!"}},null,null,null,null,null,null,null,{"$error":"#VALUE!"},2017,null,{"$f":"IF(AQ112,VLOOKUP(AQ112,HOM!$AS$389:$AT$444,2))","v":4.4930000000000003}]
["H",null,null,null,null,null,null,null,null,null,null,null,null,null,"",null,null,null,"","","","","",false,{"$f":"IF(AND(H113<1920),VLOOKUP(I113,Feuil2!$F$10:$P$28,11),IF(AND(H113>=1920,H113<1939),VLOOKUP(I113,Feuil2!$F$10:$P$28,11),IF(AND(H113>=1938,H113<1943),VLOOKUP(I113,Feuil2!$F$10:$P$28,10),IF(AND(H113>=1943,H113<1948),VLOOKUP(I113,Feuil2!$F$10:$P$28,9),IF(AND(H113>=1948,H113<1953),VLOOKUP(I113,Feuil2!$F$10:$P$28,8),IF(AND(H113>=1953,H113<1958),VLOOKUP(I113,Feuil2!$F$10:$P$28,7),IF(AND(H113>=1958,H113<1963),VLOOKUP(I113,Feuil2!$F$10:$P$28,6),IF(AND(H113>=1963,H113<1968),VLOOKUP(I113,Feuil2!$F$10:$P$28,5),IF(AND(H113>=1968,H113<1973),VLOOKUP(I113,Feuil2!$F$10:$P$28,4),IF(AND(H113>=1973,H113<1978),VLOOKUP(I113,Feuil2!$F$10:$P$28,3),IF(AND(H113>=1978,H113<1983),VLOOKUP(I113,Feuil2!$F$10:$P$28,2),VLOOKUP(I113,Feuil2!$F$10:$P$28,2))))))))))))","v":{"$error":"#N/A"}},null,{"$f":"T113-HLOOKUP(Y113,Feuil2!$C$1:$CD$9,2,FALSE)","v":{"$error":"#VALUE!"}},{"$f":"T113-HLOOKUP(Y113,Feuil2!$C$1:$CD$9,3,FALSE)","v":{"$error":"#VALUE!"}},{"$f":"T113-HLOOKUP(Y113,Feuil2!$C$1:$CD$9,4,FALSE)","v":{"$error":"#VALUE!"}},{"$f":"T113-HLOOKUP(Y113,Feuil2!$C$1:$CD$9,5,FALSE)","v":{"$error":"#VALUE!"}},{"$f":"T113-HLOOKUP(Y113,Feuil2!$C$1:$CD$9,6,FALSE)","v":{"$error":"#VALUE!"}},{"$f":"T113-HLOOKUP(Y113,Feuil2!$C$1:$CD$9,7,FALSE)","v":{"$error":"#VALUE!"}},{"$f":"T113-HLOOKUP(Y113,Feuil2!$C$1:$CD$9,8,FALSE)","v":{"$error":"#VALUE!"}},{"$f":"T113-HLOOKUP(Y113,Feuil2!$C$1:$CD$9,9,FALSE)","v":{"$error":"#VALUE!"}},null,null,null,null,null,null,null,{"$error":"#VALUE!"},2017,null,{"$f":"IF(AQ113,VLOOKUP(AQ113,HOM!$AS$389:$AT$444,2))","v":4.4930000000000003}]
["H",null,null,null,null,null,null,null,null,null,null,null,null,null,"",null,null,null,"","","","","",false,{"$f":"IF(AND(H114<1920),VLOOKUP(I114,Feuil2!$F$10:$P$28,11),IF(AND(H114>=1920,H114<1939),VLOOKUP(I114,Feuil2!$F$10:$P$28,11),IF(AND(H114>=1938,H114<1943),VLOOKUP(I114,Feuil2!$F$10:$P$28,10),IF(AND(H114>=1943,H114<1948),VLOOKUP(I114,Feuil2!$F$10:$P$28,9),IF(AND(H114>=1948,H114<1953),VLOOKUP(I114,Feuil2!$F$10:$P$28,8),IF(AND(H114>=1953,H114<1958),VLOOKUP(I114,Feuil2!$F$10:$P$28,7),IF(AND(H114>=1958,H114<1963),VLOOKUP(I114,Feuil2!$F$10:$P$28,6),IF(AND(H114>=1963,H114<1968),VLOOKUP(I114,Feuil2!$F$10:$P$28,5),IF(AND(H114>=1968,H114<1973),VLOOKUP(I114,Feuil2!$F$10:$P$28,4),IF(AND(H114>=1973,H114<1978),VLOOKUP(I114,Feuil2!$F$10:$P$28,3),IF(AND(H114>=1978,H114<1983),VLOOKUP(I114,Feuil2!$F$10:$P$28,2),VLOOKUP(I114,Feuil2!$F$10:$P$28,2))))))))))))","v":{"$error":"#N/A"}},null,{"$f":"T114-HLOOKUP(Y114,Feuil2!$C$1:$CD$9,2,FALSE)","v":{"$error":"#VALUE!"}},{"$f":"T114-HLOOKUP(Y114,Feuil2!$C$1:$CD$9,3,FALSE)","v":{"$error":"#VALUE!"}},{"$f":"T114-HLOOKUP(Y114,Feuil2!$C$1:$CD$9,4,FALSE)","v":{"$error":"#VALUE!"}},{"$f":"T114-HLOOKUP(Y114,Feuil2!$C$1:$CD$9,5,FALSE)","v":{"$error":"#VALUE!"}},{"$f":"T114-HLOOKUP(Y114,Feuil2!$C$1:$CD$9,6,FALSE)","v":{"$error":"#VALUE!"}},{"$f":"T114-HLOOKUP(Y114,Feuil2!$C$1:$CD$9,7,FALSE)","v":{"$error":"#VALUE!"}},{"$f":"T114-HLOOKUP(Y114,Feuil2!$C$1:$CD$9,8,FALSE)","v":{"$error":"#VALUE!"}},{"$f":"T114-HLOOKUP(Y114,Feuil2!$C$1:$CD$9,9,FALSE)","v":{"$error":"#VALUE!"}},null,null,null,null,null,null,null,{"$error":"#VALUE!"},2017,null,{"$f":"IF(AQ114,VLOOKUP(AQ114,HOM!$AS$389:$AT$444,2))","v":4.4930000000000003}]
["H",null,null,null,null,null,null,null,null,null,null,null,null,null,"",null,null,null,"","","","","",false,{"$f":"IF(AND(H115<1920),VLOOKUP(I115,Feuil2!$F$10:$P$28,11),IF(AND(H115>=1920,H115<1939),VLOOKUP(I115,Feuil2!$F$10:$P$28,11),IF(AND(H115>=1938,H115<1943),VLOOKUP(I115,Feuil2!$F$10:$P$28,10),IF(AND(H115>=1943,H115<1948),VLOOKUP(I115,Feuil2!$F$10:$P$28,9),IF(AND(H115>=1948,H115<1953),VLOOKUP(I115,Feuil2!$F$10:$P$28,8),IF(AND(H115>=1953,H115<1958),VLOOKUP(I115,Feuil2!$F$10:$P$28,7),IF(AND(H115>=1958,H115<1963),VLOOKUP(I115,Feuil2!$F$10:$P$28,6),IF(AND(H115>=1963,H115<1968),VLOOKUP(I115,Feuil2!$F$10:$P$28,5),IF(AND(H115>=1968,H115<1973),VLOOKUP(I115,Feuil2!$F$10:$P$28,4),IF(AND(H115>=1973,H115<1978),VLOOKUP(I115,Feuil2!$F$10:$P$28,3),IF(AND(H115>=1978,H115<1983),VLOOKUP(I115,Feuil2!$F$10:$P$28,2),VLOOKUP(I115,Feuil2!$F$10:$P$28,2))))))))))))","v":{"$error":"#N/A"}},null,{"$f":"T115-HLOOKUP(Y115,Feuil2!$C$1:$CD$9,2,FALSE)","v":{"$error":"#VALUE!"}},{"$f":"T115-HLOOKUP(Y115,Feuil2!$C$1:$CD$9,3,FALSE)","v":{"$error":"#VALUE!"}},{"$f":"T115-HLOOKUP(Y115,Feuil2!$C$1:$CD$9,4,FALSE)","v":{"$error":"#VALUE!"}},{"$f":"T115-HLOOKUP(Y115,Feuil2!$C$1:$CD$9,5,FALSE)","v":{"$error":"#VALUE!"}},{"$f":"T115-HLOOKUP(Y115,Feuil2!$C$1:$CD$9,6,FALSE)","v":{"$error":"#VALUE!"}},{"$f":"T115-HLOOKUP(Y115,Feuil2!$C$1:$CD$9,7,FALSE)","v":{"$error":"#VALUE!"}},{"$f":"T115-HLOOKUP(Y115,Feuil2!$C$1:$CD$9,8,FALSE)","v":{"$error":"#VALUE!"}},{"$f":"T115-HLOOKUP(Y115,Feuil2!$C$1:$CD$9,9,FALSE)","v":{"$error":"#VALUE!"}},null,null,null,null,null,null,null,{"$error":"#VALUE!"},2017,null,{"$f":"IF(AQ115,VLOOKUP(AQ115,HOM!$AS$389:$AT$444,2))","v":4.4930000000000003}]
["H",null,null,null,null,null,null,null,null,null,null,null,null,null,"",null,null,null,"","","","","",false,{"$f":"IF(AND(H116<1920),VLOOKUP(I116,Feuil2!$F$10:$P$28,11),IF(AND(H116>=1920,H116<1939),VLOOKUP(I116,Feuil2!$F$10:$P$28,11),IF(AND(H116>=1938,H116<1943),VLOOKUP(I116,Feuil2!$F$10:$P$28,10),IF(AND(H116>=1943,H116<1948),VLOOKUP(I116,Feuil2!$F$10:$P$28,9),IF(AND(H116>=1948,H116<1953),VLOOKUP(I116,Feuil2!$F$10:$P$28,8),IF(AND(H116>=1953,H116<1958),VLOOKUP(I116,Feuil2!$F$10:$P$28,7),IF(AND(H116>=1958,H116<1963),VLOOKUP(I116,Feuil2!$F$10:$P$28,6),IF(AND(H116>=1963,H116<1968),VLOOKUP(I116,Feuil2!$F$10:$P$28,5),IF(AND(H116>=1968,H116<1973),VLOOKUP(I116,Feuil2!$F$10:$P$28,4),IF(AND(H116>=1973,H116<1978),VLOOKUP(I116,Feuil2!$F$10:$P$28,3),IF(AND(H116>=1978,H116<1983),VLOOKUP(I116,Feuil2!$F$10:$P$28,2),VLOOKUP(I116,Feuil2!$F$10:$P$28,2))))))))))))","v":{"$error":"#N/A"}},null,{"$f":"T116-HLOOKUP(Y116,Feuil2!$C$1:$CD$9,2,FALSE)","v":{"$error":"#VALUE!"}},{"$f":"T116-HLOOKUP(Y116,Feuil2!$C$1:$CD$9,3,FALSE)","v":{"$error":"#VALUE!"}},{"$f":"T116-HLOOKUP(Y116,Feuil2!$C$1:$CD$9,4,FALSE)","v":{"$error":"#VALUE!"}},{"$f":"T116-HLOOKUP(Y116,Feuil2!$C$1:$CD$9,5,FALSE)","v":{"$error":"#VALUE!"}},{"$f":"T116-HLOOKUP(Y116,Feuil2!$C$1:$CD$9,6,FALSE)","v":{"$error":"#VALUE!"}},{"$f":"T116-HLOOKUP(Y116,Feuil2!$C$1:$CD$9,7,FALSE)","v":{"$error":"#VALUE!"}},{"$f":"T116-HLOOKUP(Y116,Feuil2!$C$1:$CD$9,8,FALSE)","v":{"$error":"#VALUE!"}},{"$f":"T116-HLOOKUP(Y116,Feuil2!$C$1:$CD$9,9,FALSE)","v":{"$error":"#VALUE!"}},null,null,null,null,null,null,null,{"$error":"#VALUE!"},2017,null,{"$f":"IF(AQ116,VLOOKUP(AQ116,HOM!$AS$389:$AT$444,2))","v":4.4930000000000003}]
["H",null,null,null,null,null,null,null,null,null,null,null,null,null,"",null,null,null,"","","","","",false,{"$f":"IF(AND(H117<1920),VLOOKUP(I117,Feuil2!$F$10:$P$28,11),IF(AND(H117>=1920,H117<1939),VLOOKUP(I117,Feuil2!$F$10:$P$28,11),IF(AND(H117>=1938,H117<1943),VLOOKUP(I117,Feuil2!$F$10:$P$28,10),IF(AND(H117>=1943,H117<1948),VLOOKUP(I117,Feuil2!$F$10:$P$28,9),IF(AND(H117>=1948,H117<1953),VLOOKUP(I117,Feuil2!$F$10:$P$28,8),IF(AND(H117>=1953,H117<1958),VLOOKUP(I117,Feuil2!$F$10:$P$28,7),IF(AND(H117>=1958,H117<1963),VLOOKUP(I117,Feuil2!$F$10:$P$28,6),IF(AND(H117>=1963,H117<1968),VLOOKUP(I117,Feuil2!$F$10:$P$28,5),IF(AND(H117>=1968,H117<1973),VLOOKUP(I117,Feuil2!$F$10:$P$28,4),IF(AND(H117>=1973,H117<1978),VLOOKUP(I117,Feuil2!$F$10:$P$28,3),IF(AND(H117>=1978,H117<1983),VLOOKUP(I117,Feuil2!$F$10:$P$28,2),VLOOKUP(I117,Feuil2!$F$10:$P$28,2))))))))))))","v":{"$error":"#N/A"}},null,{"$f":"T117-HLOOKUP(Y117,Feuil2!$C$1:$CD$9,2,FALSE)","v":{"$error":"#VALUE!"}},{"$f":"T117-HLOOKUP(Y117,Feuil2!$C$1:$CD$9,3,FALSE)","v":{"$error":"#VALUE!"}},{"$f":"T117-HLOOKUP(Y117,Feuil2!$C$1:$CD$9,4,FALSE)","v":{"$error":"#VALUE!"}},{"$f":"T117-HLOOKUP(Y117,Feuil2!$C$1:$CD$9,5,FALSE)","v":{"$error":"#VALUE!"}},{"$f":"T117-HLOOKUP(Y117,Feuil2!$C$1:$CD$9,6,FALSE)","v":{"$error":"#VALUE!"}},{"$f":"T117-HLOOKUP(Y117,Feuil2!$C$1:$CD$9,7,FALSE)","v":{"$error":"#VALUE!"}},{"$f":"T117-HLOOKUP(Y117,Feuil2!$C$1:$CD$9,8,FALSE)","v":{"$error":"#VALUE!"}},{"$f":"T117-HLOOKUP(Y117,Feuil2!$C$1:$CD$9,9,FALSE)","v":{"$error":"#VALUE!"}},null,null,null,null,null,null,null,{"$error":"#VALUE!"},2017,null,{"$f":"IF(AQ117,VLOOKUP(AQ117,HOM!$AS$389:$AT$444,2))","v":4.4930000000000003}]
["H",null,null,null,null,null,null,null,null,null,null,null,null,null,"",null,null,null,"","","","","",false,{"$f":"IF(AND(H118<1920),VLOOKUP(I118,Feuil2!$F$10:$P$28,11),IF(AND(H118>=1920,H118<1939),VLOOKUP(I118,Feuil2!$F$10:$P$28,11),IF(AND(H118>=1938,H118<1943),VLOOKUP(I118,Feuil2!$F$10:$P$28,10),IF(AND(H118>=1943,H118<1948),VLOOKUP(I118,Feuil2!$F$10:$P$28,9),IF(AND(H118>=1948,H118<1953),VLOOKUP(I118,Feuil2!$F$10:$P$28,8),IF(AND(H118>=1953,H118<1958),VLOOKUP(I118,Feuil2!$F$10:$P$28,7),IF(AND(H118>=1958,H118<1963),VLOOKUP(I118,Feuil2!$F$10:$P$28,6),IF(AND(H118>=1963,H118<1968),VLOOKUP(I118,Feuil2!$F$10:$P$28,5),IF(AND(H118>=1968,H118<1973),VLOOKUP(I118,Feuil2!$F$10:$P$28,4),IF(AND(H118>=1973,H118<1978),VLOOKUP(I118,Feuil2!$F$10:$P$28,3),IF(AND(H118>=1978,H118<1983),VLOOKUP(I118,Feuil2!$F$10:$P$28,2),VLOOKUP(I118,Feuil2!$F$10:$P$28,2))))))))))))","v":{"$error":"#N/A"}},null,{"$f":"T118-HLOOKUP(Y118,Feuil2!$C$1:$CD$9,2,FALSE)","v":{"$error":"#VALUE!"}},{"$f":"T118-HLOOKUP(Y118,Feuil2!$C$1:$CD$9,3,FALSE)","v":{"$error":"#VALUE!"}},{"$f":"T118-HLOOKUP(Y118,Feuil2!$C$1:$CD$9,4,FALSE)","v":{"$error":"#VALUE!"}},{"$f":"T118-HLOOKUP(Y118,Feuil2!$C$1:$CD$9,5,FALSE)","v":{"$error":"#VALUE!"}},{"$f":"T118-HLOOKUP(Y118,Feuil2!$C$1:$CD$9,6,FALSE)","v":{"$error":"#VALUE!"}},{"$f":"T118-HLOOKUP(Y118,Feuil2!$C$1:$CD$9,7,FALSE)","v":{"$error":"#VALUE!"}},{"$f":"T118-HLOOKUP(Y118,Feuil2!$C$1:$CD$9,8,FALSE)","v":{"$error":"#VALUE!"}},{"$f":"T118-HLOOKUP(Y118,Feuil2!$C$1:$CD$9,9,FALSE)","v":{"$error":"#VALUE!"}},null,null,null,null,null,null,null,{"$error":"#VALUE!"},2017,null,{"$f":"IF(AQ118,VLOOKUP(AQ118,HOM!$AS$389:$AT$444,2))","v":4.4930000000000003}]
["H",null,null,null,null,null,null,null,null,null,null,null,null,null,"",null,null,null,"","","","","",false,{"$f":"IF(AND(H119<1920),VLOOKUP(I119,Feuil2!$F$10:$P$28,11),IF(AND(H119>=1920,H119<1939),VLOOKUP(I119,Feuil2!$F$10:$P$28,11),IF(AND(H119>=1938,H119<1943),VLOOKUP(I119,Feuil2!$F$10:$P$28,10),IF(AND(H119>=1943,H119<1948),VLOOKUP(I119,Feuil2!$F$10:$P$28,9),IF(AND(H119>=1948,H119<1953),VLOOKUP(I119,Feuil2!$F$10:$P$28,8),IF(AND(H119>=1953,H119<1958),VLOOKUP(I119,Feuil2!$F$10:$P$28,7),IF(AND(H119>=1958,H119<1963),VLOOKUP(I119,Feuil2!$F$10:$P$28,6),IF(AND(H119>=1963,H119<1968),VLOOKUP(I119,Feuil2!$F$10:$P$28,5),IF(AND(H119>=1968,H119<1973),VLOOKUP(I119,Feuil2!$F$10:$P$28,4),IF(AND(H119>=1973,H119<1978),VLOOKUP(I119,Feuil2!$F$10:$P$28,3),IF(AND(H119>=1978,H119<1983),VLOOKUP(I119,Feuil2!$F$10:$P$28,2),VLOOKUP(I119,Feuil2!$F$10:$P$28,2))))))))))))","v":{"$error":"#N/A"}},null,{"$f":"T119-HLOOKUP(Y119,Feuil2!$C$1:$CD$9,2,FALSE)","v":{"$error":"#VALUE!"}},{"$f":"T119-HLOOKUP(Y119,Feuil2!$C$1:$CD$9,3,FALSE)","v":{"$error":"#VALUE!"}},{"$f":"T119-HLOOKUP(Y119,Feuil2!$C$1:$CD$9,4,FALSE)","v":{"$error":"#VALUE!"}},{"$f":"T119-HLOOKUP(Y119,Feuil2!$C$1:$CD$9,5,FALSE)","v":{"$error":"#VALUE!"}},{"$f":"T119-HLOOKUP(Y119,Feuil2!$C$1:$CD$9,6,FALSE)","v":{"$error":"#VALUE!"}},{"$f":"T119-HLOOKUP(Y119,Feuil2!$C$1:$CD$9,7,FALSE)","v":{"$error":"#VALUE!"}},{"$f":"T119-HLOOKUP(Y119,Feuil2!$C$1:$CD$9,8,FALSE)","v":{"$error":"#VALUE!"}},{"$f":"T119-HLOOKUP(Y119,Feuil2!$C$1:$CD$9,9,FALSE)","v":{"$error":"#VALUE!"}},null,null,null,null,null,null,null,{"$error":"#VALUE!"},2017,null,{"$f":"IF(AQ119,VLOOKUP(AQ119,HOM!$AS$389:$AT$444,2))","v":4.4930000000000003}]
["H",null,null,null,null,null,null,null,null,null,null,null,null,null,"",null,null,null,"","","","","",false,{"$f":"IF(AND(H120<1920),VLOOKUP(I120,Feuil2!$F$10:$P$28,11),IF(AND(H120>=1920,H120<1939),VLOOKUP(I120,Feuil2!$F$10:$P$28,11),IF(AND(H120>=1938,H120<1943),VLOOKUP(I120,Feuil2!$F$10:$P$28,10),IF(AND(H120>=1943,H120<1948),VLOOKUP(I120,Feuil2!$F$10:$P$28,9),IF(AND(H120>=1948,H120<1953),VLOOKUP(I120,Feuil2!$F$10:$P$28,8),IF(AND(H120>=1953,H120<1958),VLOOKUP(I120,Feuil2!$F$10:$P$28,7),IF(AND(H120>=1958,H120<1963),VLOOKUP(I120,Feuil2!$F$10:$P$28,6),IF(AND(H120>=1963,H120<1968),VLOOKUP(I120,Feuil2!$F$10:$P$28,5),IF(AND(H120>=1968,H120<1973),VLOOKUP(I120,Feuil2!$F$10:$P$28,4),IF(AND(H120>=1973,H120<1978),VLOOKUP(I120,Feuil2!$F$10:$P$28,3),IF(AND(H120>=1978,H120<1983),VLOOKUP(I120,Feuil2!$F$10:$P$28,2),VLOOKUP(I120,Feuil2!$F$10:$P$28,2))))))))))))","v":{"$error":"#N/A"}},null,{"$f":"T120-HLOOKUP(Y120,Feuil2!$C$1:$CD$9,2,FALSE)","v":{"$error":"#VALUE!"}},{"$f":"T120-HLOOKUP(Y120,Feuil2!$C$1:$CD$9,3,FALSE)","v":{"$error":"#VALUE!"}},{"$f":"T120-HLOOKUP(Y120,Feuil2!$C$1:$CD$9,4,FALSE)","v":{"$error":"#VALUE!"}},{"$f":"T120-HLOOKUP(Y120,Feuil2!$C$1:$CD$9,5,FALSE)","v":{"$error":"#VALUE!"}},{"$f":"T120-HLOOKUP(Y120,Feuil2!$C$1:$CD$9,6,FALSE)","v":{"$error":"#VALUE!"}},{"$f":"T120-HLOOKUP(Y120,Feuil2!$C$1:$CD$9,7,FALSE)","v":{"$error":"#VALUE!"}},{"$f":"T120-HLOOKUP(Y120,Feuil2!$C$1:$CD$9,8,FALSE)","v":{"$error":"#VALUE!"}},{"$f":"T120-HLOOKUP(Y120,Feuil2!$C$1:$CD$9,9,FALSE)","v":{"$error":"#VALUE!"}},null,null,null,null,null,null,null,{"$error":"#VALUE!"},2017,null,{"$f":"IF(AQ120,VLOOKUP(AQ120,HOM!$AS$389:$AT$444,2))","v":4.4930000000000003}]
["H",null,null,null,null,null,null,null,null,null,null,null,null,null,"",null,null,null,"","","","","",false,{"$f":"IF(AND(H121<1920),VLOOKUP(I121,Feuil2!$F$10:$P$28,11),IF(AND(H121>=1920,H121<1939),VLOOKUP(I121,Feuil2!$F$10:$P$28,11),IF(AND(H121>=1938,H121<1943),VLOOKUP(I121,Feuil2!$F$10:$P$28,10),IF(AND(H121>=1943,H121<1948),VLOOKUP(I121,Feuil2!$F$10:$P$28,9),IF(AND(H121>=1948,H121<1953),VLOOKUP(I121,Feuil2!$F$10:$P$28,8),IF(AND(H121>=1953,H121<1958),VLOOKUP(I121,Feuil2!$F$10:$P$28,7),IF(AND(H121>=1958,H121<1963),VLOOKUP(I121,Feuil2!$F$10:$P$28,6),IF(AND(H121>=1963,H121<1968),VLOOKUP(I121,Feuil2!$F$10:$P$28,5),IF(AND(H121>=1968,H121<1973),VLOOKUP(I121,Feuil2!$F$10:$P$28,4),IF(AND(H121>=1973,H121<1978),VLOOKUP(I121,Feuil2!$F$10:$P$28,3),IF(AND(H121>=1978,H121<1983),VLOOKUP(I121,Feuil2!$F$10:$P$28,2),VLOOKUP(I121,Feuil2!$F$10:$P$28,2))))))))))))","v":{"$error":"#N/A"}},null,{"$f":"T121-HLOOKUP(Y121,Feuil2!$C$1:$CD$9,2,FALSE)","v":{"$error":"#VALUE!"}},{"$f":"T121-HLOOKUP(Y121,Feuil2!$C$1:$CD$9,3,FALSE)","v":{"$error":"#VALUE!"}},{"$f":"T121-HLOOKUP(Y121,Feuil2!$C$1:$CD$9,4,FALSE)","v":{"$error":"#VALUE!"}},{"$f":"T121-HLOOKUP(Y121,Feuil2!$C$1:$CD$9,5,FALSE)","v":{"$error":"#VALUE!"}},{"$f":"T121-HLOOKUP(Y121,Feuil2!$C$1:$CD$9,6,FALSE)","v":{"$error":"#VALUE!"}},{"$f":"T121-HLOOKUP(Y121,Feuil2!$C$1:$CD$9,7,FALSE)","v":{"$error":"#VALUE!"}},{"$f":"T121-HLOOKUP(Y121,Feuil2!$C$1:$CD$9,8,FALSE)","v":{"$error":"#VALUE!"}},{"$f":"T121-HLOOKUP(Y121,Feuil2!$C$1:$CD$9,9,FALSE)","v":{"$error":"#VALUE!"}},null,null,null,null,null,null,null,{"$error":"#VALUE!"},2017,null,{"$f":"IF(AQ121,VLOOKUP(AQ121,HOM!$AS$389:$AT$444,2))","v":4.4930000000000003}]
["H",null,null,null,null,null,null,null,null,null,null,null,null,null,"",null,null,null,"","","","","",false,{"$f":"IF(AND(H122<1920),VLOOKUP(I122,Feuil2!$F$10:$P$28,11),IF(AND(H122>=1920,H122<1939),VLOOKUP(I122,Feuil2!$F$10:$P$28,11),IF(AND(H122>=1938,H122<1943),VLOOKUP(I122,Feuil2!$F$10:$P$28,10),IF(AND(H122>=1943,H122<1948),VLOOKUP(I122,Feuil2!$F$10:$P$28,9),IF(AND(H122>=1948,H122<1953),VLOOKUP(I122,Feuil2!$F$10:$P$28,8),IF(AND(H122>=1953,H122<1958),VLOOKUP(I122,Feuil2!$F$10:$P$28,7),IF(AND(H122>=1958,H122<1963),VLOOKUP(I122,Feuil2!$F$10:$P$28,6),IF(AND(H122>=1963,H122<1968),VLOOKUP(I122,Feuil2!$F$10:$P$28,5),IF(AND(H122>=1968,H122<1973),VLOOKUP(I122,Feuil2!$F$10:$P$28,4),IF(AND(H122>=1973,H122<1978),VLOOKUP(I122,Feuil2!$F$10:$P$28,3),IF(AND(H122>=1978,H122<1983),VLOOKUP(I122,Feuil2!$F$10:$P$28,2),VLOOKUP(I122,Feuil2!$F$10:$P$28,2))))))))))))","v":{"$error":"#N/A"}},null,{"$f":"T122-HLOOKUP(Y122,Feuil2!$C$1:$CD$9,2,FALSE)","v":{"$error":"#VALUE!"}},{"$f":"T122-HLOOKUP(Y122,Feuil2!$C$1:$CD$9,3,FALSE)","v":{"$error":"#VALUE!"}},{"$f":"T122-HLOOKUP(Y122,Feuil2!$C$1:$CD$9,4,FALSE)","v":{"$error":"#VALUE!"}},{"$f":"T122-HLOOKUP(Y122,Feuil2!$C$1:$CD$9,5,FALSE)","v":{"$error":"#VALUE!"}},{"$f":"T122-HLOOKUP(Y122,Feuil2!$C$1:$CD$9,6,FALSE)","v":{"$error":"#VALUE!"}},{"$f":"T122-HLOOKUP(Y122,Feuil2!$C$1:$CD$9,7,FALSE)","v":{"$error":"#VALUE!"}},{"$f":"T122-HLOOKUP(Y122,Feuil2!$C$1:$CD$9,8,FALSE)","v":{"$error":"#VALUE!"}},{"$f":"T122-HLOOKUP(Y122,Feuil2!$C$1:$CD$9,9,FALSE)","v":{"$error":"#VALUE!"}},null,null,null,null,null,null,null,{"$error":"#VALUE!"},2017,null,{"$f":"IF(AQ122,VLOOKUP(AQ122,HOM!$AS$389:$AT$444,2))","v":4.4930000000000003}]
["H",null,null,null,null,null,null,null,null,null,null,null,null,null,"",null,null,null,"","","","","",false,{"$f":"IF(AND(H123<1920),VLOOKUP(I123,Feuil2!$F$10:$P$28,11),IF(AND(H123>=1920,H123<1939),VLOOKUP(I123,Feuil2!$F$10:$P$28,11),IF(AND(H123>=1938,H123<1943),VLOOKUP(I123,Feuil2!$F$10:$P$28,10),IF(AND(H123>=1943,H123<1948),VLOOKUP(I123,Feuil2!$F$10:$P$28,9),IF(AND(H123>=1948,H123<1953),VLOOKUP(I123,Feuil2!$F$10:$P$28,8),IF(AND(H123>=1953,H123<1958),VLOOKUP(I123,Feuil2!$F$10:$P$28,7),IF(AND(H123>=1958,H123<1963),VLOOKUP(I123,Feuil2!$F$10:$P$28,6),IF(AND(H123>=1963,H123<1968),VLOOKUP(I123,Feuil2!$F$10:$P$28,5),IF(AND(H123>=1968,H123<1973),VLOOKUP(I123,Feuil2!$F$10:$P$28,4),IF(AND(H123>=1973,H123<1978),VLOOKUP(I123,Feuil2!$F$10:$P$28,3),IF(AND(H123>=1978,H123<1983),VLOOKUP(I123,Feuil2!$F$10:$P$28,2),VLOOKUP(I123,Feuil2!$F$10:$P$28,2))))))))))))","v":{"$error":"#N/A"}},null,{"$f":"T123-HLOOKUP(Y123,Feuil2!$C$1:$CD$9,2,FALSE)","v":{"$error":"#VALUE!"}},{"$f":"T123-HLOOKUP(Y123,Feuil2!$C$1:$CD$9,3,FALSE)","v":{"$error":"#VALUE!"}},{"$f":"T123-HLOOKUP(Y123,Feuil2!$C$1:$CD$9,4,FALSE)","v":{"$error":"#VALUE!"}},{"$f":"T123-HLOOKUP(Y123,Feuil2!$C$1:$CD$9,5,FALSE)","v":{"$error":"#VALUE!"}},{"$f":"T123-HLOOKUP(Y123,Feuil2!$C$1:$CD$9,6,FALSE)","v":{"$error":"#VALUE!"}},{"$f":"T123-HLOOKUP(Y123,Feuil2!$C$1:$CD$9,7,FALSE)","v":{"$error":"#VALUE!"}},{"$f":"T123-HLOOKUP(Y123,Feuil2!$C$1:$CD$9,8,FALSE)","v":{"$error":"#VALUE!"}},{"$f":"T123-HLOOKUP(Y123,Feuil2!$C$1:$CD$9,9,FALSE)","v":{"$error":"#VALUE!"}},null,null,null,null,null,null,null,{"$error":"#VALUE!"},2017,null,{"$f":"IF(AQ123,VLOOKUP(AQ123,HOM!$AS$389:$AT$444,2))","v":4.4930000000000003}]
["H",null,null,null,null,null,null,null,null,null,null,null,null,null,"",null,null,null,"","","","","",false,{"$f":"IF(AND(H124<1920),VLOOKUP(I124,Feuil2!$F$10:$P$28,11),IF(AND(H124>=1920,H124<1939),VLOOKUP(I124,Feuil2!$F$10:$P$28,11),IF(AND(H124>=1938,H124<1943),VLOOKUP(I124,Feuil2!$F$10:$P$28,10),IF(AND(H124>=1943,H124<1948),VLOOKUP(I124,Feuil2!$F$10:$P$28,9),IF(AND(H124>=1948,H124<1953),VLOOKUP(I124,Feuil2!$F$10:$P$28,8),IF(AND(H124>=1953,H124<1958),VLOOKUP(I124,Feuil2!$F$10:$P$28,7),IF(AND(H124>=1958,H124<1963),VLOOKUP(I124,Feuil2!$F$10:$P$28,6),IF(AND(H124>=1963,H124<1968),VLOOKUP(I124,Feuil2!$F$10:$P$28,5),IF(AND(H124>=1968,H124<1973),VLOOKUP(I124,Feuil2!$F$10:$P$28,4),IF(AND(H124>=1973,H124<1978),VLOOKUP(I124,Feuil2!$F$10:$P$28,3),IF(AND(H124>=1978,H124<1983),VLOOKUP(I124,Feuil2!$F$10:$P$28,2),VLOOKUP(I124,Feuil2!$F$10:$P$28,2))))))))))))","v":{"$error":"#N/A"}},null,{"$f":"T124-HLOOKUP(Y124,Feuil2!$C$1:$CD$9,2,FALSE)","v":{"$error":"#VALUE!"}},{"$f":"T124-HLOOKUP(Y124,Feuil2!$C$1:$CD$9,3,FALSE)","v":{"$error":"#VALUE!"}},{"$f":"T124-HLOOKUP(Y124,Feuil2!$C$1:$CD$9,4,FALSE)","v":{"$error":"#VALUE!"}},{"$f":"T124-HLOOKUP(Y124,Feuil2!$C$1:$CD$9,5,FALSE)","v":{"$error":"#VALUE!"}},{"$f":"T124-HLOOKUP(Y124,Feuil2!$C$1:$CD$9,6,FALSE)","v":{"$error":"#VALUE!"}},{"$f":"T124-HLOOKUP(Y124,Feuil2!$C$1:$CD$9,7,FALSE)","v":{"$error":"#VALUE!"}},{"$f":"T124-HLOOKUP(Y124,Feuil2!$C$1:$CD$9,8,FALSE)","v":{"$error":"#VALUE!"}},{"$f":"T124-HLOOKUP(Y124,Feuil2!$C$1:$CD$9,9,FALSE)","v":{"$error":"#VALUE!"}},null,null,null,null,null,null,null,{"$error":"#VALUE!"},2017,null,{"$f":"IF(AQ124,VLOOKUP(AQ124,HOM!$AS$389:$AT$444,2))","v":4.4930000000000003}]
["H",null,null,null,null,null,null,null,null,null,null,null,null,null,"",null,null,null,"","","","","",false,{"$f":"IF(AND(H125<1920),VLOOKUP(I125,Feuil2!$F$10:$P$28,11),IF(AND(H125>=1920,H125<1939),VLOOKUP(I125,Feuil2!$F$10:$P$28,11),IF(AND(H125>=1938,H125<1943),VLOOKUP(I125,Feuil2!$F$10:$P$28,10),IF(AND(H125>=1943,H125<1948),VLOOKUP(I125,Feuil2!$F$10:$P$28,9),IF(AND(H125>=1948,H125<1953),VLOOKUP(I125,Feuil2!$F$10:$P$28,8),IF(AND(H125>=1953,H125<1958),VLOOKUP(I125,Feuil2!$F$10:$P$28,7),IF(AND(H125>=1958,H125<1963),VLOOKUP(I125,Feuil2!$F$10:$P$28,6),IF(AND(H125>=1963,H125<1968),VLOOKUP(I125,Feuil2!$F$10:$P$28,5),IF(AND(H125>=1968,H125<1973),VLOOKUP(I125,Feuil2!$F$10:$P$28,4),IF(AND(H125>=1973,H125<1978),VLOOKUP(I125,Feuil2!$F$10:$P$28,3),IF(AND(H125>=1978,H125<1983),VLOOKUP(I125,Feuil2!$F$10:$P$28,2),VLOOKUP(I125,Feuil2!$F$10:$P$28,2))))))))))))","v":{"$error":"#N/A"}},null,{"$f":"T125-HLOOKUP(Y125,Feuil2!$C$1:$CD$9,2,FALSE)","v":{"$error":"#VALUE!"}},{"$f":"T125-HLOOKUP(Y125,Feuil2!$C$1:$CD$9,3,FALSE)","v":{"$error":"#VALUE!"}},{"$f":"T125-HLOOKUP(Y125,Feuil2!$C$1:$CD$9,4,FALSE)","v":{"$error":"#VALUE!"}},{"$f":"T125-HLOOKUP(Y125,Feuil2!$C$1:$CD$9,5,FALSE)","v":{"$error":"#VALUE!"}},{"$f":"T125-HLOOKUP(Y125,Feuil2!$C$1:$CD$9,6,FALSE)","v":{"$error":"#VALUE!"}},{"$f":"T125-HLOOKUP(Y125,Feuil2!$C$1:$CD$9,7,FALSE)","v":{"$error":"#VALUE!"}},{"$f":"T125-HLOOKUP(Y125,Feuil2!$C$1:$CD$9,8,FALSE)","v":{"$error":"#VALUE!"}},{"$f":"T125-HLOOKUP(Y125,Feuil2!$C$1:$CD$9,9,FALSE)","v":{"$error":"#VALUE!"}},null,null,null,null,null,null,null,{"$error":"#VALUE!"},2017,null,{"$f":"IF(AQ125,VLOOKUP(AQ125,HOM!$AS$389:$AT$444,2))","v":4.4930000000000003}]
["H",null,null,null,null,null,null,null,null,null,null,null,null,null,"",null,null,null,"","","","","",false,{"$f":"IF(AND(H126<1920),VLOOKUP(I126,Feuil2!$F$10:$P$28,11),IF(AND(H126>=1920,H126<1939),VLOOKUP(I126,Feuil2!$F$10:$P$28,11),IF(AND(H126>=1938,H126<1943),VLOOKUP(I126,Feuil2!$F$10:$P$28,10),IF(AND(H126>=1943,H126<1948),VLOOKUP(I126,Feuil2!$F$10:$P$28,9),IF(AND(H126>=1948,H126<1953),VLOOKUP(I126,Feuil2!$F$10:$P$28,8),IF(AND(H126>=1953,H126<1958),VLOOKUP(I126,Feuil2!$F$10:$P$28,7),IF(AND(H126>=1958,H126<1963),VLOOKUP(I126,Feuil2!$F$10:$P$28,6),IF(AND(H126>=1963,H126<1968),VLOOKUP(I126,Feuil2!$F$10:$P$28,5),IF(AND(H126>=1968,H126<1973),VLOOKUP(I126,Feuil2!$F$10:$P$28,4),IF(AND(H126>=1973,H126<1978),VLOOKUP(I126,Feuil2!$F$10:$P$28,3),IF(AND(H126>=1978,H126<1983),VLOOKUP(I126,Feuil2!$F$10:$P$28,2),VLOOKUP(I126,Feuil2!$F$10:$P$28,2))))))))))))","v":{"$error":"#N/A"}},null,{"$f":"T126-HLOOKUP(Y126,Feuil2!$C$1:$CD$9,2,FALSE)","v":{"$error":"#VALUE!"}},{"$f":"T126-HLOOKUP(Y126,Feuil2!$C$1:$CD$9,3,FALSE)","v":{"$error":"#VALUE!"}},{"$f":"T126-HLOOKUP(Y126,Feuil2!$C$1:$CD$9,4,FALSE)","v":{"$error":"#VALUE!"}},{"$f":"T126-HLOOKUP(Y126,Feuil2!$C$1:$CD$9,5,FALSE)","v":{"$error":"#VALUE!"}},{"$f":"T126-HLOOKUP(Y126,Feuil2!$C$1:$CD$9,6,FALSE)","v":{"$error":"#VALUE!"}},{"$f":"T126-HLOOKUP(Y126,Feuil2!$C$1:$CD$9,7,FALSE)","v":{"$error":"#VALUE!"}},{"$f":"T126-HLOOKUP(Y126,Feuil2!$C$1:$CD$9,8,FALSE)","v":{"$error":"#VALUE!"}},{"$f":"T126-HLOOKUP(Y126,Feuil2!$C$1:$CD$9,9,FALSE)","v":{"$error":"#VALUE!"}},null,null,null,null,null,null,null,{"$error":"#VALUE!"},2017,null,{"$f":"IF(AQ126,VLOOKUP(AQ126,HOM!$AS$389:$AT$444,2))","v":4.4930000000000003}]
["H",null,null,null,null,null,null,null,null,null,null,null,null,null,"",null,null,null,"","","","","",false,{"$f":"IF(AND(H127<1920),VLOOKUP(I127,Feuil2!$F$10:$P$28,11),IF(AND(H127>=1920,H127<1939),VLOOKUP(I127,Feuil2!$F$10:$P$28,11),IF(AND(H127>=1938,H127<1943),VLOOKUP(I127,Feuil2!$F$10:$P$28,10),IF(AND(H127>=1943,H127<1948),VLOOKUP(I127,Feuil2!$F$10:$P$28,9),IF(AND(H127>=1948,H127<1953),VLOOKUP(I127,Feuil2!$F$10:$P$28,8),IF(AND(H127>=1953,H127<1958),VLOOKUP(I127,Feuil2!$F$10:$P$28,7),IF(AND(H127>=1958,H127<1963),VLOOKUP(I127,Feuil2!$F$10:$P$28,6),IF(AND(H127>=1963,H127<1968),VLOOKUP(I127,Feuil2!$F$10:$P$28,5),IF(AND(H127>=1968,H127<1973),VLOOKUP(I127,Feuil2!$F$10:$P$28,4),IF(AND(H127>=1973,H127<1978),VLOOKUP(I127,Feuil2!$F$10:$P$28,3),IF(AND(H127>=1978,H127<1983),VLOOKUP(I127,Feuil2!$F$10:$P$28,2),VLOOKUP(I127,Feuil2!$F$10:$P$28,2))))))))))))","v":{"$error":"#N/A"}},null,{"$f":"T127-HLOOKUP(Y127,Feuil2!$C$1:$CD$9,2,FALSE)","v":{"$error":"#VALUE!"}},{"$f":"T127-HLOOKUP(Y127,Feuil2!$C$1:$CD$9,3,FALSE)","v":{"$error":"#VALUE!"}},{"$f":"T127-HLOOKUP(Y127,Feuil2!$C$1:$CD$9,4,FALSE)","v":{"$error":"#VALUE!"}},{"$f":"T127-HLOOKUP(Y127,Feuil2!$C$1:$CD$9,5,FALSE)","v":{"$error":"#VALUE!"}},{"$f":"T127-HLOOKUP(Y127,Feuil2!$C$1:$CD$9,6,FALSE)","v":{"$error":"#VALUE!"}},{"$f":"T127-HLOOKUP(Y127,Feuil2!$C$1:$CD$9,7,FALSE)","v":{"$error":"#VALUE!"}},{"$f":"T127-HLOOKUP(Y127,Feuil2!$C$1:$CD$9,8,FALSE)","v":{"$error":"#VALUE!"}},{"$f":"T127-HLOOKUP(Y127,Feuil2!$C$1:$CD$9,9,FALSE)","v":{"$error":"#VALUE!"}},null,null,null,null,null,null,null,{"$error":"#VALUE!"},2017,null,{"$f":"IF(AQ127,VLOOKUP(AQ127,HOM!$AS$389:$AT$444,2))","v":4.4930000000000003}]
["H",null,null,null,null,null,null,null,null,null,null,null,null,null,"",null,null,null,"","","","","",false,{"$f":"IF(AND(H128<1920),VLOOKUP(I128,Feuil2!$F$10:$P$28,11),IF(AND(H128>=1920,H128<1939),VLOOKUP(I128,Feuil2!$F$10:$P$28,11),IF(AND(H128>=1938,H128<1943),VLOOKUP(I128,Feuil2!$F$10:$P$28,10),IF(AND(H128>=1943,H128<1948),VLOOKUP(I128,Feuil2!$F$10:$P$28,9),IF(AND(H128>=1948,H128<1953),VLOOKUP(I128,Feuil2!$F$10:$P$28,8),IF(AND(H128>=1953,H128<1958),VLOOKUP(I128,Feuil2!$F$10:$P$28,7),IF(AND(H128>=1958,H128<1963),VLOOKUP(I128,Feuil2!$F$10:$P$28,6),IF(AND(H128>=1963,H128<1968),VLOOKUP(I128,Feuil2!$F$10:$P$28,5),IF(AND(H128>=1968,H128<1973),VLOOKUP(I128,Feuil2!$F$10:$P$28,4),IF(AND(H128>=1973,H128<1978),VLOOKUP(I128,Feuil2!$F$10:$P$28,3),IF(AND(H128>=1978,H128<1983),VLOOKUP(I128,Feuil2!$F$10:$P$28,2),VLOOKUP(I128,Feuil2!$F$10:$P$28,2))))))))))))","v":{"$error":"#N/A"}},null,{"$f":"T128-HLOOKUP(Y128,Feuil2!$C$1:$CD$9,2,FALSE)","v":{"$error":"#VALUE!"}},{"$f":"T128-HLOOKUP(Y128,Feuil2!$C$1:$CD$9,3,FALSE)","v":{"$error":"#VALUE!"}},{"$f":"T128-HLOOKUP(Y128,Feuil2!$C$1:$CD$9,4,FALSE)","v":{"$error":"#VALUE!"}},{"$f":"T128-HLOOKUP(Y128,Feuil2!$C$1:$CD$9,5,FALSE)","v":{"$error":"#VALUE!"}},{"$f":"T128-HLOOKUP(Y128,Feuil2!$C$1:$CD$9,6,FALSE)","v":{"$error":"#VALUE!"}},{"$f":"T128-HLOOKUP(Y128,Feuil2!$C$1:$CD$9,7,FALSE)","v":{"$error":"#VALUE!"}},{"$f":"T128-HLOOKUP(Y128,Feuil2!$C$1:$CD$9,8,FALSE)","v":{"$error":"#VALUE!"}},{"$f":"T128-HLOOKUP(Y128,Feuil2!$C$1:$CD$9,9,FALSE)","v":{"$error":"#VALUE!"}},null,null,null,null,null,null,null,{"$error":"#VALUE!"},2017,null,{"$f":"IF(AQ128,VLOOKUP(AQ128,HOM!$AS$389:$AT$444,2))","v":4.4930000000000003}]
["H",null,null,null,null,null,null,null,null,null,null,null,null,null,"",null,null,null,"","","","","",false,{"$f":"IF(AND(H129<1920),VLOOKUP(I129,Feuil2!$F$10:$P$28,11),IF(AND(H129>=1920,H129<1939),VLOOKUP(I129,Feuil2!$F$10:$P$28,11),IF(AND(H129>=1938,H129<1943),VLOOKUP(I129,Feuil2!$F$10:$P$28,10),IF(AND(H129>=1943,H129<1948),VLOOKUP(I129,Feuil2!$F$10:$P$28,9),IF(AND(H129>=1948,H129<1953),VLOOKUP(I129,Feuil2!$F$10:$P$28,8),IF(AND(H129>=1953,H129<1958),VLOOKUP(I129,Feuil2!$F$10:$P$28,7),IF(AND(H129>=1958,H129<1963),VLOOKUP(I129,Feuil2!$F$10:$P$28,6),IF(AND(H129>=1963,H129<1968),VLOOKUP(I129,Feuil2!$F$10:$P$28,5),IF(AND(H129>=1968,H129<1973),VLOOKUP(I129,Feuil2!$F$10:$P$28,4),IF(AND(H129>=1973,H129<1978),VLOOKUP(I129,Feuil2!$F$10:$P$28,3),IF(AND(H129>=1978,H129<1983),VLOOKUP(I129,Feuil2!$F$10:$P$28,2),VLOOKUP(I129,Feuil2!$F$10:$P$28,2))))))))))))","v":{"$error":"#N/A"}},null,{"$f":"T129-HLOOKUP(Y129,Feuil2!$C$1:$CD$9,2,FALSE)","v":{"$error":"#VALUE!"}},{"$f":"T129-HLOOKUP(Y129,Feuil2!$C$1:$CD$9,3,FALSE)","v":{"$error":"#VALUE!"}},{"$f":"T129-HLOOKUP(Y129,Feuil2!$C$1:$CD$9,4,FALSE)","v":{"$error":"#VALUE!"}},{"$f":"T129-HLOOKUP(Y129,Feuil2!$C$1:$CD$9,5,FALSE)","v":{"$error":"#VALUE!"}},{"$f":"T129-HLOOKUP(Y129,Feuil2!$C$1:$CD$9,6,FALSE)","v":{"$error":"#VALUE!"}},{"$f":"T129-HLOOKUP(Y129,Feuil2!$C$1:$CD$9,7,FALSE)","v":{"$error":"#VALUE!"}},{"$f":"T129-HLOOKUP(Y129,Feuil2!$C$1:$CD$9,8,FALSE)","v":{"$error":"#VALUE!"}},{"$f":"T129-HLOOKUP(Y129,Feuil2!$C$1:$CD$9,9,FALSE)","v":{"$error":"#VALUE!"}},null,null,null,null,null,null,null,{"$error":"#VALUE!"},2017,null,{"$f":"IF(AQ129,VLOOKUP(AQ129,HOM!$AS$389:$AT$444,2))","v":4.4930000000000003}]
["H",null,null,null,null,null,null,null,null,null,null,null,null,null,"",null,null,null,"","","","","",false,{"$f":"IF(AND(H130<1920),VLOOKUP(I130,Feuil2!$F$10:$P$28,11),IF(AND(H130>=1920,H130<1939),VLOOKUP(I130,Feuil2!$F$10:$P$28,11),IF(AND(H130>=1938,H130<1943),VLOOKUP(I130,Feuil2!$F$10:$P$28,10),IF(AND(H130>=1943,H130<1948),VLOOKUP(I130,Feuil2!$F$10:$P$28,9),IF(AND(H130>=1948,H130<1953),VLOOKUP(I130,Feuil2!$F$10:$P$28,8),IF(AND(H130>=1953,H130<1958),VLOOKUP(I130,Feuil2!$F$10:$P$28,7),IF(AND(H130>=1958,H130<1963),VLOOKUP(I130,Feuil2!$F$10:$P$28,6),IF(AND(H130>=1963,H130<1968),VLOOKUP(I130,Feuil2!$F$10:$P$28,5),IF(AND(H130>=1968,H130<1973),VLOOKUP(I130,Feuil2!$F$10:$P$28,4),IF(AND(H130>=1973,H130<1978),VLOOKUP(I130,Feuil2!$F$10:$P$28,3),IF(AND(H130>=1978,H130<1983),VLOOKUP(I130,Feuil2!$F$10:$P$28,2),VLOOKUP(I130,Feuil2!$F$10:$P$28,2))))))))))))","v":{"$error":"#N/A"}},null,{"$f":"T130-HLOOKUP(Y130,Feuil2!$C$1:$CD$9,2,FALSE)","v":{"$error":"#VALUE!"}},{"$f":"T130-HLOOKUP(Y130,Feuil2!$C$1:$CD$9,3,FALSE)","v":{"$error":"#VALUE!"}},{"$f":"T130-HLOOKUP(Y130,Feuil2!$C$1:$CD$9,4,FALSE)","v":{"$error":"#VALUE!"}},{"$f":"T130-HLOOKUP(Y130,Feuil2!$C$1:$CD$9,5,FALSE)","v":{"$error":"#VALUE!"}},{"$f":"T130-HLOOKUP(Y130,Feuil2!$C$1:$CD$9,6,FALSE)","v":{"$error":"#VALUE!"}},{"$f":"T130-HLOOKUP(Y130,Feuil2!$C$1:$CD$9,7,FALSE)","v":{"$error":"#VALUE!"}},{"$f":"T130-HLOOKUP(Y130,Feuil2!$C$1:$CD$9,8,FALSE)","v":{"$error":"#VALUE!"}},{"$f":"T130-HLOOKUP(Y130,Feuil2!$C$1:$CD$9,9,FALSE)","v":{"$error":"#VALUE!"}},null,null,null,null,null,null,null,{"$error":"#VALUE!"},2017,null,{"$f":"IF(AQ130,VLOOKUP(AQ130,HOM!$AS$389:$AT$444,2))","v":4.4930000000000003}]
["H",null,null,null,null,null,null,null,null,null,null,null,null,null,"",null,null,null,"","","","","",false,{"$f":"IF(AND(H131<1920),VLOOKUP(I131,Feuil2!$F$10:$P$28,11),IF(AND(H131>=1920,H131<1939),VLOOKUP(I131,Feuil2!$F$10:$P$28,11),IF(AND(H131>=1938,H131<1943),VLOOKUP(I131,Feuil2!$F$10:$P$28,10),IF(AND(H131>=1943,H131<1948),VLOOKUP(I131,Feuil2!$F$10:$P$28,9),IF(AND(H131>=1948,H131<1953),VLOOKUP(I131,Feuil2!$F$10:$P$28,8),IF(AND(H131>=1953,H131<1958),VLOOKUP(I131,Feuil2!$F$10:$P$28,7),IF(AND(H131>=1958,H131<1963),VLOOKUP(I131,Feuil2!$F$10:$P$28,6),IF(AND(H131>=1963,H131<1968),VLOOKUP(I131,Feuil2!$F$10:$P$28,5),IF(AND(H131>=1968,H131<1973),VLOOKUP(I131,Feuil2!$F$10:$P$28,4),IF(AND(H131>=1973,H131<1978),VLOOKUP(I131,Feuil2!$F$10:$P$28,3),IF(AND(H131>=1978,H131<1983),VLOOKUP(I131,Feuil2!$F$10:$P$28,2),VLOOKUP(I131,Feuil2!$F$10:$P$28,2))))))))))))","v":{"$error":"#N/A"}},null,{"$f":"T131-HLOOKUP(Y131,Feuil2!$C$1:$CD$9,2,FALSE)","v":{"$error":"#VALUE!"}},{"$f":"T131-HLOOKUP(Y131,Feuil2!$C$1:$CD$9,3,FALSE)","v":{"$error":"#VALUE!"}},{"$f":"T131-HLOOKUP(Y131,Feuil2!$C$1:$CD$9,4,FALSE)","v":{"$error":"#VALUE!"}},{"$f":"T131-HLOOKUP(Y131,Feuil2!$C$1:$CD$9,5,FALSE)","v":{"$error":"#VALUE!"}},{"$f":"T131-HLOOKUP(Y131,Feuil2!$C$1:$CD$9,6,FALSE)","v":{"$error":"#VALUE!"}},{"$f":"T131-HLOOKUP(Y131,Feuil2!$C$1:$CD$9,7,FALSE)","v":{"$error":"#VALUE!"}},{"$f":"T131-HLOOKUP(Y131,Feuil2!$C$1:$CD$9,8,FALSE)","v":{"$error":"#VALUE!"}},{"$f":"T131-HLOOKUP(Y131,Feuil2!$C$1:$CD$9,9,FALSE)","v":{"$error":"#VALUE!"}},null,null,null,null,null,null,null,{"$error":"#VALUE!"},2017,null,{"$f":"IF(AQ131,VLOOKUP(AQ131,HOM!$AS$389:$AT$444,2))","v":4.4930000000000003}]
["H",null,null,null,null,null,null,null,null,null,null,null,null,null,"",null,null,null,"","","","","",false,{"$f":"IF(AND(H132<1920),VLOOKUP(I132,Feuil2!$F$10:$P$28,11),IF(AND(H132>=1920,H132<1939),VLOOKUP(I132,Feuil2!$F$10:$P$28,11),IF(AND(H132>=1938,H132<1943),VLOOKUP(I132,Feuil2!$F$10:$P$28,10),IF(AND(H132>=1943,H132<1948),VLOOKUP(I132,Feuil2!$F$10:$P$28,9),IF(AND(H132>=1948,H132<1953),VLOOKUP(I132,Feuil2!$F$10:$P$28,8),IF(AND(H132>=1953,H132<1958),VLOOKUP(I132,Feuil2!$F$10:$P$28,7),IF(AND(H132>=1958,H132<1963),VLOOKUP(I132,Feuil2!$F$10:$P$28,6),IF(AND(H132>=1963,H132<1968),VLOOKUP(I132,Feuil2!$F$10:$P$28,5),IF(AND(H132>=1968,H132<1973),VLOOKUP(I132,Feuil2!$F$10:$P$28,4),IF(AND(H132>=1973,H132<1978),VLOOKUP(I132,Feuil2!$F$10:$P$28,3),IF(AND(H132>=1978,H132<1983),VLOOKUP(I132,Feuil2!$F$10:$P$28,2),VLOOKUP(I132,Feuil2!$F$10:$P$28,2))))))))))))","v":{"$error":"#N/A"}},null,{"$f":"T132-HLOOKUP(Y132,Feuil2!$C$1:$CD$9,2,FALSE)","v":{"$error":"#VALUE!"}},{"$f":"T132-HLOOKUP(Y132,Feuil2!$C$1:$CD$9,3,FALSE)","v":{"$error":"#VALUE!"}},{"$f":"T132-HLOOKUP(Y132,Feuil2!$C$1:$CD$9,4,FALSE)","v":{"$error":"#VALUE!"}},{"$f":"T132-HLOOKUP(Y132,Feuil2!$C$1:$CD$9,5,FALSE)","v":{"$error":"#VALUE!"}},{"$f":"T132-HLOOKUP(Y132,Feuil2!$C$1:$CD$9,6,FALSE)","v":{"$error":"#VALUE!"}},{"$f":"T132-HLOOKUP(Y132,Feuil2!$C$1:$CD$9,7,FALSE)","v":{"$error":"#VALUE!"}},{"$f":"T132-HLOOKUP(Y132,Feuil2!$C$1:$CD$9,8,FALSE)","v":{"$error":"#VALUE!"}},{"$f":"T132-HLOOKUP(Y132,Feuil2!$C$1:$CD$9,9,FALSE)","v":{"$error":"#VALUE!"}},null,null,null,null,null,null,null,{"$error":"#VALUE!"},2017,null,{"$f":"IF(AQ132,VLOOKUP(AQ132,HOM!$AS$389:$AT$444,2))","v":4.4930000000000003}]
["H",null,null,null,null,null,null,null,null,null,null,null,null,null,"",null,null,null,"","","","","",false,{"$f":"IF(AND(H133<1920),VLOOKUP(I133,Feuil2!$F$10:$P$28,11),IF(AND(H133>=1920,H133<1939),VLOOKUP(I133,Feuil2!$F$10:$P$28,11),IF(AND(H133>=1938,H133<1943),VLOOKUP(I133,Feuil2!$F$10:$P$28,10),IF(AND(H133>=1943,H133<1948),VLOOKUP(I133,Feuil2!$F$10:$P$28,9),IF(AND(H133>=1948,H133<1953),VLOOKUP(I133,Feuil2!$F$10:$P$28,8),IF(AND(H133>=1953,H133<1958),VLOOKUP(I133,Feuil2!$F$10:$P$28,7),IF(AND(H133>=1958,H133<1963),VLOOKUP(I133,Feuil2!$F$10:$P$28,6),IF(AND(H133>=1963,H133<1968),VLOOKUP(I133,Feuil2!$F$10:$P$28,5),IF(AND(H133>=1968,H133<1973),VLOOKUP(I133,Feuil2!$F$10:$P$28,4),IF(AND(H133>=1973,H133<1978),VLOOKUP(I133,Feuil2!$F$10:$P$28,3),IF(AND(H133>=1978,H133<1983),VLOOKUP(I133,Feuil2!$F$10:$P$28,2),VLOOKUP(I133,Feuil2!$F$10:$P$28,2))))))))))))","v":{"$error":"#N/A"}},null,{"$f":"T133-HLOOKUP(Y133,Feuil2!$C$1:$CD$9,2,FALSE)","v":{"$error":"#VALUE!"}},{"$f":"T133-HLOOKUP(Y133,Feuil2!$C$1:$CD$9,3,FALSE)","v":{"$error":"#VALUE!"}},{"$f":"T133-HLOOKUP(Y133,Feuil2!$C$1:$CD$9,4,FALSE)","v":{"$error":"#VALUE!"}},{"$f":"T133-HLOOKUP(Y133,Feuil2!$C$1:$CD$9,5,FALSE)","v":{"$error":"#VALUE!"}},{"$f":"T133-HLOOKUP(Y133,Feuil2!$C$1:$CD$9,6,FALSE)","v":{"$error":"#VALUE!"}},{"$f":"T133-HLOOKUP(Y133,Feuil2!$C$1:$CD$9,7,FALSE)","v":{"$error":"#VALUE!"}},{"$f":"T133-HLOOKUP(Y133,Feuil2!$C$1:$CD$9,8,FALSE)","v":{"$error":"#VALUE!"}},{"$f":"T133-HLOOKUP(Y133,Feuil2!$C$1:$CD$9,9,FALSE)","v":{"$error":"#VALUE!"}},null,null,null,null,null,null,null,{"$error":"#VALUE!"},2017,null,{"$f":"IF(AQ133,VLOOKUP(AQ133,HOM!$AS$389:$AT$444,2))","v":4.4930000000000003}]
["H",null,null,null,null,null,null,null,null,null,null,null,null,null,"",null,null,null,{"$f":"IF(I134=\"\",\"\",IF(MAXA(P134:R134)<=0,0,MAXA(P134:R134)))","v":""},{"$f":"IF(I134=\"\",\"\",IF(OR(O134=0,S134=0),0,O134+S134))","v":""},{"$f":"IF(I134=\"\",\"\",IF(A134=\"H\",10^(0.794358141*LOG(I134/174.393)^2)*T134*AS134,IF(A134=\"F\",10^(0.89726074 * LOG(I134/148.026)^2)*T134*AS134,\"\")))","v":""},{"$f":"IF(I134=\"\",\"\",AP134)","v":""},{"$f":"IF(I134=\"\",\"\",IF(AH134>=0,AH134,IF(AG134>=0,AG134,IF(AF134>=0,AF134,IF(AE134>=0,AE134,IF(AD134>=0,AD134,IF(AC134>=0,AC134,IF(AB134>=0,AB134,AA134))))))))","v":""},{"$f":"IF(AQ134<95,IF(AQ134<=90,VLOOKUP(AQ134,$AQ$255:$AR$444,2)))","v":false},{"$f":"IF(AND(H134<1920),VLOOKUP(I134,Feuil2!$F$10:$P$28,11),IF(AND(H134>=1920,H134<1939),VLOOKUP(I134,Feuil2!$F$10:$P$28,11),IF(AND(H134>=1938,H134<1943),VLOOKUP(I134,Feuil2!$F$10:$P$28,10),IF(AND(H134>=1943,H134<1948),VLOOKUP(I134,Feuil2!$F$10:$P$28,9),IF(AND(H134>=1948,H134<1953),VLOOKUP(I134,Feuil2!$F$10:$P$28,8),IF(AND(H134>=1953,H134<1958),VLOOKUP(I134,Feuil2!$F$10:$P$28,7),IF(AND(H134>=1958,H134<1963),VLOOKUP(I134,Feuil2!$F$10:$P$28,6),IF(AND(H134>=1963,H134<1968),VLOOKUP(I134,Feuil2!$F$10:$P$28,5),IF(AND(H134>=1968,H134<1973),VLOOKUP(I134,Feuil2!$F$10:$P$28,4),IF(AND(H134>=1973,H134<1978),VLOOKUP(I134,Feuil2!$F$10:$P$28,3),IF(AND(H134>=1978,H134<1983),VLOOKUP(I134,Feuil2!$F$10:$P$28,2),VLOOKUP(I134,Feuil2!$F$10:$P$28,2))))))))))))","v":{"$error":"#N/A"}},null,{"$f":"T134-HLOOKUP(Y134,Feuil2!$C$1:$CD$9,2,FALSE)","v":{"$error":"#VALUE!"}},{"$f":"T134-HLOOKUP(Y134,Feuil2!$C$1:$CD$9,3,FALSE)","v":{"$error":"#VALUE!"}},{"$f":"T134-HLOOKUP(Y134,Feuil2!$C$1:$CD$9,4,FALSE)","v":{"$error":"#VALUE!"}},{"$f":"T134-HLOOKUP(Y134,Feuil2!$C$1:$CD$9,5,FALSE)","v":{"$error":"#VALUE!"}},{"$f":"T134-HLOOKUP(Y134,Feuil2!$C$1:$CD$9,6,FALSE)","v":{"$error":"#VALUE!"}},{"$f":"T134-HLOOKUP(Y134,Feuil2!$C$1:$CD$9,7,FALSE)","v":{"$error":"#VALUE!"}},{"$f":"T134-HLOOKUP(Y134,Feuil2!$C$1:$CD$9,8,FALSE)","v":{"$error":"#VALUE!"}},{"$f":"T134-HLOOKUP(Y134,Feuil2!$C$1:$CD$9,9,FALSE)","v":{"$error":"#VALUE!"}},null,null,null,null,null,null,null,{"$f":"IF(AH134>=0,$AH$5,IF(AG134>=0,$AG$5,IF(AF134>=0,$AF$5,IF(AE134>=0,$AE$5,IF(AD134>=0,$AD$5,IF(AC134>=0,$AC$5,IF(AB134>=0,$AB$5,IF(AA134>=0,$AA$5,$AI$5))))))))","v":{"$error":"#VALUE!"}},{"$f":"2017-H134","v":2017},null,{"$f":"IF(AQ134,VLOOKUP(AQ134,HOM!$AS$389:$AT$444,2))","v":4.4930000000000003}]
["H",null,null,null,null,null,null,null,null,null,null,null,null,null,{"$f":"IF(I135=\"\",\"\",IF(MAXA(L135:N135)<=0,0,MAXA(L135:N135)))","v":""},null,null,null,"","","","","",false,{"$f":"IF(AND(H135<1920),VLOOKUP(I135,Feuil2!$F$10:$P$28,11),IF(AND(H135>=1920,H135<1939),VLOOKUP(I135,Feuil2!$F$10:$P$28,11),IF(AND(H135>=1938,H135<1943),VLOOKUP(I135,Feuil2!$F$10:$P$28,10),IF(AND(H135>=1943,H135<1948),VLOOKUP(I135,Feuil2!$F$10:$P$28,9),IF(AND(H135>=1948,H135<1953),VLOOKUP(I135,Feuil2!$F$10:$P$28,8),IF(AND(H135>=1953,H135<1958),VLOOKUP(I135,Feuil2!$F$10:$P$28,7),IF(AND(H135>=1958,H135<1963),VLOOKUP(I135,Feuil2!$F$10:$P$28,6),IF(AND(H135>=1963,H135<1968),VLOOKUP(I135,Feuil2!$F$10:$P$28,5),IF(AND(H135>=1968,H135<1973),VLOOKUP(I135,Feuil2!$F$10:$P$28,4),IF(AND(H135>=1973,H135<1978),VLOOKUP(I135,Feuil2!$F$10:$P$28,3),IF(AND(H135>=1978,H135<1983),VLOOKUP(I135,Feuil2!$F$10:$P$28,2),VLOOKUP(I135,Feuil2!$F$10:$P$28,2))))))))))))","v":{"$error":"#N/A"}},null,{"$f":"T135-HLOOKUP(Y135,Feuil2!$C$1:$CD$9,2,FALSE)","v":{"$error":"#VALUE!"}},{"$f":"T135-HLOOKUP(Y135,Feuil2!$C$1:$CD$9,3,FALSE)","v":{"$error":"#VALUE!"}},{"$f":"T135-HLOOKUP(Y135,Feuil2!$C$1:$CD$9,4,FALSE)","v":{"$error":"#VALUE!"}},{"$f":"T135-HLOOKUP(Y135,Feuil2!$C$1:$CD$9,5,FALSE)","v":{"$error":"#VALUE!"}},{"$f":"T135-HLOOKUP(Y135,Feuil2!$C$1:$CD$9,6,FALSE)","v":{"$error":"#VALUE!"}},{"$f":"T135-HLOOKUP(Y135,Feuil2!$C$1:$CD$9,7,FALSE)","v":{"$error":"#VALUE!"}},{"$f":"T135-HLOOKUP(Y135,Feuil2!$C$1:$CD$9,8,FALSE)","v":{"$error":"#VALUE!"}},{"$f":"T135-HLOOKUP(Y135,Feuil2!$C$1:$CD$9,9,FALSE)","v":{"$error":"#VALUE!"}},null,null,null,null,null,null,null,{"$error":"#VALUE!"},2017,null,{"$f":"IF(AQ135,VLOOKUP(AQ135,HOM!$AS$389:$AT$444,2))","v":4.4930000000000003}]
["H",null,null,null,null,null,null,null,null,null,null,null,null,null,"",null,null,null,"","","","","",false,{"$f":"IF(AND(H136<1920),VLOOKUP(I136,Feuil2!$F$10:$P$28,11),IF(AND(H136>=1920,H136<1939),VLOOKUP(I136,Feuil2!$F$10:$P$28,11),IF(AND(H136>=1938,H136<1943),VLOOKUP(I136,Feuil2!$F$10:$P$28,10),IF(AND(H136>=1943,H136<1948),VLOOKUP(I136,Feuil2!$F$10:$P$28,9),IF(AND(H136>=1948,H136<1953),VLOOKUP(I136,Feuil2!$F$10:$P$28,8),IF(AND(H136>=1953,H136<1958),VLOOKUP(I136,Feuil2!$F$10:$P$28,7),IF(AND(H136>=1958,H136<1963),VLOOKUP(I136,Feuil2!$F$10:$P$28,6),IF(AND(H136>=1963,H136<1968),VLOOKUP(I136,Feuil2!$F$10:$P$28,5),IF(AND(H136>=1968,H136<1973),VLOOKUP(I136,Feuil2!$F$10:$P$28,4),IF(AND(H136>=1973,H136<1978),VLOOKUP(I136,Feuil2!$F$10:$P$28,3),IF(AND(H136>=1978,H136<1983),VLOOKUP(I136,Feuil2!$F$10:$P$28,2),VLOOKUP(I136,Feuil2!$F$10:$P$28,2))))))))))))","v":{"$error":"#N/A"}},null,{"$f":"T136-HLOOKUP(Y136,Feuil2!$C$1:$CD$9,2,FALSE)","v":{"$error":"#VALUE!"}},{"$f":"T136-HLOOKUP(Y136,Feuil2!$C$1:$CD$9,3,FALSE)","v":{"$error":"#VALUE!"}},{"$f":"T136-HLOOKUP(Y136,Feuil2!$C$1:$CD$9,4,FALSE)","v":{"$error":"#VALUE!"}},{"$f":"T136-HLOOKUP(Y136,Feuil2!$C$1:$CD$9,5,FALSE)","v":{"$error":"#VALUE!"}},{"$f":"T136-HLOOKUP(Y136,Feuil2!$C$1:$CD$9,6,FALSE)","v":{"$error":"#VALUE!"}},{"$f":"T136-HLOOKUP(Y136,Feuil2!$C$1:$CD$9,7,FALSE)","v":{"$error":"#VALUE!"}},{"$f":"T136-HLOOKUP(Y136,Feuil2!$C$1:$CD$9,8,FALSE)","v":{"$error":"#VALUE!"}},{"$f":"T136-HLOOKUP(Y136,Feuil2!$C$1:$CD$9,9,FALSE)","v":{"$error":"#VALUE!"}},null,null,null,null,null,null,null,{"$error":"#VALUE!"},2017,null,{"$f":"IF(AQ136,VLOOKUP(AQ136,HOM!$AS$389:$AT$444,2))","v":4.4930000000000003}]
["H",null,null,null,null,null,null,null,null,null,null,null,null,null,"",null,null,null,"","","","","",false,{"$f":"IF(AND(H137<1920),VLOOKUP(I137,Feuil2!$F$10:$P$28,11),IF(AND(H137>=1920,H137<1939),VLOOKUP(I137,Feuil2!$F$10:$P$28,11),IF(AND(H137>=1938,H137<1943),VLOOKUP(I137,Feuil2!$F$10:$P$28,10),IF(AND(H137>=1943,H137<1948),VLOOKUP(I137,Feuil2!$F$10:$P$28,9),IF(AND(H137>=1948,H137<1953),VLOOKUP(I137,Feuil2!$F$10:$P$28,8),IF(AND(H137>=1953,H137<1958),VLOOKUP(I137,Feuil2!$F$10:$P$28,7),IF(AND(H137>=1958,H137<1963),VLOOKUP(I137,Feuil2!$F$10:$P$28,6),IF(AND(H137>=1963,H137<1968),VLOOKUP(I137,Feuil2!$F$10:$P$28,5),IF(AND(H137>=1968,H137<1973),VLOOKUP(I137,Feuil2!$F$10:$P$28,4),IF(AND(H137>=1973,H137<1978),VLOOKUP(I137,Feuil2!$F$10:$P$28,3),IF(AND(H137>=1978,H137<1983),VLOOKUP(I137,Feuil2!$F$10:$P$28,2),VLOOKUP(I137,Feuil2!$F$10:$P$28,2))))))))))))","v":{"$error":"#N/A"}},null,{"$f":"T137-HLOOKUP(Y137,Feuil2!$C$1:$CD$9,2,FALSE)","v":{"$error":"#VALUE!"}},{"$f":"T137-HLOOKUP(Y137,Feuil2!$C$1:$CD$9,3,FALSE)","v":{"$error":"#VALUE!"}},{"$f":"T137-HLOOKUP(Y137,Feuil2!$C$1:$CD$9,4,FALSE)","v":{"$error":"#VALUE!"}},{"$f":"T137-HLOOKUP(Y137,Feuil2!$C$1:$CD$9,5,FALSE)","v":{"$error":"#VALUE!"}},{"$f":"T137-HLOOKUP(Y137,Feuil2!$C$1:$CD$9,6,FALSE)","v":{"$error":"#VALUE!"}},{"$f":"T137-HLOOKUP(Y137,Feuil2!$C$1:$CD$9,7,FALSE)","v":{"$error":"#VALUE!"}},{"$f":"T137-HLOOKUP(Y137,Feuil2!$C$1:$CD$9,8,FALSE)","v":{"$error":"#VALUE!"}},{"$f":"T137-HLOOKUP(Y137,Feuil2!$C$1:$CD$9,9,FALSE)","v":{"$error":"#VALUE!"}},null,null,null,null,null,null,null,{"$error":"#VALUE!"},2017,null,{"$f":"IF(AQ137,VLOOKUP(AQ137,HOM!$AS$389:$AT$444,2))","v":4.4930000000000003}]
["H",null,null,null,null,null,null,null,null,null,null,null,null,null,"",null,null,null,"","","","","",false,{"$f":"IF(AND(H138<1920),VLOOKUP(I138,Feuil2!$F$10:$P$28,11),IF(AND(H138>=1920,H138<1939),VLOOKUP(I138,Feuil2!$F$10:$P$28,11),IF(AND(H138>=1938,H138<1943),VLOOKUP(I138,Feuil2!$F$10:$P$28,10),IF(AND(H138>=1943,H138<1948),VLOOKUP(I138,Feuil2!$F$10:$P$28,9),IF(AND(H138>=1948,H138<1953),VLOOKUP(I138,Feuil2!$F$10:$P$28,8),IF(AND(H138>=1953,H138<1958),VLOOKUP(I138,Feuil2!$F$10:$P$28,7),IF(AND(H138>=1958,H138<1963),VLOOKUP(I138,Feuil2!$F$10:$P$28,6),IF(AND(H138>=1963,H138<1968),VLOOKUP(I138,Feuil2!$F$10:$P$28,5),IF(AND(H138>=1968,H138<1973),VLOOKUP(I138,Feuil2!$F$10:$P$28,4),IF(AND(H138>=1973,H138<1978),VLOOKUP(I138,Feuil2!$F$10:$P$28,3),IF(AND(H138>=1978,H138<1983),VLOOKUP(I138,Feuil2!$F$10:$P$28,2),VLOOKUP(I138,Feuil2!$F$10:$P$28,2))))))))))))","v":{"$error":"#N/A"}},null,{"$f":"T138-HLOOKUP(Y138,Feuil2!$C$1:$CD$9,2,FALSE)","v":{"$error":"#VALUE!"}},{"$f":"T138-HLOOKUP(Y138,Feuil2!$C$1:$CD$9,3,FALSE)","v":{"$error":"#VALUE!"}},{"$f":"T138-HLOOKUP(Y138,Feuil2!$C$1:$CD$9,4,FALSE)","v":{"$error":"#VALUE!"}},{"$f":"T138-HLOOKUP(Y138,Feuil2!$C$1:$CD$9,5,FALSE)","v":{"$error":"#VALUE!"}},{"$f":"T138-HLOOKUP(Y138,Feuil2!$C$1:$CD$9,6,FALSE)","v":{"$error":"#VALUE!"}},{"$f":"T138-HLOOKUP(Y138,Feuil2!$C$1:$CD$9,7,FALSE)","v":{"$error":"#VALUE!"}},{"$f":"T138-HLOOKUP(Y138,Feuil2!$C$1:$CD$9,8,FALSE)","v":{"$error":"#VALUE!"}},{"$f":"T138-HLOOKUP(Y138,Feuil2!$C$1:$CD$9,9,FALSE)","v":{"$error":"#VALUE!"}},null,null,null,null,null,null,null,{"$error":"#VALUE!"},2017,null,{"$f":"IF(AQ138,VLOOKUP(AQ138,HOM!$AS$389:$AT$444,2))","v":4.4930000000000003}]
["H",null,null,null,null,null,null,null,null,null,null,null,null,null,"",null,null,null,"","","","","",false,{"$f":"IF(AND(H139<1920),VLOOKUP(I139,Feuil2!$F$10:$P$28,11),IF(AND(H139>=1920,H139<1939),VLOOKUP(I139,Feuil2!$F$10:$P$28,11),IF(AND(H139>=1938,H139<1943),VLOOKUP(I139,Feuil2!$F$10:$P$28,10),IF(AND(H139>=1943,H139<1948),VLOOKUP(I139,Feuil2!$F$10:$P$28,9),IF(AND(H139>=1948,H139<1953),VLOOKUP(I139,Feuil2!$F$10:$P$28,8),IF(AND(H139>=1953,H139<1958),VLOOKUP(I139,Feuil2!$F$10:$P$28,7),IF(AND(H139>=1958,H139<1963),VLOOKUP(I139,Feuil2!$F$10:$P$28,6),IF(AND(H139>=1963,H139<1968),VLOOKUP(I139,Feuil2!$F$10:$P$28,5),IF(AND(H139>=1968,H139<1973),VLOOKUP(I139,Feuil2!$F$10:$P$28,4),IF(AND(H139>=1973,H139<1978),VLOOKUP(I139,Feuil2!$F$10:$P$28,3),IF(AND(H139>=1978,H139<1983),VLOOKUP(I139,Feuil2!$F$10:$P$28,2),VLOOKUP(I139,Feuil2!$F$10:$P$28,2))))))))))))","v":{"$error":"#N/A"}},null,{"$f":"T139-HLOOKUP(Y139,Feuil2!$C$1:$CD$9,2,FALSE)","v":{"$error":"#VALUE!"}},{"$f":"T139-HLOOKUP(Y139,Feuil2!$C$1:$CD$9,3,FALSE)","v":{"$error":"#VALUE!"}},{"$f":"T139-HLOOKUP(Y139,Feuil2!$C$1:$CD$9,4,FALSE)","v":{"$error":"#VALUE!"}},{"$f":"T139-HLOOKUP(Y139,Feuil2!$C$1:$CD$9,5,FALSE)","v":{"$error":"#VALUE!"}},{"$f":"T139-HLOOKUP(Y139,Feuil2!$C$1:$CD$9,6,FALSE)","v":{"$error":"#VALUE!"}},{"$f":"T139-HLOOKUP(Y139,Feuil2!$C$1:$CD$9,7,FALSE)","v":{"$error":"#VALUE!"}},{"$f":"T139-HLOOKUP(Y139,Feuil2!$C$1:$CD$9,8,FALSE)","v":{"$error":"#VALUE!"}},{"$f":"T139-HLOOKUP(Y139,Feuil2!$C$1:$CD$9,9,FALSE)","v":{"$error":"#VALUE!"}},null,null,null,null,null,null,null,{"$error":"#VALUE!"},2017,null,{"$f":"IF(AQ139,VLOOKUP(AQ139,HOM!$AS$389:$AT$444,2))","v":4.4930000000000003}]
["H",null,null,null,null,null,null,null,null,null,null,null,null,null,"",null,null,null,"","","","","",false,{"$f":"IF(AND(H140<1920),VLOOKUP(I140,Feuil2!$F$10:$P$28,11),IF(AND(H140>=1920,H140<1939),VLOOKUP(I140,Feuil2!$F$10:$P$28,11),IF(AND(H140>=1938,H140<1943),VLOOKUP(I140,Feuil2!$F$10:$P$28,10),IF(AND(H140>=1943,H140<1948),VLOOKUP(I140,Feuil2!$F$10:$P$28,9),IF(AND(H140>=1948,H140<1953),VLOOKUP(I140,Feuil2!$F$10:$P$28,8),IF(AND(H140>=1953,H140<1958),VLOOKUP(I140,Feuil2!$F$10:$P$28,7),IF(AND(H140>=1958,H140<1963),VLOOKUP(I140,Feuil2!$F$10:$P$28,6),IF(AND(H140>=1963,H140<1968),VLOOKUP(I140,Feuil2!$F$10:$P$28,5),IF(AND(H140>=1968,H140<1973),VLOOKUP(I140,Feuil2!$F$10:$P$28,4),IF(AND(H140>=1973,H140<1978),VLOOKUP(I140,Feuil2!$F$10:$P$28,3),IF(AND(H140>=1978,H140<1983),VLOOKUP(I140,Feuil2!$F$10:$P$28,2),VLOOKUP(I140,Feuil2!$F$10:$P$28,2))))))))))))","v":{"$error":"#N/A"}},null,{"$f":"T140-HLOOKUP(Y140,Feuil2!$C$1:$CD$9,2,FALSE)","v":{"$error":"#VALUE!"}},{"$f":"T140-HLOOKUP(Y140,Feuil2!$C$1:$CD$9,3,FALSE)","v":{"$error":"#VALUE!"}},{"$f":"T140-HLOOKUP(Y140,Feuil2!$C$1:$CD$9,4,FALSE)","v":{"$error":"#VALUE!"}},{"$f":"T140-HLOOKUP(Y140,Feuil2!$C$1:$CD$9,5,FALSE)","v":{"$error":"#VALUE!"}},{"$f":"T140-HLOOKUP(Y140,Feuil2!$C$1:$CD$9,6,FALSE)","v":{"$error":"#VALUE!"}},{"$f":"T140-HLOOKUP(Y140,Feuil2!$C$1:$CD$9,7,FALSE)","v":{"$error":"#VALUE!"}},{"$f":"T140-HLOOKUP(Y140,Feuil2!$C$1:$CD$9,8,FALSE)","v":{"$error":"#VALUE!"}},{"$f":"T140-HLOOKUP(Y140,Feuil2!$C$1:$CD$9,9,FALSE)","v":{"$error":"#VALUE!"}},null,null,null,null,null,null,null,{"$error":"#VALUE!"},2017,null,{"$f":"IF(AQ140,VLOOKUP(AQ140,HOM!$AS$389:$AT$444,2))","v":4.4930000000000003}]
["H",null,null,null,null,null,null,null,null,null,null,null,null,null,"",null,null,null,"","","","","",false,{"$f":"IF(AND(H141<1920),VLOOKUP(I141,Feuil2!$F$10:$P$28,11),IF(AND(H141>=1920,H141<1939),VLOOKUP(I141,Feuil2!$F$10:$P$28,11),IF(AND(H141>=1938,H141<1943),VLOOKUP(I141,Feuil2!$F$10:$P$28,10),IF(AND(H141>=1943,H141<1948),VLOOKUP(I141,Feuil2!$F$10:$P$28,9),IF(AND(H141>=1948,H141<1953),VLOOKUP(I141,Feuil2!$F$10:$P$28,8),IF(AND(H141>=1953,H141<1958),VLOOKUP(I141,Feuil2!$F$10:$P$28,7),IF(AND(H141>=1958,H141<1963),VLOOKUP(I141,Feuil2!$F$10:$P$28,6),IF(AND(H141>=1963,H141<1968),VLOOKUP(I141,Feuil2!$F$10:$P$28,5),IF(AND(H141>=1968,H141<1973),VLOOKUP(I141,Feuil2!$F$10:$P$28,4),IF(AND(H141>=1973,H141<1978),VLOOKUP(I141,Feuil2!$F$10:$P$28,3),IF(AND(H141>=1978,H141<1983),VLOOKUP(I141,Feuil2!$F$10:$P$28,2),VLOOKUP(I141,Feuil2!$F$10:$P$28,2))))))))))))","v":{"$error":"#N/A"}},null,{"$f":"T141-HLOOKUP(Y141,Feuil2!$C$1:$CD$9,2,FALSE)","v":{"$error":"#VALUE!"}},{"$f":"T141-HLOOKUP(Y141,Feuil2!$C$1:$CD$9,3,FALSE)","v":{"$error":"#VALUE!"}},{"$f":"T141-HLOOKUP(Y141,Feuil2!$C$1:$CD$9,4,FALSE)","v":{"$error":"#VALUE!"}},{"$f":"T141-HLOOKUP(Y141,Feuil2!$C$1:$CD$9,5,FALSE)","v":{"$error":"#VALUE!"}},{"$f":"T141-HLOOKUP(Y141,Feuil2!$C$1:$CD$9,6,FALSE)","v":{"$error":"#VALUE!"}},{"$f":"T141-HLOOKUP(Y141,Feuil2!$C$1:$CD$9,7,FALSE)","v":{"$error":"#VALUE!"}},{"$f":"T141-HLOOKUP(Y141,Feuil2!$C$1:$CD$9,8,FALSE)","v":{"$error":"#VALUE!"}},{"$f":"T141-HLOOKUP(Y141,Feuil2!$C$1:$CD$9,9,FALSE)","v":{"$error":"#VALUE!"}},null,null,null,null,null,null,null,{"$error":"#VALUE!"},2017,null,{"$f":"IF(AQ141,VLOOKUP(AQ141,HOM!$AS$389:$AT$444,2))","v":4.4930000000000003}]
["H",null,null,null,null,null,null,null,null,null,null,null,null,null,"",null,null,null,"","","","","",false,{"$f":"IF(AND(H142<1920),VLOOKUP(I142,Feuil2!$F$10:$P$28,11),IF(AND(H142>=1920,H142<1939),VLOOKUP(I142,Feuil2!$F$10:$P$28,11),IF(AND(H142>=1938,H142<1943),VLOOKUP(I142,Feuil2!$F$10:$P$28,10),IF(AND(H142>=1943,H142<1948),VLOOKUP(I142,Feuil2!$F$10:$P$28,9),IF(AND(H142>=1948,H142<1953),VLOOKUP(I142,Feuil2!$F$10:$P$28,8),IF(AND(H142>=1953,H142<1958),VLOOKUP(I142,Feuil2!$F$10:$P$28,7),IF(AND(H142>=1958,H142<1963),VLOOKUP(I142,Feuil2!$F$10:$P$28,6),IF(AND(H142>=1963,H142<1968),VLOOKUP(I142,Feuil2!$F$10:$P$28,5),IF(AND(H142>=1968,H142<1973),VLOOKUP(I142,Feuil2!$F$10:$P$28,4),IF(AND(H142>=1973,H142<1978),VLOOKUP(I142,Feuil2!$F$10:$P$28,3),IF(AND(H142>=1978,H142<1983),VLOOKUP(I142,Feuil2!$F$10:$P$28,2),VLOOKUP(I142,Feuil2!$F$10:$P$28,2))))))))))))","v":{"$error":"#N/A"}},null,{"$f":"T142-HLOOKUP(Y142,Feuil2!$C$1:$CD$9,2,FALSE)","v":{"$error":"#VALUE!"}},{"$f":"T142-HLOOKUP(Y142,Feuil2!$C$1:$CD$9,3,FALSE)","v":{"$error":"#VALUE!"}},{"$f":"T142-HLOOKUP(Y142,Feuil2!$C$1:$CD$9,4,FALSE)","v":{"$error":"#VALUE!"}},{"$f":"T142-HLOOKUP(Y142,Feuil2!$C$1:$CD$9,5,FALSE)","v":{"$error":"#VALUE!"}},{"$f":"T142-HLOOKUP(Y142,Feuil2!$C$1:$CD$9,6,FALSE)","v":{"$error":"#VALUE!"}},{"$f":"T142-HLOOKUP(Y142,Feuil2!$C$1:$CD$9,7,FALSE)","v":{"$error":"#VALUE!"}},{"$f":"T142-HLOOKUP(Y142,Feuil2!$C$1:$CD$9,8,FALSE)","v":{"$error":"#VALUE!"}},{"$f":"T142-HLOOKUP(Y142,Feuil2!$C$1:$CD$9,9,FALSE)","v":{"$error":"#VALUE!"}},null,null,null,null,null,null,null,{"$error":"#VALUE!"},2017,null,{"$f":"IF(AQ142,VLOOKUP(AQ142,HOM!$AS$389:$AT$444,2))","v":4.4930000000000003}]
["H",null,null,null,null,null,null,null,null,null,null,null,null,null,"",null,null,null,"","","","","",false,{"$f":"IF(AND(H143<1920),VLOOKUP(I143,Feuil2!$F$10:$P$28,11),IF(AND(H143>=1920,H143<1939),VLOOKUP(I143,Feuil2!$F$10:$P$28,11),IF(AND(H143>=1938,H143<1943),VLOOKUP(I143,Feuil2!$F$10:$P$28,10),IF(AND(H143>=1943,H143<1948),VLOOKUP(I143,Feuil2!$F$10:$P$28,9),IF(AND(H143>=1948,H143<1953),VLOOKUP(I143,Feuil2!$F$10:$P$28,8),IF(AND(H143>=1953,H143<1958),VLOOKUP(I143,Feuil2!$F$10:$P$28,7),IF(AND(H143>=1958,H143<1963),VLOOKUP(I143,Feuil2!$F$10:$P$28,6),IF(AND(H143>=1963,H143<1968),VLOOKUP(I143,Feuil2!$F$10:$P$28,5),IF(AND(H143>=1968,H143<1973),VLOOKUP(I143,Feuil2!$F$10:$P$28,4),IF(AND(H143>=1973,H143<1978),VLOOKUP(I143,Feuil2!$F$10:$P$28,3),IF(AND(H143>=1978,H143<1983),VLOOKUP(I143,Feuil2!$F$10:$P$28,2),VLOOKUP(I143,Feuil2!$F$10:$P$28,2))))))))))))","v":{"$error":"#N/A"}},null,{"$f":"T143-HLOOKUP(Y143,Feuil2!$C$1:$CD$9,2,FALSE)","v":{"$error":"#VALUE!"}},{"$f":"T143-HLOOKUP(Y143,Feuil2!$C$1:$CD$9,3,FALSE)","v":{"$error":"#VALUE!"}},{"$f":"T143-HLOOKUP(Y143,Feuil2!$C$1:$CD$9,4,FALSE)","v":{"$error":"#VALUE!"}},{"$f":"T143-HLOOKUP(Y143,Feuil2!$C$1:$CD$9,5,FALSE)","v":{"$error":"#VALUE!"}},{"$f":"T143-HLOOKUP(Y143,Feuil2!$C$1:$CD$9,6,FALSE)","v":{"$error":"#VALUE!"}},{"$f":"T143-HLOOKUP(Y143,Feuil2!$C$1:$CD$9,7,FALSE)","v":{"$error":"#VALUE!"}},{"$f":"T143-HLOOKUP(Y143,Feuil2!$C$1:$CD$9,8,FALSE)","v":{"$error":"#VALUE!"}},{"$f":"T143-HLOOKUP(Y143,Feuil2!$C$1:$CD$9,9,FALSE)","v":{"$error":"#VALUE!"}},null,null,null,null,null,null,null,{"$error":"#VALUE!"},2017,null,{"$f":"IF(AQ143,VLOOKUP(AQ143,HOM!$AS$389:$AT$444,2))","v":4.4930000000000003}]
["H",null,null,null,null,null,null,null,null,null,null,null,null,null,"",null,null,null,"","","","","",false,{"$f":"IF(AND(H144<1920),VLOOKUP(I144,Feuil2!$F$10:$P$28,11),IF(AND(H144>=1920,H144<1939),VLOOKUP(I144,Feuil2!$F$10:$P$28,11),IF(AND(H144>=1938,H144<1943),VLOOKUP(I144,Feuil2!$F$10:$P$28,10),IF(AND(H144>=1943,H144<1948),VLOOKUP(I144,Feuil2!$F$10:$P$28,9),IF(AND(H144>=1948,H144<1953),VLOOKUP(I144,Feuil2!$F$10:$P$28,8),IF(AND(H144>=1953,H144<1958),VLOOKUP(I144,Feuil2!$F$10:$P$28,7),IF(AND(H144>=1958,H144<1963),VLOOKUP(I144,Feuil2!$F$10:$P$28,6),IF(AND(H144>=1963,H144<1968),VLOOKUP(I144,Feuil2!$F$10:$P$28,5),IF(AND(H144>=1968,H144<1973),VLOOKUP(I144,Feuil2!$F$10:$P$28,4),IF(AND(H144>=1973,H144<1978),VLOOKUP(I144,Feuil2!$F$10:$P$28,3),IF(AND(H144>=1978,H144<1983),VLOOKUP(I144,Feuil2!$F$10:$P$28,2),VLOOKUP(I144,Feuil2!$F$10:$P$28,2))))))))))))","v":{"$error":"#N/A"}},null,{"$f":"T144-HLOOKUP(Y144,Feuil2!$C$1:$CD$9,2,FALSE)","v":{"$error":"#VALUE!"}},{"$f":"T144-HLOOKUP(Y144,Feuil2!$C$1:$CD$9,3,FALSE)","v":{"$error":"#VALUE!"}},{"$f":"T144-HLOOKUP(Y144,Feuil2!$C$1:$CD$9,4,FALSE)","v":{"$error":"#VALUE!"}},{"$f":"T144-HLOOKUP(Y144,Feuil2!$C$1:$CD$9,5,FALSE)","v":{"$error":"#VALUE!"}},{"$f":"T144-HLOOKUP(Y144,Feuil2!$C$1:$CD$9,6,FALSE)","v":{"$error":"#VALUE!"}},{"$f":"T144-HLOOKUP(Y144,Feuil2!$C$1:$CD$9,7,FALSE)","v":{"$error":"#VALUE!"}},{"$f":"T144-HLOOKUP(Y144,Feuil2!$C$1:$CD$9,8,FALSE)","v":{"$error":"#VALUE!"}},{"$f":"T144-HLOOKUP(Y144,Feuil2!$C$1:$CD$9,9,FALSE)","v":{"$error":"#VALUE!"}},null,null,null,null,null,null,null,{"$error":"#VALUE!"},2017,null,{"$f":"IF(AQ144,VLOOKUP(AQ144,HOM!$AS$389:$AT$444,2))","v":4.4930000000000003}]
["H",null,null,null,null,null,null,null,null,null,null,null,null,null,"",null,null,null,"","","","","",false,{"$f":"IF(AND(H145<1920),VLOOKUP(I145,Feuil2!$F$10:$P$28,11),IF(AND(H145>=1920,H145<1939),VLOOKUP(I145,Feuil2!$F$10:$P$28,11),IF(AND(H145>=1938,H145<1943),VLOOKUP(I145,Feuil2!$F$10:$P$28,10),IF(AND(H145>=1943,H145<1948),VLOOKUP(I145,Feuil2!$F$10:$P$28,9),IF(AND(H145>=1948,H145<1953),VLOOKUP(I145,Feuil2!$F$10:$P$28,8),IF(AND(H145>=1953,H145<1958),VLOOKUP(I145,Feuil2!$F$10:$P$28,7),IF(AND(H145>=1958,H145<1963),VLOOKUP(I145,Feuil2!$F$10:$P$28,6),IF(AND(H145>=1963,H145<1968),VLOOKUP(I145,Feuil2!$F$10:$P$28,5),IF(AND(H145>=1968,H145<1973),VLOOKUP(I145,Feuil2!$F$10:$P$28,4),IF(AND(H145>=1973,H145<1978),VLOOKUP(I145,Feuil2!$F$10:$P$28,3),IF(AND(H145>=1978,H145<1983),VLOOKUP(I145,Feuil2!$F$10:$P$28,2),VLOOKUP(I145,Feuil2!$F$10:$P$28,2))))))))))))","v":{"$error":"#N/A"}},null,{"$f":"T145-HLOOKUP(Y145,Feuil2!$C$1:$CD$9,2,FALSE)","v":{"$error":"#VALUE!"}},{"$f":"T145-HLOOKUP(Y145,Feuil2!$C$1:$CD$9,3,FALSE)","v":{"$error":"#VALUE!"}},{"$f":"T145-HLOOKUP(Y145,Feuil2!$C$1:$CD$9,4,FALSE)","v":{"$error":"#VALUE!"}},{"$f":"T145-HLOOKUP(Y145,Feuil2!$C$1:$CD$9,5,FALSE)","v":{"$error":"#VALUE!"}},{"$f":"T145-HLOOKUP(Y145,Feuil2!$C$1:$CD$9,6,FALSE)","v":{"$error":"#VALUE!"}},{"$f":"T145-HLOOKUP(Y145,Feuil2!$C$1:$CD$9,7,FALSE)","v":{"$error":"#VALUE!"}},{"$f":"T145-HLOOKUP(Y145,Feuil2!$C$1:$CD$9,8,FALSE)","v":{"$error":"#VALUE!"}},{"$f":"T145-HLOOKUP(Y145,Feuil2!$C$1:$CD$9,9,FALSE)","v":{"$error":"#VALUE!"}},null,null,null,null,null,null,null,{"$error":"#VALUE!"},2017,null,{"$f":"IF(AQ145,VLOOKUP(AQ145,HOM!$AS$389:$AT$444,2))","v":4.4930000000000003}]
["H",null,null,null,null,null,null,null,null,null,null,null,null,null,"",null,null,null,"","","","","",false,{"$f":"IF(AND(H146<1920),VLOOKUP(I146,Feuil2!$F$10:$P$28,11),IF(AND(H146>=1920,H146<1939),VLOOKUP(I146,Feuil2!$F$10:$P$28,11),IF(AND(H146>=1938,H146<1943),VLOOKUP(I146,Feuil2!$F$10:$P$28,10),IF(AND(H146>=1943,H146<1948),VLOOKUP(I146,Feuil2!$F$10:$P$28,9),IF(AND(H146>=1948,H146<1953),VLOOKUP(I146,Feuil2!$F$10:$P$28,8),IF(AND(H146>=1953,H146<1958),VLOOKUP(I146,Feuil2!$F$10:$P$28,7),IF(AND(H146>=1958,H146<1963),VLOOKUP(I146,Feuil2!$F$10:$P$28,6),IF(AND(H146>=1963,H146<1968),VLOOKUP(I146,Feuil2!$F$10:$P$28,5),IF(AND(H146>=1968,H146<1973),VLOOKUP(I146,Feuil2!$F$10:$P$28,4),IF(AND(H146>=1973,H146<1978),VLOOKUP(I146,Feuil2!$F$10:$P$28,3),IF(AND(H146>=1978,H146<1983),VLOOKUP(I146,Feuil2!$F$10:$P$28,2),VLOOKUP(I146,Feuil2!$F$10:$P$28,2))))))))))))","v":{"$error":"#N/A"}},null,{"$f":"T146-HLOOKUP(Y146,Feuil2!$C$1:$CD$9,2,FALSE)","v":{"$error":"#VALUE!"}},{"$f":"T146-HLOOKUP(Y146,Feuil2!$C$1:$CD$9,3,FALSE)","v":{"$error":"#VALUE!"}},{"$f":"T146-HLOOKUP(Y146,Feuil2!$C$1:$CD$9,4,FALSE)","v":{"$error":"#VALUE!"}},{"$f":"T146-HLOOKUP(Y146,Feuil2!$C$1:$CD$9,5,FALSE)","v":{"$error":"#VALUE!"}},{"$f":"T146-HLOOKUP(Y146,Feuil2!$C$1:$CD$9,6,FALSE)","v":{"$error":"#VALUE!"}},{"$f":"T146-HLOOKUP(Y146,Feuil2!$C$1:$CD$9,7,FALSE)","v":{"$error":"#VALUE!"}},{"$f":"T146-HLOOKUP(Y146,Feuil2!$C$1:$CD$9,8,FALSE)","v":{"$error":"#VALUE!"}},{"$f":"T146-HLOOKUP(Y146,Feuil2!$C$1:$CD$9,9,FALSE)","v":{"$error":"#VALUE!"}},null,null,null,null,null,null,null,{"$error":"#VALUE!"},2017,null,{"$f":"IF(AQ146,VLOOKUP(AQ146,HOM!$AS$389:$AT$444,2))","v":4.4930000000000003}]
["H",null,null,null,null,null,null,null,null,null,null,null,null,null,"",null,null,null,"","","","","",false,{"$f":"IF(AND(H147<1920),VLOOKUP(I147,Feuil2!$F$10:$P$28,11),IF(AND(H147>=1920,H147<1939),VLOOKUP(I147,Feuil2!$F$10:$P$28,11),IF(AND(H147>=1938,H147<1943),VLOOKUP(I147,Feuil2!$F$10:$P$28,10),IF(AND(H147>=1943,H147<1948),VLOOKUP(I147,Feuil2!$F$10:$P$28,9),IF(AND(H147>=1948,H147<1953),VLOOKUP(I147,Feuil2!$F$10:$P$28,8),IF(AND(H147>=1953,H147<1958),VLOOKUP(I147,Feuil2!$F$10:$P$28,7),IF(AND(H147>=1958,H147<1963),VLOOKUP(I147,Feuil2!$F$10:$P$28,6),IF(AND(H147>=1963,H147<1968),VLOOKUP(I147,Feuil2!$F$10:$P$28,5),IF(AND(H147>=1968,H147<1973),VLOOKUP(I147,Feuil2!$F$10:$P$28,4),IF(AND(H147>=1973,H147<1978),VLOOKUP(I147,Feuil2!$F$10:$P$28,3),IF(AND(H147>=1978,H147<1983),VLOOKUP(I147,Feuil2!$F$10:$P$28,2),VLOOKUP(I147,Feuil2!$F$10:$P$28,2))))))))))))","v":{"$error":"#N/A"}},null,{"$f":"T147-HLOOKUP(Y147,Feuil2!$C$1:$CD$9,2,FALSE)","v":{"$error":"#VALUE!"}},{"$f":"T147-HLOOKUP(Y147,Feuil2!$C$1:$CD$9,3,FALSE)","v":{"$error":"#VALUE!"}},{"$f":"T147-HLOOKUP(Y147,Feuil2!$C$1:$CD$9,4,FALSE)","v":{"$error":"#VALUE!"}},{"$f":"T147-HLOOKUP(Y147,Feuil2!$C$1:$CD$9,5,FALSE)","v":{"$error":"#VALUE!"}},{"$f":"T147-HLOOKUP(Y147,Feuil2!$C$1:$CD$9,6,FALSE)","v":{"$error":"#VALUE!"}},{"$f":"T147-HLOOKUP(Y147,Feuil2!$C$1:$CD$9,7,FALSE)","v":{"$error":"#VALUE!"}},{"$f":"T147-HLOOKUP(Y147,Feuil2!$C$1:$CD$9,8,FALSE)","v":{"$error":"#VALUE!"}},{"$f":"T147-HLOOKUP(Y147,Feuil2!$C$1:$CD$9,9,FALSE)","v":{"$error":"#VALUE!"}},null,null,null,null,null,null,null,{"$error":"#VALUE!"},2017,null,{"$f":"IF(AQ147,VLOOKUP(AQ147,HOM!$AS$389:$AT$444,2))","v":4.4930000000000003}]
["H",null,null,null,null,null,null,null,null,null,null,null,null,null,"",null,null,null,"","","","","",false,{"$f":"IF(AND(H148<1920),VLOOKUP(I148,Feuil2!$F$10:$P$28,11),IF(AND(H148>=1920,H148<1939),VLOOKUP(I148,Feuil2!$F$10:$P$28,11),IF(AND(H148>=1938,H148<1943),VLOOKUP(I148,Feuil2!$F$10:$P$28,10),IF(AND(H148>=1943,H148<1948),VLOOKUP(I148,Feuil2!$F$10:$P$28,9),IF(AND(H148>=1948,H148<1953),VLOOKUP(I148,Feuil2!$F$10:$P$28,8),IF(AND(H148>=1953,H148<1958),VLOOKUP(I148,Feuil2!$F$10:$P$28,7),IF(AND(H148>=1958,H148<1963),VLOOKUP(I148,Feuil2!$F$10:$P$28,6),IF(AND(H148>=1963,H148<1968),VLOOKUP(I148,Feuil2!$F$10:$P$28,5),IF(AND(H148>=1968,H148<1973),VLOOKUP(I148,Feuil2!$F$10:$P$28,4),IF(AND(H148>=1973,H148<1978),VLOOKUP(I148,Feuil2!$F$10:$P$28,3),IF(AND(H148>=1978,H148<1983),VLOOKUP(I148,Feuil2!$F$10:$P$28,2),VLOOKUP(I148,Feuil2!$F$10:$P$28,2))))))))))))","v":{"$error":"#N/A"}},null,{"$f":"T148-HLOOKUP(Y148,Feuil2!$C$1:$CD$9,2,FALSE)","v":{"$error":"#VALUE!"}},{"$f":"T148-HLOOKUP(Y148,Feuil2!$C$1:$CD$9,3,FALSE)","v":{"$error":"#VALUE!"}},{"$f":"T148-HLOOKUP(Y148,Feuil2!$C$1:$CD$9,4,FALSE)","v":{"$error":"#VALUE!"}},{"$f":"T148-HLOOKUP(Y148,Feuil2!$C$1:$CD$9,5,FALSE)","v":{"$error":"#VALUE!"}},{"$f":"T148-HLOOKUP(Y148,Feuil2!$C$1:$CD$9,6,FALSE)","v":{"$error":"#VALUE!"}},{"$f":"T148-HLOOKUP(Y148,Feuil2!$C$1:$CD$9,7,FALSE)","v":{"$error":"#VALUE!"}},{"$f":"T148-HLOOKUP(Y148,Feuil2!$C$1:$CD$9,8,FALSE)","v":{"$error":"#VALUE!"}},{"$f":"T148-HLOOKUP(Y148,Feuil2!$C$1:$CD$9,9,FALSE)","v":{"$error":"#VALUE!"}},null,null,null,null,null,null,null,{"$error":"#VALUE!"},2017,null,{"$f":"IF(AQ148,VLOOKUP(AQ148,HOM!$AS$389:$AT$444,2))","v":4.4930000000000003}]
["H",null,null,null,null,null,null,null,null,null,null,null,null,null,"",null,null,null,"","","","","",false,{"$f":"IF(AND(H149<1920),VLOOKUP(I149,Feuil2!$F$10:$P$28,11),IF(AND(H149>=1920,H149<1939),VLOOKUP(I149,Feuil2!$F$10:$P$28,11),IF(AND(H149>=1938,H149<1943),VLOOKUP(I149,Feuil2!$F$10:$P$28,10),IF(AND(H149>=1943,H149<1948),VLOOKUP(I149,Feuil2!$F$10:$P$28,9),IF(AND(H149>=1948,H149<1953),VLOOKUP(I149,Feuil2!$F$10:$P$28,8),IF(AND(H149>=1953,H149<1958),VLOOKUP(I149,Feuil2!$F$10:$P$28,7),IF(AND(H149>=1958,H149<1963),VLOOKUP(I149,Feuil2!$F$10:$P$28,6),IF(AND(H149>=1963,H149<1968),VLOOKUP(I149,Feuil2!$F$10:$P$28,5),IF(AND(H149>=1968,H149<1973),VLOOKUP(I149,Feuil2!$F$10:$P$28,4),IF(AND(H149>=1973,H149<1978),VLOOKUP(I149,Feuil2!$F$10:$P$28,3),IF(AND(H149>=1978,H149<1983),VLOOKUP(I149,Feuil2!$F$10:$P$28,2),VLOOKUP(I149,Feuil2!$F$10:$P$28,2))))))))))))","v":{"$error":"#N/A"}},null,{"$f":"T149-HLOOKUP(Y149,Feuil2!$C$1:$CD$9,2,FALSE)","v":{"$error":"#VALUE!"}},{"$f":"T149-HLOOKUP(Y149,Feuil2!$C$1:$CD$9,3,FALSE)","v":{"$error":"#VALUE!"}},{"$f":"T149-HLOOKUP(Y149,Feuil2!$C$1:$CD$9,4,FALSE)","v":{"$error":"#VALUE!"}},{"$f":"T149-HLOOKUP(Y149,Feuil2!$C$1:$CD$9,5,FALSE)","v":{"$error":"#VALUE!"}},{"$f":"T149-HLOOKUP(Y149,Feuil2!$C$1:$CD$9,6,FALSE)","v":{"$error":"#VALUE!"}},{"$f":"T149-HLOOKUP(Y149,Feuil2!$C$1:$CD$9,7,FALSE)","v":{"$error":"#VALUE!"}},{"$f":"T149-HLOOKUP(Y149,Feuil2!$C$1:$CD$9,8,FALSE)","v":{"$error":"#VALUE!"}},{"$f":"T149-HLOOKUP(Y149,Feuil2!$C$1:$CD$9,9,FALSE)","v":{"$error":"#VALUE!"}},null,null,null,null,null,null,null,{"$error":"#VALUE!"},2017,null,{"$f":"IF(AQ149,VLOOKUP(AQ149,HOM!$AS$389:$AT$444,2))","v":4.4930000000000003}]
["H",null,null,null,null,null,null,null,null,null,null,null,null,null,"",null,null,null,"","","","","",false,{"$f":"IF(AND(H150<1920),VLOOKUP(I150,Feuil2!$F$10:$P$28,11),IF(AND(H150>=1920,H150<1939),VLOOKUP(I150,Feuil2!$F$10:$P$28,11),IF(AND(H150>=1938,H150<1943),VLOOKUP(I150,Feuil2!$F$10:$P$28,10),IF(AND(H150>=1943,H150<1948),VLOOKUP(I150,Feuil2!$F$10:$P$28,9),IF(AND(H150>=1948,H150<1953),VLOOKUP(I150,Feuil2!$F$10:$P$28,8),IF(AND(H150>=1953,H150<1958),VLOOKUP(I150,Feuil2!$F$10:$P$28,7),IF(AND(H150>=1958,H150<1963),VLOOKUP(I150,Feuil2!$F$10:$P$28,6),IF(AND(H150>=1963,H150<1968),VLOOKUP(I150,Feuil2!$F$10:$P$28,5),IF(AND(H150>=1968,H150<1973),VLOOKUP(I150,Feuil2!$F$10:$P$28,4),IF(AND(H150>=1973,H150<1978),VLOOKUP(I150,Feuil2!$F$10:$P$28,3),IF(AND(H150>=1978,H150<1983),VLOOKUP(I150,Feuil2!$F$10:$P$28,2),VLOOKUP(I150,Feuil2!$F$10:$P$28,2))))))))))))","v":{"$error":"#N/A"}},null,{"$f":"T150-HLOOKUP(Y150,Feuil2!$C$1:$CD$9,2,FALSE)","v":{"$error":"#VALUE!"}},{"$f":"T150-HLOOKUP(Y150,Feuil2!$C$1:$CD$9,3,FALSE)","v":{"$error":"#VALUE!"}},{"$f":"T150-HLOOKUP(Y150,Feuil2!$C$1:$CD$9,4,FALSE)","v":{"$error":"#VALUE!"}},{"$f":"T150-HLOOKUP(Y150,Feuil2!$C$1:$CD$9,5,FALSE)","v":{"$error":"#VALUE!"}},{"$f":"T150-HLOOKUP(Y150,Feuil2!$C$1:$CD$9,6,FALSE)","v":{"$error":"#VALUE!"}},{"$f":"T150-HLOOKUP(Y150,Feuil2!$C$1:$CD$9,7,FALSE)","v":{"$error":"#VALUE!"}},{"$f":"T150-HLOOKUP(Y150,Feuil2!$C$1:$CD$9,8,FALSE)","v":{"$error":"#VALUE!"}},{"$f":"T150-HLOOKUP(Y150,Feuil2!$C$1:$CD$9,9,FALSE)","v":{"$error":"#VALUE!"}},null,null,null,null,null,null,null,{"$error":"#VALUE!"},2017,null,{"$f":"IF(AQ150,VLOOKUP(AQ150,HOM!$AS$389:$AT$444,2))","v":4.4930000000000003}]
["H",null,null,null,null,null,null,null,null,null,null,null,null,null,"",null,null,null,"","","","","",false,{"$f":"IF(AND(H151<1920),VLOOKUP(I151,Feuil2!$F$10:$P$28,11),IF(AND(H151>=1920,H151<1939),VLOOKUP(I151,Feuil2!$F$10:$P$28,11),IF(AND(H151>=1938,H151<1943),VLOOKUP(I151,Feuil2!$F$10:$P$28,10),IF(AND(H151>=1943,H151<1948),VLOOKUP(I151,Feuil2!$F$10:$P$28,9),IF(AND(H151>=1948,H151<1953),VLOOKUP(I151,Feuil2!$F$10:$P$28,8),IF(AND(H151>=1953,H151<1958),VLOOKUP(I151,Feuil2!$F$10:$P$28,7),IF(AND(H151>=1958,H151<1963),VLOOKUP(I151,Feuil2!$F$10:$P$28,6),IF(AND(H151>=1963,H151<1968),VLOOKUP(I151,Feuil2!$F$10:$P$28,5),IF(AND(H151>=1968,H151<1973),VLOOKUP(I151,Feuil2!$F$10:$P$28,4),IF(AND(H151>=1973,H151<1978),VLOOKUP(I151,Feuil2!$F$10:$P$28,3),IF(AND(H151>=1978,H151<1983),VLOOKUP(I151,Feuil2!$F$10:$P$28,2),VLOOKUP(I151,Feuil2!$F$10:$P$28,2))))))))))))","v":{"$error":"#N/A"}},null,{"$f":"T151-HLOOKUP(Y151,Feuil2!$C$1:$CD$9,2,FALSE)","v":{"$error":"#VALUE!"}},{"$f":"T151-HLOOKUP(Y151,Feuil2!$C$1:$CD$9,3,FALSE)","v":{"$error":"#VALUE!"}},{"$f":"T151-HLOOKUP(Y151,Feuil2!$C$1:$CD$9,4,FALSE)","v":{"$error":"#VALUE!"}},{"$f":"T151-HLOOKUP(Y151,Feuil2!$C$1:$CD$9,5,FALSE)","v":{"$error":"#VALUE!"}},{"$f":"T151-HLOOKUP(Y151,Feuil2!$C$1:$CD$9,6,FALSE)","v":{"$error":"#VALUE!"}},{"$f":"T151-HLOOKUP(Y151,Feuil2!$C$1:$CD$9,7,FALSE)","v":{"$error":"#VALUE!"}},{"$f":"T151-HLOOKUP(Y151,Feuil2!$C$1:$CD$9,8,FALSE)","v":{"$error":"#VALUE!"}},{"$f":"T151-HLOOKUP(Y151,Feuil2!$C$1:$CD$9,9,FALSE)","v":{"$error":"#VALUE!"}},null,null,null,null,null,null,null,{"$error":"#VALUE!"},2017,null,{"$f":"IF(AQ151,VLOOKUP(AQ151,HOM!$AS$389:$AT$444,2))","v":4.4930000000000003}]
["H",null,null,null,null,null,null,null,null,null,null,null,null,null,"",null,null,null,"","","","","",false,{"$f":"IF(AND(H152<1920),VLOOKUP(I152,Feuil2!$F$10:$P$28,11),IF(AND(H152>=1920,H152<1939),VLOOKUP(I152,Feuil2!$F$10:$P$28,11),IF(AND(H152>=1938,H152<1943),VLOOKUP(I152,Feuil2!$F$10:$P$28,10),IF(AND(H152>=1943,H152<1948),VLOOKUP(I152,Feuil2!$F$10:$P$28,9),IF(AND(H152>=1948,H152<1953),VLOOKUP(I152,Feuil2!$F$10:$P$28,8),IF(AND(H152>=1953,H152<1958),VLOOKUP(I152,Feuil2!$F$10:$P$28,7),IF(AND(H152>=1958,H152<1963),VLOOKUP(I152,Feuil2!$F$10:$P$28,6),IF(AND(H152>=1963,H152<1968),VLOOKUP(I152,Feuil2!$F$10:$P$28,5),IF(AND(H152>=1968,H152<1973),VLOOKUP(I152,Feuil2!$F$10:$P$28,4),IF(AND(H152>=1973,H152<1978),VLOOKUP(I152,Feuil2!$F$10:$P$28,3),IF(AND(H152>=1978,H152<1983),VLOOKUP(I152,Feuil2!$F$10:$P$28,2),VLOOKUP(I152,Feuil2!$F$10:$P$28,2))))))))))))","v":{"$error":"#N/A"}},null,{"$f":"T152-HLOOKUP(Y152,Feuil2!$C$1:$CD$9,2,FALSE)","v":{"$error":"#VALUE!"}},{"$f":"T152-HLOOKUP(Y152,Feuil2!$C$1:$CD$9,3,FALSE)","v":{"$error":"#VALUE!"}},{"$f":"T152-HLOOKUP(Y152,Feuil2!$C$1:$CD$9,4,FALSE)","v":{"$error":"#VALUE!"}},{"$f":"T152-HLOOKUP(Y152,Feuil2!$C$1:$CD$9,5,FALSE)","v":{"$error":"#VALUE!"}},{"$f":"T152-HLOOKUP(Y152,Feuil2!$C$1:$CD$9,6,FALSE)","v":{"$error":"#VALUE!"}},{"$f":"T152-HLOOKUP(Y152,Feuil2!$C$1:$CD$9,7,FALSE)","v":{"$error":"#VALUE!"}},{"$f":"T152-HLOOKUP(Y152,Feuil2!$C$1:$CD$9,8,FALSE)","v":{"$error":"#VALUE!"}},{"$f":"T152-HLOOKUP(Y152,Feuil2!$C$1:$CD$9,9,FALSE)","v":{"$error":"#VALUE!"}},null,null,null,null,null,null,null,{"$error":"#VALUE!"},2017,null,{"$f":"IF(AQ152,VLOOKUP(AQ152,HOM!$AS$389:$AT$444,2))","v":4.4930000000000003}]
["H",null,null,null,null,null,null,null,null,null,null,null,null,null,"",null,null,null,"","","","","",false,{"$f":"IF(AND(H153<1920),VLOOKUP(I153,Feuil2!$F$10:$P$28,11),IF(AND(H153>=1920,H153<1939),VLOOKUP(I153,Feuil2!$F$10:$P$28,11),IF(AND(H153>=1938,H153<1943),VLOOKUP(I153,Feuil2!$F$10:$P$28,10),IF(AND(H153>=1943,H153<1948),VLOOKUP(I153,Feuil2!$F$10:$P$28,9),IF(AND(H153>=1948,H153<1953),VLOOKUP(I153,Feuil2!$F$10:$P$28,8),IF(AND(H153>=1953,H153<1958),VLOOKUP(I153,Feuil2!$F$10:$P$28,7),IF(AND(H153>=1958,H153<1963),VLOOKUP(I153,Feuil2!$F$10:$P$28,6),IF(AND(H153>=1963,H153<1968),VLOOKUP(I153,Feuil2!$F$10:$P$28,5),IF(AND(H153>=1968,H153<1973),VLOOKUP(I153,Feuil2!$F$10:$P$28,4),IF(AND(H153>=1973,H153<1978),VLOOKUP(I153,Feuil2!$F$10:$P$28,3),IF(AND(H153>=1978,H153<1983),VLOOKUP(I153,Feuil2!$F$10:$P$28,2),VLOOKUP(I153,Feuil2!$F$10:$P$28,2))))))))))))","v":{"$error":"#N/A"}},null,{"$f":"T153-HLOOKUP(Y153,Feuil2!$C$1:$CD$9,2,FALSE)","v":{"$error":"#VALUE!"}},{"$f":"T153-HLOOKUP(Y153,Feuil2!$C$1:$CD$9,3,FALSE)","v":{"$error":"#VALUE!"}},{"$f":"T153-HLOOKUP(Y153,Feuil2!$C$1:$CD$9,4,FALSE)","v":{"$error":"#VALUE!"}},{"$f":"T153-HLOOKUP(Y153,Feuil2!$C$1:$CD$9,5,FALSE)","v":{"$error":"#VALUE!"}},{"$f":"T153-HLOOKUP(Y153,Feuil2!$C$1:$CD$9,6,FALSE)","v":{"$error":"#VALUE!"}},{"$f":"T153-HLOOKUP(Y153,Feuil2!$C$1:$CD$9,7,FALSE)","v":{"$error":"#VALUE!"}},{"$f":"T153-HLOOKUP(Y153,Feuil2!$C$1:$CD$9,8,FALSE)","v":{"$error":"#VALUE!"}},{"$f":"T153-HLOOKUP(Y153,Feuil2!$C$1:$CD$9,9,FALSE)","v":{"$error":"#VALUE!"}},null,null,null,null,null,null,null,{"$error":"#VALUE!"},2017,null,{"$f":"IF(AQ153,VLOOKUP(AQ153,HOM!$AS$389:$AT$444,2))","v":4.4930000000000003}]
["H",null,null,null,null,null,null,null,null,null,null,null,null,null,"",null,null,null,"","","","","",false,{"$f":"IF(AND(H154<1920),VLOOKUP(I154,Feuil2!$F$10:$P$28,11),IF(AND(H154>=1920,H154<1939),VLOOKUP(I154,Feuil2!$F$10:$P$28,11),IF(AND(H154>=1938,H154<1943),VLOOKUP(I154,Feuil2!$F$10:$P$28,10),IF(AND(H154>=1943,H154<1948),VLOOKUP(I154,Feuil2!$F$10:$P$28,9),IF(AND(H154>=1948,H154<1953),VLOOKUP(I154,Feuil2!$F$10:$P$28,8),IF(AND(H154>=1953,H154<1958),VLOOKUP(I154,Feuil2!$F$10:$P$28,7),IF(AND(H154>=1958,H154<1963),VLOOKUP(I154,Feuil2!$F$10:$P$28,6),IF(AND(H154>=1963,H154<1968),VLOOKUP(I154,Feuil2!$F$10:$P$28,5),IF(AND(H154>=1968,H154<1973),VLOOKUP(I154,Feuil2!$F$10:$P$28,4),IF(AND(H154>=1973,H154<1978),VLOOKUP(I154,Feuil2!$F$10:$P$28,3),IF(AND(H154>=1978,H154<1983),VLOOKUP(I154,Feuil2!$F$10:$P$28,2),VLOOKUP(I154,Feuil2!$F$10:$P$28,2))))))))))))","v":{"$error":"#N/A"}},null,{"$f":"T154-HLOOKUP(Y154,Feuil2!$C$1:$CD$9,2,FALSE)","v":{"$error":"#VALUE!"}},{"$f":"T154-HLOOKUP(Y154,Feuil2!$C$1:$CD$9,3,FALSE)","v":{"$error":"#VALUE!"}},{"$f":"T154-HLOOKUP(Y154,Feuil2!$C$1:$CD$9,4,FALSE)","v":{"$error":"#VALUE!"}},{"$f":"T154-HLOOKUP(Y154,Feuil2!$C$1:$CD$9,5,FALSE)","v":{"$error":"#VALUE!"}},{"$f":"T154-HLOOKUP(Y154,Feuil2!$C$1:$CD$9,6,FALSE)","v":{"$error":"#VALUE!"}},{"$f":"T154-HLOOKUP(Y154,Feuil2!$C$1:$CD$9,7,FALSE)","v":{"$error":"#VALUE!"}},{"$f":"T154-HLOOKUP(Y154,Feuil2!$C$1:$CD$9,8,FALSE)","v":{"$error":"#VALUE!"}},{"$f":"T154-HLOOKUP(Y154,Feuil2!$C$1:$CD$9,9,FALSE)","v":{"$error":"#VALUE!"}},null,null,null,null,null,null,null,{"$error":"#VALUE!"},2017,null,{"$f":"IF(AQ154,VLOOKUP(AQ154,HOM!$AS$389:$AT$444,2))","v":4.4930000000000003}]
["H",null,null,null,null,null,null,null,null,null,null,null,null,null,"",null,null,null,"","","","","",false,{"$f":"IF(AND(H155<1920),VLOOKUP(I155,Feuil2!$F$10:$P$28,11),IF(AND(H155>=1920,H155<1939),VLOOKUP(I155,Feuil2!$F$10:$P$28,11),IF(AND(H155>=1938,H155<1943),VLOOKUP(I155,Feuil2!$F$10:$P$28,10),IF(AND(H155>=1943,H155<1948),VLOOKUP(I155,Feuil2!$F$10:$P$28,9),IF(AND(H155>=1948,H155<1953),VLOOKUP(I155,Feuil2!$F$10:$P$28,8),IF(AND(H155>=1953,H155<1958),VLOOKUP(I155,Feuil2!$F$10:$P$28,7),IF(AND(H155>=1958,H155<1963),VLOOKUP(I155,Feuil2!$F$10:$P$28,6),IF(AND(H155>=1963,H155<1968),VLOOKUP(I155,Feuil2!$F$10:$P$28,5),IF(AND(H155>=1968,H155<1973),VLOOKUP(I155,Feuil2!$F$10:$P$28,4),IF(AND(H155>=1973,H155<1978),VLOOKUP(I155,Feuil2!$F$10:$P$28,3),IF(AND(H155>=1978,H155<1983),VLOOKUP(I155,Feuil2!$F$10:$P$28,2),VLOOKUP(I155,Feuil2!$F$10:$P$28,2))))))))))))","v":{"$error":"#N/A"}},null,{"$f":"T155-HLOOKUP(Y155,Feuil2!$C$1:$CD$9,2,FALSE)","v":{"$error":"#VALUE!"}},{"$f":"T155-HLOOKUP(Y155,Feuil2!$C$1:$CD$9,3,FALSE)","v":{"$error":"#VALUE!"}},{"$f":"T155-HLOOKUP(Y155,Feuil2!$C$1:$CD$9,4,FALSE)","v":{"$error":"#VALUE!"}},{"$f":"T155-HLOOKUP(Y155,Feuil2!$C$1:$CD$9,5,FALSE)","v":{"$error":"#VALUE!"}},{"$f":"T155-HLOOKUP(Y155,Feuil2!$C$1:$CD$9,6,FALSE)","v":{"$error":"#VALUE!"}},{"$f":"T155-HLOOKUP(Y155,Feuil2!$C$1:$CD$9,7,FALSE)","v":{"$error":"#VALUE!"}},{"$f":"T155-HLOOKUP(Y155,Feuil2!$C$1:$CD$9,8,FALSE)","v":{"$error":"#VALUE!"}},{"$f":"T155-HLOOKUP(Y155,Feuil2!$C$1:$CD$9,9,FALSE)","v":{"$error":"#VALUE!"}},null,null,null,null,null,null,null,{"$error":"#VALUE!"},2017,null,{"$f":"IF(AQ155,VLOOKUP(AQ155,HOM!$AS$389:$AT$444,2))","v":4.4930000000000003}]
["H",null,null,null,null,null,null,null,null,null,null,null,null,null,"",null,null,null,"","","","","",false,{"$f":"IF(AND(H156<1920),VLOOKUP(I156,Feuil2!$F$10:$P$28,11),IF(AND(H156>=1920,H156<1939),VLOOKUP(I156,Feuil2!$F$10:$P$28,11),IF(AND(H156>=1938,H156<1943),VLOOKUP(I156,Feuil2!$F$10:$P$28,10),IF(AND(H156>=1943,H156<1948),VLOOKUP(I156,Feuil2!$F$10:$P$28,9),IF(AND(H156>=1948,H156<1953),VLOOKUP(I156,Feuil2!$F$10:$P$28,8),IF(AND(H156>=1953,H156<1958),VLOOKUP(I156,Feuil2!$F$10:$P$28,7),IF(AND(H156>=1958,H156<1963),VLOOKUP(I156,Feuil2!$F$10:$P$28,6),IF(AND(H156>=1963,H156<1968),VLOOKUP(I156,Feuil2!$F$10:$P$28,5),IF(AND(H156>=1968,H156<1973),VLOOKUP(I156,Feuil2!$F$10:$P$28,4),IF(AND(H156>=1973,H156<1978),VLOOKUP(I156,Feuil2!$F$10:$P$28,3),IF(AND(H156>=1978,H156<1983),VLOOKUP(I156,Feuil2!$F$10:$P$28,2),VLOOKUP(I156,Feuil2!$F$10:$P$28,2))))))))))))","v":{"$error":"#N/A"}},null,{"$f":"T156-HLOOKUP(Y156,Feuil2!$C$1:$CD$9,2,FALSE)","v":{"$error":"#VALUE!"}},{"$f":"T156-HLOOKUP(Y156,Feuil2!$C$1:$CD$9,3,FALSE)","v":{"$error":"#VALUE!"}},{"$f":"T156-HLOOKUP(Y156,Feuil2!$C$1:$CD$9,4,FALSE)","v":{"$error":"#VALUE!"}},{"$f":"T156-HLOOKUP(Y156,Feuil2!$C$1:$CD$9,5,FALSE)","v":{"$error":"#VALUE!"}},{"$f":"T156-HLOOKUP(Y156,Feuil2!$C$1:$CD$9,6,FALSE)","v":{"$error":"#VALUE!"}},{"$f":"T156-HLOOKUP(Y156,Feuil2!$C$1:$CD$9,7,FALSE)","v":{"$error":"#VALUE!"}},{"$f":"T156-HLOOKUP(Y156,Feuil2!$C$1:$CD$9,8,FALSE)","v":{"$error":"#VALUE!"}},{"$f":"T156-HLOOKUP(Y156,Feuil2!$C$1:$CD$9,9,FALSE)","v":{"$error":"#VALUE!"}},null,null,null,null,null,null,null,{"$error":"#VALUE!"},2017,null,{"$f":"IF(AQ156,VLOOKUP(AQ156,HOM!$AS$389:$AT$444,2))","v":4.4930000000000003}]
["H",null,null,null,null,null,null,null,null,null,null,null,null,null,"",null,null,null,"","","","","",false,{"$f":"IF(AND(H157<1920),VLOOKUP(I157,Feuil2!$F$10:$P$28,11),IF(AND(H157>=1920,H157<1939),VLOOKUP(I157,Feuil2!$F$10:$P$28,11),IF(AND(H157>=1938,H157<1943),VLOOKUP(I157,Feuil2!$F$10:$P$28,10),IF(AND(H157>=1943,H157<1948),VLOOKUP(I157,Feuil2!$F$10:$P$28,9),IF(AND(H157>=1948,H157<1953),VLOOKUP(I157,Feuil2!$F$10:$P$28,8),IF(AND(H157>=1953,H157<1958),VLOOKUP(I157,Feuil2!$F$10:$P$28,7),IF(AND(H157>=1958,H157<1963),VLOOKUP(I157,Feuil2!$F$10:$P$28,6),IF(AND(H157>=1963,H157<1968),VLOOKUP(I157,Feuil2!$F$10:$P$28,5),IF(AND(H157>=1968,H157<1973),VLOOKUP(I157,Feuil2!$F$10:$P$28,4),IF(AND(H157>=1973,H157<1978),VLOOKUP(I157,Feuil2!$F$10:$P$28,3),IF(AND(H157>=1978,H157<1983),VLOOKUP(I157,Feuil2!$F$10:$P$28,2),VLOOKUP(I157,Feuil2!$F$10:$P$28,2))))))))))))","v":{"$error":"#N/A"}},null,{"$f":"T157-HLOOKUP(Y157,Feuil2!$C$1:$CD$9,2,FALSE)","v":{"$error":"#VALUE!"}},{"$f":"T157-HLOOKUP(Y157,Feuil2!$C$1:$CD$9,3,FALSE)","v":{"$error":"#VALUE!"}},{"$f":"T157-HLOOKUP(Y157,Feuil2!$C$1:$CD$9,4,FALSE)","v":{"$error":"#VALUE!"}},{"$f":"T157-HLOOKUP(Y157,Feuil2!$C$1:$CD$9,5,FALSE)","v":{"$error":"#VALUE!"}},{"$f":"T157-HLOOKUP(Y157,Feuil2!$C$1:$CD$9,6,FALSE)","v":{"$error":"#VALUE!"}},{"$f":"T157-HLOOKUP(Y157,Feuil2!$C$1:$CD$9,7,FALSE)","v":{"$error":"#VALUE!"}},{"$f":"T157-HLOOKUP(Y157,Feuil2!$C$1:$CD$9,8,FALSE)","v":{"$error":"#VALUE!"}},{"$f":"T157-HLOOKUP(Y157,Feuil2!$C$1:$CD$9,9,FALSE)","v":{"$error":"#VALUE!"}},null,null,null,null,null,null,null,{"$error":"#VALUE!"},2017,null,{"$f":"IF(AQ157,VLOOKUP(AQ157,HOM!$AS$389:$AT$444,2))","v":4.4930000000000003}]
["H",null,null,null,null,null,null,null,null,null,null,null,null,null,"",null,null,null,"","","","","",false,{"$f":"IF(AND(H158<1920),VLOOKUP(I158,Feuil2!$F$10:$P$28,11),IF(AND(H158>=1920,H158<1939),VLOOKUP(I158,Feuil2!$F$10:$P$28,11),IF(AND(H158>=1938,H158<1943),VLOOKUP(I158,Feuil2!$F$10:$P$28,10),IF(AND(H158>=1943,H158<1948),VLOOKUP(I158,Feuil2!$F$10:$P$28,9),IF(AND(H158>=1948,H158<1953),VLOOKUP(I158,Feuil2!$F$10:$P$28,8),IF(AND(H158>=1953,H158<1958),VLOOKUP(I158,Feuil2!$F$10:$P$28,7),IF(AND(H158>=1958,H158<1963),VLOOKUP(I158,Feuil2!$F$10:$P$28,6),IF(AND(H158>=1963,H158<1968),VLOOKUP(I158,Feuil2!$F$10:$P$28,5),IF(AND(H158>=1968,H158<1973),VLOOKUP(I158,Feuil2!$F$10:$P$28,4),IF(AND(H158>=1973,H158<1978),VLOOKUP(I158,Feuil2!$F$10:$P$28,3),IF(AND(H158>=1978,H158<1983),VLOOKUP(I158,Feuil2!$F$10:$P$28,2),VLOOKUP(I158,Feuil2!$F$10:$P$28,2))))))))))))","v":{"$error":"#N/A"}},null,{"$f":"T158-HLOOKUP(Y158,Feuil2!$C$1:$CD$9,2,FALSE)","v":{"$error":"#VALUE!"}},{"$f":"T158-HLOOKUP(Y158,Feuil2!$C$1:$CD$9,3,FALSE)","v":{"$error":"#VALUE!"}},{"$f":"T158-HLOOKUP(Y158,Feuil2!$C$1:$CD$9,4,FALSE)","v":{"$error":"#VALUE!"}},{"$f":"T158-HLOOKUP(Y158,Feuil2!$C$1:$CD$9,5,FALSE)","v":{"$error":"#VALUE!"}},{"$f":"T158-HLOOKUP(Y158,Feuil2!$C$1:$CD$9,6,FALSE)","v":{"$error":"#VALUE!"}},{"$f":"T158-HLOOKUP(Y158,Feuil2!$C$1:$CD$9,7,FALSE)","v":{"$error":"#VALUE!"}},{"$f":"T158-HLOOKUP(Y158,Feuil2!$C$1:$CD$9,8,FALSE)","v":{"$error":"#VALUE!"}},{"$f":"T158-HLOOKUP(Y158,Feuil2!$C$1:$CD$9,9,FALSE)","v":{"$error":"#VALUE!"}},null,null,null,null,null,null,null,{"$error":"#VALUE!"},2017,null,{"$f":"IF(AQ158,VLOOKUP(AQ158,HOM!$AS$389:$AT$444,2))","v":4.4930000000000003}]
["H",null,null,null,null,null,null,null,null,null,null,null,null,null,"",null,null,null,"","","","","",false,{"$f":"IF(AND(H159<1920),VLOOKUP(I159,Feuil2!$F$10:$P$28,11),IF(AND(H159>=1920,H159<1939),VLOOKUP(I159,Feuil2!$F$10:$P$28,11),IF(AND(H159>=1938,H159<1943),VLOOKUP(I159,Feuil2!$F$10:$P$28,10),IF(AND(H159>=1943,H159<1948),VLOOKUP(I159,Feuil2!$F$10:$P$28,9),IF(AND(H159>=1948,H159<1953),VLOOKUP(I159,Feuil2!$F$10:$P$28,8),IF(AND(H159>=1953,H159<1958),VLOOKUP(I159,Feuil2!$F$10:$P$28,7),IF(AND(H159>=1958,H159<1963),VLOOKUP(I159,Feuil2!$F$10:$P$28,6),IF(AND(H159>=1963,H159<1968),VLOOKUP(I159,Feuil2!$F$10:$P$28,5),IF(AND(H159>=1968,H159<1973),VLOOKUP(I159,Feuil2!$F$10:$P$28,4),IF(AND(H159>=1973,H159<1978),VLOOKUP(I159,Feuil2!$F$10:$P$28,3),IF(AND(H159>=1978,H159<1983),VLOOKUP(I159,Feuil2!$F$10:$P$28,2),VLOOKUP(I159,Feuil2!$F$10:$P$28,2))))))))))))","v":{"$error":"#N/A"}},null,{"$f":"T159-HLOOKUP(Y159,Feuil2!$C$1:$CD$9,2,FALSE)","v":{"$error":"#VALUE!"}},{"$f":"T159-HLOOKUP(Y159,Feuil2!$C$1:$CD$9,3,FALSE)","v":{"$error":"#VALUE!"}},{"$f":"T159-HLOOKUP(Y159,Feuil2!$C$1:$CD$9,4,FALSE)","v":{"$error":"#VALUE!"}},{"$f":"T159-HLOOKUP(Y159,Feuil2!$C$1:$CD$9,5,FALSE)","v":{"$error":"#VALUE!"}},{"$f":"T159-HLOOKUP(Y159,Feuil2!$C$1:$CD$9,6,FALSE)","v":{"$error":"#VALUE!"}},{"$f":"T159-HLOOKUP(Y159,Feuil2!$C$1:$CD$9,7,FALSE)","v":{"$error":"#VALUE!"}},{"$f":"T159-HLOOKUP(Y159,Feuil2!$C$1:$CD$9,8,FALSE)","v":{"$error":"#VALUE!"}},{"$f":"T159-HLOOKUP(Y159,Feuil2!$C$1:$CD$9,9,FALSE)","v":{"$error":"#VALUE!"}},null,null,null,null,null,null,null,{"$error":"#VALUE!"},2017,null,{"$f":"IF(AQ159,VLOOKUP(AQ159,HOM!$AS$389:$AT$444,2))","v":4.4930000000000003}]
["H",null,null,null,null,null,null,null,null,null,null,null,null,null,"",null,null,null,"","","","","",false,{"$f":"IF(AND(H160<1920),VLOOKUP(I160,Feuil2!$F$10:$P$28,11),IF(AND(H160>=1920,H160<1939),VLOOKUP(I160,Feuil2!$F$10:$P$28,11),IF(AND(H160>=1938,H160<1943),VLOOKUP(I160,Feuil2!$F$10:$P$28,10),IF(AND(H160>=1943,H160<1948),VLOOKUP(I160,Feuil2!$F$10:$P$28,9),IF(AND(H160>=1948,H160<1953),VLOOKUP(I160,Feuil2!$F$10:$P$28,8),IF(AND(H160>=1953,H160<1958),VLOOKUP(I160,Feuil2!$F$10:$P$28,7),IF(AND(H160>=1958,H160<1963),VLOOKUP(I160,Feuil2!$F$10:$P$28,6),IF(AND(H160>=1963,H160<1968),VLOOKUP(I160,Feuil2!$F$10:$P$28,5),IF(AND(H160>=1968,H160<1973),VLOOKUP(I160,Feuil2!$F$10:$P$28,4),IF(AND(H160>=1973,H160<1978),VLOOKUP(I160,Feuil2!$F$10:$P$28,3),IF(AND(H160>=1978,H160<1983),VLOOKUP(I160,Feuil2!$F$10:$P$28,2),VLOOKUP(I160,Feuil2!$F$10:$P$28,2))))))))))))","v":{"$error":"#N/A"}},null,{"$f":"T160-HLOOKUP(Y160,Feuil2!$C$1:$CD$9,2,FALSE)","v":{"$error":"#VALUE!"}},{"$f":"T160-HLOOKUP(Y160,Feuil2!$C$1:$CD$9,3,FALSE)","v":{"$error":"#VALUE!"}},{"$f":"T160-HLOOKUP(Y160,Feuil2!$C$1:$CD$9,4,FALSE)","v":{"$error":"#VALUE!"}},{"$f":"T160-HLOOKUP(Y160,Feuil2!$C$1:$CD$9,5,FALSE)","v":{"$error":"#VALUE!"}},{"$f":"T160-HLOOKUP(Y160,Feuil2!$C$1:$CD$9,6,FALSE)","v":{"$error":"#VALUE!"}},{"$f":"T160-HLOOKUP(Y160,Feuil2!$C$1:$CD$9,7,FALSE)","v":{"$error":"#VALUE!"}},{"$f":"T160-HLOOKUP(Y160,Feuil2!$C$1:$CD$9,8,FALSE)","v":{"$error":"#VALUE!"}},{"$f":"T160-HLOOKUP(Y160,Feuil2!$C$1:$CD$9,9,FALSE)","v":{"$error":"#VALUE!"}},null,null,null,null,null,null,null,{"$error":"#VALUE!"},2017,null,{"$f":"IF(AQ160,VLOOKUP(AQ160,HOM!$AS$389:$AT$444,2))","v":4.4930000000000003}]
["H",null,null,null,null,null,null,null,null,null,null,null,null,null,"",null,null,null,"","","","","",false,{"$f":"IF(AND(H161<1920),VLOOKUP(I161,Feuil2!$F$10:$P$28,11),IF(AND(H161>=1920,H161<1939),VLOOKUP(I161,Feuil2!$F$10:$P$28,11),IF(AND(H161>=1938,H161<1943),VLOOKUP(I161,Feuil2!$F$10:$P$28,10),IF(AND(H161>=1943,H161<1948),VLOOKUP(I161,Feuil2!$F$10:$P$28,9),IF(AND(H161>=1948,H161<1953),VLOOKUP(I161,Feuil2!$F$10:$P$28,8),IF(AND(H161>=1953,H161<1958),VLOOKUP(I161,Feuil2!$F$10:$P$28,7),IF(AND(H161>=1958,H161<1963),VLOOKUP(I161,Feuil2!$F$10:$P$28,6),IF(AND(H161>=1963,H161<1968),VLOOKUP(I161,Feuil2!$F$10:$P$28,5),IF(AND(H161>=1968,H161<1973),VLOOKUP(I161,Feuil2!$F$10:$P$28,4),IF(AND(H161>=1973,H161<1978),VLOOKUP(I161,Feuil2!$F$10:$P$28,3),IF(AND(H161>=1978,H161<1983),VLOOKUP(I161,Feuil2!$F$10:$P$28,2),VLOOKUP(I161,Feuil2!$F$10:$P$28,2))))))))))))","v":{"$error":"#N/A"}},null,{"$f":"T161-HLOOKUP(Y161,Feuil2!$C$1:$CD$9,2,FALSE)","v":{"$error":"#VALUE!"}},{"$f":"T161-HLOOKUP(Y161,Feuil2!$C$1:$CD$9,3,FALSE)","v":{"$error":"#VALUE!"}},{"$f":"T161-HLOOKUP(Y161,Feuil2!$C$1:$CD$9,4,FALSE)","v":{"$error":"#VALUE!"}},{"$f":"T161-HLOOKUP(Y161,Feuil2!$C$1:$CD$9,5,FALSE)","v":{"$error":"#VALUE!"}},{"$f":"T161-HLOOKUP(Y161,Feuil2!$C$1:$CD$9,6,FALSE)","v":{"$error":"#VALUE!"}},{"$f":"T161-HLOOKUP(Y161,Feuil2!$C$1:$CD$9,7,FALSE)","v":{"$error":"#VALUE!"}},{"$f":"T161-HLOOKUP(Y161,Feuil2!$C$1:$CD$9,8,FALSE)","v":{"$error":"#VALUE!"}},{"$f":"T161-HLOOKUP(Y161,Feuil2!$C$1:$CD$9,9,FALSE)","v":{"$error":"#VALUE!"}},null,null,null,null,null,null,null,{"$error":"#VALUE!"},2017,null,{"$f":"IF(AQ161,VLOOKUP(AQ161,HOM!$AS$389:$AT$444,2))","v":4.4930000000000003}]
["H",null,null,null,null,null,null,null,null,null,null,null,null,null,"",null,null,null,"","","","","",false,{"$f":"IF(AND(H162<1920),VLOOKUP(I162,Feuil2!$F$10:$P$28,11),IF(AND(H162>=1920,H162<1939),VLOOKUP(I162,Feuil2!$F$10:$P$28,11),IF(AND(H162>=1938,H162<1943),VLOOKUP(I162,Feuil2!$F$10:$P$28,10),IF(AND(H162>=1943,H162<1948),VLOOKUP(I162,Feuil2!$F$10:$P$28,9),IF(AND(H162>=1948,H162<1953),VLOOKUP(I162,Feuil2!$F$10:$P$28,8),IF(AND(H162>=1953,H162<1958),VLOOKUP(I162,Feuil2!$F$10:$P$28,7),IF(AND(H162>=1958,H162<1963),VLOOKUP(I162,Feuil2!$F$10:$P$28,6),IF(AND(H162>=1963,H162<1968),VLOOKUP(I162,Feuil2!$F$10:$P$28,5),IF(AND(H162>=1968,H162<1973),VLOOKUP(I162,Feuil2!$F$10:$P$28,4),IF(AND(H162>=1973,H162<1978),VLOOKUP(I162,Feuil2!$F$10:$P$28,3),IF(AND(H162>=1978,H162<1983),VLOOKUP(I162,Feuil2!$F$10:$P$28,2),VLOOKUP(I162,Feuil2!$F$10:$P$28,2))))))))))))","v":{"$error":"#N/A"}},null,{"$f":"T162-HLOOKUP(Y162,Feuil2!$C$1:$CD$9,2,FALSE)","v":{"$error":"#VALUE!"}},{"$f":"T162-HLOOKUP(Y162,Feuil2!$C$1:$CD$9,3,FALSE)","v":{"$error":"#VALUE!"}},{"$f":"T162-HLOOKUP(Y162,Feuil2!$C$1:$CD$9,4,FALSE)","v":{"$error":"#VALUE!"}},{"$f":"T162-HLOOKUP(Y162,Feuil2!$C$1:$CD$9,5,FALSE)","v":{"$error":"#VALUE!"}},{"$f":"T162-HLOOKUP(Y162,Feuil2!$C$1:$CD$9,6,FALSE)","v":{"$error":"#VALUE!"}},{"$f":"T162-HLOOKUP(Y162,Feuil2!$C$1:$CD$9,7,FALSE)","v":{"$error":"#VALUE!"}},{"$f":"T162-HLOOKUP(Y162,Feuil2!$C$1:$CD$9,8,FALSE)","v":{"$error":"#VALUE!"}},{"$f":"T162-HLOOKUP(Y162,Feuil2!$C$1:$CD$9,9,FALSE)","v":{"$error":"#VALUE!"}},null,null,null,null,null,null,null,{"$error":"#VALUE!"},2017,null,{"$f":"IF(AQ162,VLOOKUP(AQ162,HOM!$AS$389:$AT$444,2))","v":4.4930000000000003}]
["H",null,null,null,null,null,null,null,null,null,null,null,null,null,"",null,null,null,"","","","","",false,{"$f":"IF(AND(H163<1920),VLOOKUP(I163,Feuil2!$F$10:$P$28,11),IF(AND(H163>=1920,H163<1939),VLOOKUP(I163,Feuil2!$F$10:$P$28,11),IF(AND(H163>=1938,H163<1943),VLOOKUP(I163,Feuil2!$F$10:$P$28,10),IF(AND(H163>=1943,H163<1948),VLOOKUP(I163,Feuil2!$F$10:$P$28,9),IF(AND(H163>=1948,H163<1953),VLOOKUP(I163,Feuil2!$F$10:$P$28,8),IF(AND(H163>=1953,H163<1958),VLOOKUP(I163,Feuil2!$F$10:$P$28,7),IF(AND(H163>=1958,H163<1963),VLOOKUP(I163,Feuil2!$F$10:$P$28,6),IF(AND(H163>=1963,H163<1968),VLOOKUP(I163,Feuil2!$F$10:$P$28,5),IF(AND(H163>=1968,H163<1973),VLOOKUP(I163,Feuil2!$F$10:$P$28,4),IF(AND(H163>=1973,H163<1978),VLOOKUP(I163,Feuil2!$F$10:$P$28,3),IF(AND(H163>=1978,H163<1983),VLOOKUP(I163,Feuil2!$F$10:$P$28,2),VLOOKUP(I163,Feuil2!$F$10:$P$28,2))))))))))))","v":{"$error":"#N/A"}},null,{"$f":"T163-HLOOKUP(Y163,Feuil2!$C$1:$CD$9,2,FALSE)","v":{"$error":"#VALUE!"}},{"$f":"T163-HLOOKUP(Y163,Feuil2!$C$1:$CD$9,3,FALSE)","v":{"$error":"#VALUE!"}},{"$f":"T163-HLOOKUP(Y163,Feuil2!$C$1:$CD$9,4,FALSE)","v":{"$error":"#VALUE!"}},{"$f":"T163-HLOOKUP(Y163,Feuil2!$C$1:$CD$9,5,FALSE)","v":{"$error":"#VALUE!"}},{"$f":"T163-HLOOKUP(Y163,Feuil2!$C$1:$CD$9,6,FALSE)","v":{"$error":"#VALUE!"}},{"$f":"T163-HLOOKUP(Y163,Feuil2!$C$1:$CD$9,7,FALSE)","v":{"$error":"#VALUE!"}},{"$f":"T163-HLOOKUP(Y163,Feuil2!$C$1:$CD$9,8,FALSE)","v":{"$error":"#VALUE!"}},{"$f":"T163-HLOOKUP(Y163,Feuil2!$C$1:$CD$9,9,FALSE)","v":{"$error":"#VALUE!"}},null,null,null,null,null,null,null,{"$error":"#VALUE!"},2017,null,{"$f":"IF(AQ163,VLOOKUP(AQ163,HOM!$AS$389:$AT$444,2))","v":4.4930000000000003}]
["H",null,null,null,null,null,null,null,null,null,null,null,null,null,"",null,null,null,"","","","","",false,{"$f":"IF(AND(H164<1920),VLOOKUP(I164,Feuil2!$F$10:$P$28,11),IF(AND(H164>=1920,H164<1939),VLOOKUP(I164,Feuil2!$F$10:$P$28,11),IF(AND(H164>=1938,H164<1943),VLOOKUP(I164,Feuil2!$F$10:$P$28,10),IF(AND(H164>=1943,H164<1948),VLOOKUP(I164,Feuil2!$F$10:$P$28,9),IF(AND(H164>=1948,H164<1953),VLOOKUP(I164,Feuil2!$F$10:$P$28,8),IF(AND(H164>=1953,H164<1958),VLOOKUP(I164,Feuil2!$F$10:$P$28,7),IF(AND(H164>=1958,H164<1963),VLOOKUP(I164,Feuil2!$F$10:$P$28,6),IF(AND(H164>=1963,H164<1968),VLOOKUP(I164,Feuil2!$F$10:$P$28,5),IF(AND(H164>=1968,H164<1973),VLOOKUP(I164,Feuil2!$F$10:$P$28,4),IF(AND(H164>=1973,H164<1978),VLOOKUP(I164,Feuil2!$F$10:$P$28,3),IF(AND(H164>=1978,H164<1983),VLOOKUP(I164,Feuil2!$F$10:$P$28,2),VLOOKUP(I164,Feuil2!$F$10:$P$28,2))))))))))))","v":{"$error":"#N/A"}},null,{"$f":"T164-HLOOKUP(Y164,Feuil2!$C$1:$CD$9,2,FALSE)","v":{"$error":"#VALUE!"}},{"$f":"T164-HLOOKUP(Y164,Feuil2!$C$1:$CD$9,3,FALSE)","v":{"$error":"#VALUE!"}},{"$f":"T164-HLOOKUP(Y164,Feuil2!$C$1:$CD$9,4,FALSE)","v":{"$error":"#VALUE!"}},{"$f":"T164-HLOOKUP(Y164,Feuil2!$C$1:$CD$9,5,FALSE)","v":{"$error":"#VALUE!"}},{"$f":"T164-HLOOKUP(Y164,Feuil2!$C$1:$CD$9,6,FALSE)","v":{"$error":"#VALUE!"}},{"$f":"T164-HLOOKUP(Y164,Feuil2!$C$1:$CD$9,7,FALSE)","v":{"$error":"#VALUE!"}},{"$f":"T164-HLOOKUP(Y164,Feuil2!$C$1:$CD$9,8,FALSE)","v":{"$error":"#VALUE!"}},{"$f":"T164-HLOOKUP(Y164,Feuil2!$C$1:$CD$9,9,FALSE)","v":{"$error":"#VALUE!"}},null,null,null,null,null,null,null,{"$error":"#VALUE!"},2017,null,{"$f":"IF(AQ164,VLOOKUP(AQ164,HOM!$AS$389:$AT$444,2))","v":4.4930000000000003}]
["H",null,null,null,null,null,null,null,null,null,null,null,null,null,"",null,null,null,"","","","","",false,{"$f":"IF(AND(H165<1920),VLOOKUP(I165,Feuil2!$F$10:$P$28,11),IF(AND(H165>=1920,H165<1939),VLOOKUP(I165,Feuil2!$F$10:$P$28,11),IF(AND(H165>=1938,H165<1943),VLOOKUP(I165,Feuil2!$F$10:$P$28,10),IF(AND(H165>=1943,H165<1948),VLOOKUP(I165,Feuil2!$F$10:$P$28,9),IF(AND(H165>=1948,H165<1953),VLOOKUP(I165,Feuil2!$F$10:$P$28,8),IF(AND(H165>=1953,H165<1958),VLOOKUP(I165,Feuil2!$F$10:$P$28,7),IF(AND(H165>=1958,H165<1963),VLOOKUP(I165,Feuil2!$F$10:$P$28,6),IF(AND(H165>=1963,H165<1968),VLOOKUP(I165,Feuil2!$F$10:$P$28,5),IF(AND(H165>=1968,H165<1973),VLOOKUP(I165,Feuil2!$F$10:$P$28,4),IF(AND(H165>=1973,H165<1978),VLOOKUP(I165,Feuil2!$F$10:$P$28,3),IF(AND(H165>=1978,H165<1983),VLOOKUP(I165,Feuil2!$F$10:$P$28,2),VLOOKUP(I165,Feuil2!$F$10:$P$28,2))))))))))))","v":{"$error":"#N/A"}},null,{"$f":"T165-HLOOKUP(Y165,Feuil2!$C$1:$CD$9,2,FALSE)","v":{"$error":"#VALUE!"}},{"$f":"T165-HLOOKUP(Y165,Feuil2!$C$1:$CD$9,3,FALSE)","v":{"$error":"#VALUE!"}},{"$f":"T165-HLOOKUP(Y165,Feuil2!$C$1:$CD$9,4,FALSE)","v":{"$error":"#VALUE!"}},{"$f":"T165-HLOOKUP(Y165,Feuil2!$C$1:$CD$9,5,FALSE)","v":{"$error":"#VALUE!"}},{"$f":"T165-HLOOKUP(Y165,Feuil2!$C$1:$CD$9,6,FALSE)","v":{"$error":"#VALUE!"}},{"$f":"T165-HLOOKUP(Y165,Feuil2!$C$1:$CD$9,7,FALSE)","v":{"$error":"#VALUE!"}},{"$f":"T165-HLOOKUP(Y165,Feuil2!$C$1:$CD$9,8,FALSE)","v":{"$error":"#VALUE!"}},{"$f":"T165-HLOOKUP(Y165,Feuil2!$C$1:$CD$9,9,FALSE)","v":{"$error":"#VALUE!"}},null,null,null,null,null,null,null,{"$error":"#VALUE!"},2017,null,{"$f":"IF(AQ165,VLOOKUP(AQ165,HOM!$AS$389:$AT$444,2))","v":4.4930000000000003}]
["H",null,null,null,null,null,null,null,null,null,null,null,null,null,"",null,null,null,{"$f":"IF(I166=\"\",\"\",IF(MAXA(P166:R166)<=0,0,MAXA(P166:R166)))","v":""},{"$f":"IF(I166=\"\",\"\",IF(OR(O166=0,S166=0),0,O166+S166))","v":""},"",{"$f":"IF(I166=\"\",\"\",AP166)","v":""},{"$f":"IF(I166=\"\",\"\",IF(AH166>=0,AH166,IF(AG166>=0,AG166,IF(AF166>=0,AF166,IF(AE166>=0,AE166,IF(AD166>=0,AD166,IF(AC166>=0,AC166,IF(AB166>=0,AB166,AA166))))))))","v":""},{"$f":"IF(AQ166<95,IF(AQ166<=90,VLOOKUP(AQ166,$AQ$255:$AR$444,2)))","v":false},{"$f":"IF(AND(H166<1920),VLOOKUP(I166,Feuil2!$F$10:$P$28,11),IF(AND(H166>=1920,H166<1939),VLOOKUP(I166,Feuil2!$F$10:$P$28,11),IF(AND(H166>=1938,H166<1943),VLOOKUP(I166,Feuil2!$F$10:$P$28,10),IF(AND(H166>=1943,H166<1948),VLOOKUP(I166,Feuil2!$F$10:$P$28,9),IF(AND(H166>=1948,H166<1953),VLOOKUP(I166,Feuil2!$F$10:$P$28,8),IF(AND(H166>=1953,H166<1958),VLOOKUP(I166,Feuil2!$F$10:$P$28,7),IF(AND(H166>=1958,H166<1963),VLOOKUP(I166,Feuil2!$F$10:$P$28,6),IF(AND(H166>=1963,H166<1968),VLOOKUP(I166,Feuil2!$F$10:$P$28,5),IF(AND(H166>=1968,H166<1973),VLOOKUP(I166,Feuil2!$F$10:$P$28,4),IF(AND(H166>=1973,H166<1978),VLOOKUP(I166,Feuil2!$F$10:$P$28,3),IF(AND(H166>=1978,H166<1983),VLOOKUP(I166,Feuil2!$F$10:$P$28,2),VLOOKUP(I166,Feuil2!$F$10:$P$28,2))))))))))))","v":{"$error":"#N/A"}},null,{"$f":"T166-HLOOKUP(Y166,Feuil2!$C$1:$CD$9,2,FALSE)","v":{"$error":"#VALUE!"}},{"$f":"T166-HLOOKUP(Y166,Feuil2!$C$1:$CD$9,3,FALSE)","v":{"$error":"#VALUE!"}},{"$f":"T166-HLOOKUP(Y166,Feuil2!$C$1:$CD$9,4,FALSE)","v":{"$error":"#VALUE!"}},{"$f":"T166-HLOOKUP(Y166,Feuil2!$C$1:$CD$9,5,FALSE)","v":{"$error":"#VALUE!"}},{"$f":"T166-HLOOKUP(Y166,Feuil2!$C$1:$CD$9,6,FALSE)","v":{"$error":"#VALUE!"}},{"$f":"T166-HLOOKUP(Y166,Feuil2!$C$1:$CD$9,7,FALSE)","v":{"$error":"#VALUE!"}},{"$f":"T166-HLOOKUP(Y166,Feuil2!$C$1:$CD$9,8,FALSE)","v":{"$error":"#VALUE!"}},{"$f":"T166-HLOOKUP(Y166,Feuil2!$C$1:$CD$9,9,FALSE)","v":{"$error":"#VALUE!"}},null,null,null,null,null,null,null,{"$f":"IF(AH166>=0,$AH$5,IF(AG166>=0,$AG$5,IF(AF166>=0,$AF$5,IF(AE166>=0,$AE$5,IF(AD166>=0,$AD$5,IF(AC166>=0,$AC$5,IF(AB166>=0,$AB$5,IF(AA166>=0,$AA$5,$AI$5))))))))","v":{"$error":"#VALUE!"}},{"$f":"2017-H166","v":2017},null,{"$f":"IF(AQ166,VLOOKUP(AQ166,HOM!$AS$389:$AT$444,2))","v":4.4930000000000003}]
["H",null,null,null,null,null,null,null,null,null,null,null,null,null,"",null,null,null,"","","","","",false,{"$f":"IF(AND(H167<1920),VLOOKUP(I167,Feuil2!$F$10:$P$28,11),IF(AND(H167>=1920,H167<1939),VLOOKUP(I167,Feuil2!$F$10:$P$28,11),IF(AND(H167>=1938,H167<1943),VLOOKUP(I167,Feuil2!$F$10:$P$28,10),IF(AND(H167>=1943,H167<1948),VLOOKUP(I167,Feuil2!$F$10:$P$28,9),IF(AND(H167>=1948,H167<1953),VLOOKUP(I167,Feuil2!$F$10:$P$28,8),IF(AND(H167>=1953,H167<1958),VLOOKUP(I167,Feuil2!$F$10:$P$28,7),IF(AND(H167>=1958,H167<1963),VLOOKUP(I167,Feuil2!$F$10:$P$28,6),IF(AND(H167>=1963,H167<1968),VLOOKUP(I167,Feuil2!$F$10:$P$28,5),IF(AND(H167>=1968,H167<1973),VLOOKUP(I167,Feuil2!$F$10:$P$28,4),IF(AND(H167>=1973,H167<1978),VLOOKUP(I167,Feuil2!$F$10:$P$28,3),IF(AND(H167>=1978,H167<1983),VLOOKUP(I167,Feuil2!$F$10:$P$28,2),VLOOKUP(I167,Feuil2!$F$10:$P$28,2))))))))))))","v":{"$error":"#N/A"}},null,{"$f":"T167-HLOOKUP(Y167,Feuil2!$C$1:$CD$9,2,FALSE)","v":{"$error":"#VALUE!"}},{"$f":"T167-HLOOKUP(Y167,Feuil2!$C$1:$CD$9,3,FALSE)","v":{"$error":"#VALUE!"}},{"$f":"T167-HLOOKUP(Y167,Feuil2!$C$1:$CD$9,4,FALSE)","v":{"$error":"#VALUE!"}},{"$f":"T167-HLOOKUP(Y167,Feuil2!$C$1:$CD$9,5,FALSE)","v":{"$error":"#VALUE!"}},{"$f":"T167-HLOOKUP(Y167,Feuil2!$C$1:$CD$9,6,FALSE)","v":{"$error":"#VALUE!"}},{"$f":"T167-HLOOKUP(Y167,Feuil2!$C$1:$CD$9,7,FALSE)","v":{"$error":"#VALUE!"}},{"$f":"T167-HLOOKUP(Y167,Feuil2!$C$1:$CD$9,8,FALSE)","v":{"$error":"#VALUE!"}},{"$f":"T167-HLOOKUP(Y167,Feuil2!$C$1:$CD$9,9,FALSE)","v":{"$error":"#VALUE!"}},null,null,null,null,null,null,null,{"$error":"#VALUE!"},2017,null,{"$f":"IF(AQ167,VLOOKUP(AQ167,HOM!$AS$389:$AT$444,2))","v":4.4930000000000003}]
["H",null,null,null,null,null,null,null,null,null,null,null,null,null,"",null,null,null,"","","","","",false,{"$f":"IF(AND(H168<1920),VLOOKUP(I168,Feuil2!$F$10:$P$28,11),IF(AND(H168>=1920,H168<1939),VLOOKUP(I168,Feuil2!$F$10:$P$28,11),IF(AND(H168>=1938,H168<1943),VLOOKUP(I168,Feuil2!$F$10:$P$28,10),IF(AND(H168>=1943,H168<1948),VLOOKUP(I168,Feuil2!$F$10:$P$28,9),IF(AND(H168>=1948,H168<1953),VLOOKUP(I168,Feuil2!$F$10:$P$28,8),IF(AND(H168>=1953,H168<1958),VLOOKUP(I168,Feuil2!$F$10:$P$28,7),IF(AND(H168>=1958,H168<1963),VLOOKUP(I168,Feuil2!$F$10:$P$28,6),IF(AND(H168>=1963,H168<1968),VLOOKUP(I168,Feuil2!$F$10:$P$28,5),IF(AND(H168>=1968,H168<1973),VLOOKUP(I168,Feuil2!$F$10:$P$28,4),IF(AND(H168>=1973,H168<1978),VLOOKUP(I168,Feuil2!$F$10:$P$28,3),IF(AND(H168>=1978,H168<1983),VLOOKUP(I168,Feuil2!$F$10:$P$28,2),VLOOKUP(I168,Feuil2!$F$10:$P$28,2))))))))))))","v":{"$error":"#N/A"}},null,{"$f":"T168-HLOOKUP(Y168,Feuil2!$C$1:$CD$9,2,FALSE)","v":{"$error":"#VALUE!"}},{"$f":"T168-HLOOKUP(Y168,Feuil2!$C$1:$CD$9,3,FALSE)","v":{"$error":"#VALUE!"}},{"$f":"T168-HLOOKUP(Y168,Feuil2!$C$1:$CD$9,4,FALSE)","v":{"$error":"#VALUE!"}},{"$f":"T168-HLOOKUP(Y168,Feuil2!$C$1:$CD$9,5,FALSE)","v":{"$error":"#VALUE!"}},{"$f":"T168-HLOOKUP(Y168,Feuil2!$C$1:$CD$9,6,FALSE)","v":{"$error":"#VALUE!"}},{"$f":"T168-HLOOKUP(Y168,Feuil2!$C$1:$CD$9,7,FALSE)","v":{"$error":"#VALUE!"}},{"$f":"T168-HLOOKUP(Y168,Feuil2!$C$1:$CD$9,8,FALSE)","v":{"$error":"#VALUE!"}},{"$f":"T168-HLOOKUP(Y168,Feuil2!$C$1:$CD$9,9,FALSE)","v":{"$error":"#VALUE!"}},null,null,null,null,null,null,null,{"$error":"#VALUE!"},2017,null,{"$f":"IF(AQ168,VLOOKUP(AQ168,HOM!$AS$389:$AT$444,2))","v":4.4930000000000003}]
["H",null,null,null,null,null,null,null,null,null,null,null,null,null,"",null,null,null,"","","","","",false,{"$f":"IF(AND(H169<1920),VLOOKUP(I169,Feuil2!$F$10:$P$28,11),IF(AND(H169>=1920,H169<1939),VLOOKUP(I169,Feuil2!$F$10:$P$28,11),IF(AND(H169>=1938,H169<1943),VLOOKUP(I169,Feuil2!$F$10:$P$28,10),IF(AND(H169>=1943,H169<1948),VLOOKUP(I169,Feuil2!$F$10:$P$28,9),IF(AND(H169>=1948,H169<1953),VLOOKUP(I169,Feuil2!$F$10:$P$28,8),IF(AND(H169>=1953,H169<1958),VLOOKUP(I169,Feuil2!$F$10:$P$28,7),IF(AND(H169>=1958,H169<1963),VLOOKUP(I169,Feuil2!$F$10:$P$28,6),IF(AND(H169>=1963,H169<1968),VLOOKUP(I169,Feuil2!$F$10:$P$28,5),IF(AND(H169>=1968,H169<1973),VLOOKUP(I169,Feuil2!$F$10:$P$28,4),IF(AND(H169>=1973,H169<1978),VLOOKUP(I169,Feuil2!$F$10:$P$28,3),IF(AND(H169>=1978,H169<1983),VLOOKUP(I169,Feuil2!$F$10:$P$28,2),VLOOKUP(I169,Feuil2!$F$10:$P$28,2))))))))))))","v":{"$error":"#N/A"}},null,{"$f":"T169-HLOOKUP(Y169,Feuil2!$C$1:$CD$9,2,FALSE)","v":{"$error":"#VALUE!"}},{"$f":"T169-HLOOKUP(Y169,Feuil2!$C$1:$CD$9,3,FALSE)","v":{"$error":"#VALUE!"}},{"$f":"T169-HLOOKUP(Y169,Feuil2!$C$1:$CD$9,4,FALSE)","v":{"$error":"#VALUE!"}},{"$f":"T169-HLOOKUP(Y169,Feuil2!$C$1:$CD$9,5,FALSE)","v":{"$error":"#VALUE!"}},{"$f":"T169-HLOOKUP(Y169,Feuil2!$C$1:$CD$9,6,FALSE)","v":{"$error":"#VALUE!"}},{"$f":"T169-HLOOKUP(Y169,Feuil2!$C$1:$CD$9,7,FALSE)","v":{"$error":"#VALUE!"}},{"$f":"T169-HLOOKUP(Y169,Feuil2!$C$1:$CD$9,8,FALSE)","v":{"$error":"#VALUE!"}},{"$f":"T169-HLOOKUP(Y169,Feuil2!$C$1:$CD$9,9,FALSE)","v":{"$error":"#VALUE!"}},null,null,null,null,null,null,null,{"$error":"#VALUE!"},2017,null,{"$f":"IF(AQ169,VLOOKUP(AQ169,HOM!$AS$389:$AT$444,2))","v":4.4930000000000003}]
["H",null,null,null,null,null,null,null,null,null,null,null,null,null,"",null,null,null,"","","","","",false,{"$f":"IF(AND(H170<1920),VLOOKUP(I170,Feuil2!$F$10:$P$28,11),IF(AND(H170>=1920,H170<1939),VLOOKUP(I170,Feuil2!$F$10:$P$28,11),IF(AND(H170>=1938,H170<1943),VLOOKUP(I170,Feuil2!$F$10:$P$28,10),IF(AND(H170>=1943,H170<1948),VLOOKUP(I170,Feuil2!$F$10:$P$28,9),IF(AND(H170>=1948,H170<1953),VLOOKUP(I170,Feuil2!$F$10:$P$28,8),IF(AND(H170>=1953,H170<1958),VLOOKUP(I170,Feuil2!$F$10:$P$28,7),IF(AND(H170>=1958,H170<1963),VLOOKUP(I170,Feuil2!$F$10:$P$28,6),IF(AND(H170>=1963,H170<1968),VLOOKUP(I170,Feuil2!$F$10:$P$28,5),IF(AND(H170>=1968,H170<1973),VLOOKUP(I170,Feuil2!$F$10:$P$28,4),IF(AND(H170>=1973,H170<1978),VLOOKUP(I170,Feuil2!$F$10:$P$28,3),IF(AND(H170>=1978,H170<1983),VLOOKUP(I170,Feuil2!$F$10:$P$28,2),VLOOKUP(I170,Feuil2!$F$10:$P$28,2))))))))))))","v":{"$error":"#N/A"}},null,{"$f":"T170-HLOOKUP(Y170,Feuil2!$C$1:$CD$9,2,FALSE)","v":{"$error":"#VALUE!"}},{"$f":"T170-HLOOKUP(Y170,Feuil2!$C$1:$CD$9,3,FALSE)","v":{"$error":"#VALUE!"}},{"$f":"T170-HLOOKUP(Y170,Feuil2!$C$1:$CD$9,4,FALSE)","v":{"$error":"#VALUE!"}},{"$f":"T170-HLOOKUP(Y170,Feuil2!$C$1:$CD$9,5,FALSE)","v":{"$error":"#VALUE!"}},{"$f":"T170-HLOOKUP(Y170,Feuil2!$C$1:$CD$9,6,FALSE)","v":{"$error":"#VALUE!"}},{"$f":"T170-HLOOKUP(Y170,Feuil2!$C$1:$CD$9,7,FALSE)","v":{"$error":"#VALUE!"}},{"$f":"T170-HLOOKUP(Y170,Feuil2!$C$1:$CD$9,8,FALSE)","v":{"$error":"#VALUE!"}},{"$f":"T170-HLOOKUP(Y170,Feuil2!$C$1:$CD$9,9,FALSE)","v":{"$error":"#VALUE!"}},null,null,null,null,null,null,null,{"$error":"#VALUE!"},2017,null,{"$f":"IF(AQ170,VLOOKUP(AQ170,HOM!$AS$389:$AT$444,2))","v":4.4930000000000003}]
["H",null,null,null,null,null,null,null,null,null,null,null,null,null,"",null,null,null,"","","","","",false,{"$f":"IF(AND(H171<1920),VLOOKUP(I171,Feuil2!$F$10:$P$28,11),IF(AND(H171>=1920,H171<1939),VLOOKUP(I171,Feuil2!$F$10:$P$28,11),IF(AND(H171>=1938,H171<1943),VLOOKUP(I171,Feuil2!$F$10:$P$28,10),IF(AND(H171>=1943,H171<1948),VLOOKUP(I171,Feuil2!$F$10:$P$28,9),IF(AND(H171>=1948,H171<1953),VLOOKUP(I171,Feuil2!$F$10:$P$28,8),IF(AND(H171>=1953,H171<1958),VLOOKUP(I171,Feuil2!$F$10:$P$28,7),IF(AND(H171>=1958,H171<1963),VLOOKUP(I171,Feuil2!$F$10:$P$28,6),IF(AND(H171>=1963,H171<1968),VLOOKUP(I171,Feuil2!$F$10:$P$28,5),IF(AND(H171>=1968,H171<1973),VLOOKUP(I171,Feuil2!$F$10:$P$28,4),IF(AND(H171>=1973,H171<1978),VLOOKUP(I171,Feuil2!$F$10:$P$28,3),IF(AND(H171>=1978,H171<1983),VLOOKUP(I171,Feuil2!$F$10:$P$28,2),VLOOKUP(I171,Feuil2!$F$10:$P$28,2))))))))))))","v":{"$error":"#N/A"}},null,{"$f":"T171-HLOOKUP(Y171,Feuil2!$C$1:$CD$9,2,FALSE)","v":{"$error":"#VALUE!"}},{"$f":"T171-HLOOKUP(Y171,Feuil2!$C$1:$CD$9,3,FALSE)","v":{"$error":"#VALUE!"}},{"$f":"T171-HLOOKUP(Y171,Feuil2!$C$1:$CD$9,4,FALSE)","v":{"$error":"#VALUE!"}},{"$f":"T171-HLOOKUP(Y171,Feuil2!$C$1:$CD$9,5,FALSE)","v":{"$error":"#VALUE!"}},{"$f":"T171-HLOOKUP(Y171,Feuil2!$C$1:$CD$9,6,FALSE)","v":{"$error":"#VALUE!"}},{"$f":"T171-HLOOKUP(Y171,Feuil2!$C$1:$CD$9,7,FALSE)","v":{"$error":"#VALUE!"}},{"$f":"T171-HLOOKUP(Y171,Feuil2!$C$1:$CD$9,8,FALSE)","v":{"$error":"#VALUE!"}},{"$f":"T171-HLOOKUP(Y171,Feuil2!$C$1:$CD$9,9,FALSE)","v":{"$error":"#VALUE!"}},null,null,null,null,null,null,null,{"$error":"#VALUE!"},2017,null,{"$f":"IF(AQ171,VLOOKUP(AQ171,HOM!$AS$389:$AT$444,2))","v":4.4930000000000003}]
["H",null,null,null,null,null,null,null,null,null,null,null,null,null,"",null,null,null,"","","","","",false,{"$f":"IF(AND(H172<1920),VLOOKUP(I172,Feuil2!$F$10:$P$28,11),IF(AND(H172>=1920,H172<1939),VLOOKUP(I172,Feuil2!$F$10:$P$28,11),IF(AND(H172>=1938,H172<1943),VLOOKUP(I172,Feuil2!$F$10:$P$28,10),IF(AND(H172>=1943,H172<1948),VLOOKUP(I172,Feuil2!$F$10:$P$28,9),IF(AND(H172>=1948,H172<1953),VLOOKUP(I172,Feuil2!$F$10:$P$28,8),IF(AND(H172>=1953,H172<1958),VLOOKUP(I172,Feuil2!$F$10:$P$28,7),IF(AND(H172>=1958,H172<1963),VLOOKUP(I172,Feuil2!$F$10:$P$28,6),IF(AND(H172>=1963,H172<1968),VLOOKUP(I172,Feuil2!$F$10:$P$28,5),IF(AND(H172>=1968,H172<1973),VLOOKUP(I172,Feuil2!$F$10:$P$28,4),IF(AND(H172>=1973,H172<1978),VLOOKUP(I172,Feuil2!$F$10:$P$28,3),IF(AND(H172>=1978,H172<1983),VLOOKUP(I172,Feuil2!$F$10:$P$28,2),VLOOKUP(I172,Feuil2!$F$10:$P$28,2))))))))))))","v":{"$error":"#N/A"}},null,{"$f":"T172-HLOOKUP(Y172,Feuil2!$C$1:$CD$9,2,FALSE)","v":{"$error":"#VALUE!"}},{"$f":"T172-HLOOKUP(Y172,Feuil2!$C$1:$CD$9,3,FALSE)","v":{"$error":"#VALUE!"}},{"$f":"T172-HLOOKUP(Y172,Feuil2!$C$1:$CD$9,4,FALSE)","v":{"$error":"#VALUE!"}},{"$f":"T172-HLOOKUP(Y172,Feuil2!$C$1:$CD$9,5,FALSE)","v":{"$error":"#VALUE!"}},{"$f":"T172-HLOOKUP(Y172,Feuil2!$C$1:$CD$9,6,FALSE)","v":{"$error":"#VALUE!"}},{"$f":"T172-HLOOKUP(Y172,Feuil2!$C$1:$CD$9,7,FALSE)","v":{"$error":"#VALUE!"}},{"$f":"T172-HLOOKUP(Y172,Feuil2!$C$1:$CD$9,8,FALSE)","v":{"$error":"#VALUE!"}},{"$f":"T172-HLOOKUP(Y172,Feuil2!$C$1:$CD$9,9,FALSE)","v":{"$error":"#VALUE!"}},null,null,null,null,null,null,null,{"$error":"#VALUE!"},2017,null,{"$f":"IF(AQ172,VLOOKUP(AQ172,HOM!$AS$389:$AT$444,2))","v":4.4930000000000003}]
["H",null,null,null,null,null,null,null,null,null,null,null,null,null,"",null,null,null,"","","","","",false,{"$f":"IF(AND(H173<1920),VLOOKUP(I173,Feuil2!$F$10:$P$28,11),IF(AND(H173>=1920,H173<1939),VLOOKUP(I173,Feuil2!$F$10:$P$28,11),IF(AND(H173>=1938,H173<1943),VLOOKUP(I173,Feuil2!$F$10:$P$28,10),IF(AND(H173>=1943,H173<1948),VLOOKUP(I173,Feuil2!$F$10:$P$28,9),IF(AND(H173>=1948,H173<1953),VLOOKUP(I173,Feuil2!$F$10:$P$28,8),IF(AND(H173>=1953,H173<1958),VLOOKUP(I173,Feuil2!$F$10:$P$28,7),IF(AND(H173>=1958,H173<1963),VLOOKUP(I173,Feuil2!$F$10:$P$28,6),IF(AND(H173>=1963,H173<1968),VLOOKUP(I173,Feuil2!$F$10:$P$28,5),IF(AND(H173>=1968,H173<1973),VLOOKUP(I173,Feuil2!$F$10:$P$28,4),IF(AND(H173>=1973,H173<1978),VLOOKUP(I173,Feuil2!$F$10:$P$28,3),IF(AND(H173>=1978,H173<1983),VLOOKUP(I173,Feuil2!$F$10:$P$28,2),VLOOKUP(I173,Feuil2!$F$10:$P$28,2))))))))))))","v":{"$error":"#N/A"}},null,{"$f":"T173-HLOOKUP(Y173,Feuil2!$C$1:$CD$9,2,FALSE)","v":{"$error":"#VALUE!"}},{"$f":"T173-HLOOKUP(Y173,Feuil2!$C$1:$CD$9,3,FALSE)","v":{"$error":"#VALUE!"}},{"$f":"T173-HLOOKUP(Y173,Feuil2!$C$1:$CD$9,4,FALSE)","v":{"$error":"#VALUE!"}},{"$f":"T173-HLOOKUP(Y173,Feuil2!$C$1:$CD$9,5,FALSE)","v":{"$error":"#VALUE!"}},{"$f":"T173-HLOOKUP(Y173,Feuil2!$C$1:$CD$9,6,FALSE)","v":{"$error":"#VALUE!"}},{"$f":"T173-HLOOKUP(Y173,Feuil2!$C$1:$CD$9,7,FALSE)","v":{"$error":"#VALUE!"}},{"$f":"T173-HLOOKUP(Y173,Feuil2!$C$1:$CD$9,8,FALSE)","v":{"$error":"#VALUE!"}},{"$f":"T173-HLOOKUP(Y173,Feuil2!$C$1:$CD$9,9,FALSE)","v":{"$error":"#VALUE!"}},null,null,null,null,null,null,null,{"$error":"#VALUE!"},2017,null,{"$f":"IF(AQ173,VLOOKUP(AQ173,HOM!$AS$389:$AT$444,2))","v":4.4930000000000003}]
["H",null,null,null,null,null,null,null,null,null,null,null,null,null,"",null,null,null,"","","","","",false,{"$f":"IF(AND(H174<1920),VLOOKUP(I174,Feuil2!$F$10:$P$28,11),IF(AND(H174>=1920,H174<1939),VLOOKUP(I174,Feuil2!$F$10:$P$28,11),IF(AND(H174>=1938,H174<1943),VLOOKUP(I174,Feuil2!$F$10:$P$28,10),IF(AND(H174>=1943,H174<1948),VLOOKUP(I174,Feuil2!$F$10:$P$28,9),IF(AND(H174>=1948,H174<1953),VLOOKUP(I174,Feuil2!$F$10:$P$28,8),IF(AND(H174>=1953,H174<1958),VLOOKUP(I174,Feuil2!$F$10:$P$28,7),IF(AND(H174>=1958,H174<1963),VLOOKUP(I174,Feuil2!$F$10:$P$28,6),IF(AND(H174>=1963,H174<1968),VLOOKUP(I174,Feuil2!$F$10:$P$28,5),IF(AND(H174>=1968,H174<1973),VLOOKUP(I174,Feuil2!$F$10:$P$28,4),IF(AND(H174>=1973,H174<1978),VLOOKUP(I174,Feuil2!$F$10:$P$28,3),IF(AND(H174>=1978,H174<1983),VLOOKUP(I174,Feuil2!$F$10:$P$28,2),VLOOKUP(I174,Feuil2!$F$10:$P$28,2))))))))))))","v":{"$error":"#N/A"}},null,{"$f":"T174-HLOOKUP(Y174,Feuil2!$C$1:$CD$9,2,FALSE)","v":{"$error":"#VALUE!"}},{"$f":"T174-HLOOKUP(Y174,Feuil2!$C$1:$CD$9,3,FALSE)","v":{"$error":"#VALUE!"}},{"$f":"T174-HLOOKUP(Y174,Feuil2!$C$1:$CD$9,4,FALSE)","v":{"$error":"#VALUE!"}},{"$f":"T174-HLOOKUP(Y174,Feuil2!$C$1:$CD$9,5,FALSE)","v":{"$error":"#VALUE!"}},{"$f":"T174-HLOOKUP(Y174,Feuil2!$C$1:$CD$9,6,FALSE)","v":{"$error":"#VALUE!"}},{"$f":"T174-HLOOKUP(Y174,Feuil2!$C$1:$CD$9,7,FALSE)","v":{"$error":"#VALUE!"}},{"$f":"T174-HLOOKUP(Y174,Feuil2!$C$1:$CD$9,8,FALSE)","v":{"$error":"#VALUE!"}},{"$f":"T174-HLOOKUP(Y174,Feuil2!$C$1:$CD$9,9,FALSE)","v":{"$error":"#VALUE!"}},null,null,null,null,null,null,null,{"$error":"#VALUE!"},2017,null,{"$f":"IF(AQ174,VLOOKUP(AQ174,HOM!$AS$389:$AT$444,2))","v":4.4930000000000003}]
["H",null,null,null,null,null,null,null,null,null,null,null,null,null,"",null,null,null,"","","","","",false,{"$f":"IF(AND(H175<1920),VLOOKUP(I175,Feuil2!$F$10:$P$28,11),IF(AND(H175>=1920,H175<1939),VLOOKUP(I175,Feuil2!$F$10:$P$28,11),IF(AND(H175>=1938,H175<1943),VLOOKUP(I175,Feuil2!$F$10:$P$28,10),IF(AND(H175>=1943,H175<1948),VLOOKUP(I175,Feuil2!$F$10:$P$28,9),IF(AND(H175>=1948,H175<1953),VLOOKUP(I175,Feuil2!$F$10:$P$28,8),IF(AND(H175>=1953,H175<1958),VLOOKUP(I175,Feuil2!$F$10:$P$28,7),IF(AND(H175>=1958,H175<1963),VLOOKUP(I175,Feuil2!$F$10:$P$28,6),IF(AND(H175>=1963,H175<1968),VLOOKUP(I175,Feuil2!$F$10:$P$28,5),IF(AND(H175>=1968,H175<1973),VLOOKUP(I175,Feuil2!$F$10:$P$28,4),IF(AND(H175>=1973,H175<1978),VLOOKUP(I175,Feuil2!$F$10:$P$28,3),IF(AND(H175>=1978,H175<1983),VLOOKUP(I175,Feuil2!$F$10:$P$28,2),VLOOKUP(I175,Feuil2!$F$10:$P$28,2))))))))))))","v":{"$error":"#N/A"}},null,{"$f":"T175-HLOOKUP(Y175,Feuil2!$C$1:$CD$9,2,FALSE)","v":{"$error":"#VALUE!"}},{"$f":"T175-HLOOKUP(Y175,Feuil2!$C$1:$CD$9,3,FALSE)","v":{"$error":"#VALUE!"}},{"$f":"T175-HLOOKUP(Y175,Feuil2!$C$1:$CD$9,4,FALSE)","v":{"$error":"#VALUE!"}},{"$f":"T175-HLOOKUP(Y175,Feuil2!$C$1:$CD$9,5,FALSE)","v":{"$error":"#VALUE!"}},{"$f":"T175-HLOOKUP(Y175,Feuil2!$C$1:$CD$9,6,FALSE)","v":{"$error":"#VALUE!"}},{"$f":"T175-HLOOKUP(Y175,Feuil2!$C$1:$CD$9,7,FALSE)","v":{"$error":"#VALUE!"}},{"$f":"T175-HLOOKUP(Y175,Feuil2!$C$1:$CD$9,8,FALSE)","v":{"$error":"#VALUE!"}},{"$f":"T175-HLOOKUP(Y175,Feuil2!$C$1:$CD$9,9,FALSE)","v":{"$error":"#VALUE!"}},null,null,null,null,null,null,null,{"$error":"#VALUE!"},2017,null,{"$f":"IF(AQ175,VLOOKUP(AQ175,HOM!$AS$389:$AT$444,2))","v":4.4930000000000003}]
["H",null,null,null,null,null,null,null,null,null,null,null,null,null,"",null,null,null,"","","","","",false,{"$f":"IF(AND(H176<1920),VLOOKUP(I176,Feuil2!$F$10:$P$28,11),IF(AND(H176>=1920,H176<1939),VLOOKUP(I176,Feuil2!$F$10:$P$28,11),IF(AND(H176>=1938,H176<1943),VLOOKUP(I176,Feuil2!$F$10:$P$28,10),IF(AND(H176>=1943,H176<1948),VLOOKUP(I176,Feuil2!$F$10:$P$28,9),IF(AND(H176>=1948,H176<1953),VLOOKUP(I176,Feuil2!$F$10:$P$28,8),IF(AND(H176>=1953,H176<1958),VLOOKUP(I176,Feuil2!$F$10:$P$28,7),IF(AND(H176>=1958,H176<1963),VLOOKUP(I176,Feuil2!$F$10:$P$28,6),IF(AND(H176>=1963,H176<1968),VLOOKUP(I176,Feuil2!$F$10:$P$28,5),IF(AND(H176>=1968,H176<1973),VLOOKUP(I176,Feuil2!$F$10:$P$28,4),IF(AND(H176>=1973,H176<1978),VLOOKUP(I176,Feuil2!$F$10:$P$28,3),IF(AND(H176>=1978,H176<1983),VLOOKUP(I176,Feuil2!$F$10:$P$28,2),VLOOKUP(I176,Feuil2!$F$10:$P$28,2))))))))))))","v":{"$error":"#N/A"}},null,{"$f":"T176-HLOOKUP(Y176,Feuil2!$C$1:$CD$9,2,FALSE)","v":{"$error":"#VALUE!"}},{"$f":"T176-HLOOKUP(Y176,Feuil2!$C$1:$CD$9,3,FALSE)","v":{"$error":"#VALUE!"}},{"$f":"T176-HLOOKUP(Y176,Feuil2!$C$1:$CD$9,4,FALSE)","v":{"$error":"#VALUE!"}},{"$f":"T176-HLOOKUP(Y176,Feuil2!$C$1:$CD$9,5,FALSE)","v":{"$error":"#VALUE!"}},{"$f":"T176-HLOOKUP(Y176,Feuil2!$C$1:$CD$9,6,FALSE)","v":{"$error":"#VALUE!"}},{"$f":"T176-HLOOKUP(Y176,Feuil2!$C$1:$CD$9,7,FALSE)","v":{"$error":"#VALUE!"}},{"$f":"T176-HLOOKUP(Y176,Feuil2!$C$1:$CD$9,8,FALSE)","v":{"$error":"#VALUE!"}},{"$f":"T176-HLOOKUP(Y176,Feuil2!$C$1:$CD$9,9,FALSE)","v":{"$error":"#VALUE!"}},null,null,null,null,null,null,null,{"$error":"#VALUE!"},2017,null,{"$f":"IF(AQ176,VLOOKUP(AQ176,HOM!$AS$389:$AT$444,2))","v":4.4930000000000003}]
["H",null,null,null,null,null,null,null,null,null,null,null,null,null,"",null,null,null,"","","","","",false,{"$f":"IF(AND(H177<1920),VLOOKUP(I177,Feuil2!$F$10:$P$28,11),IF(AND(H177>=1920,H177<1939),VLOOKUP(I177,Feuil2!$F$10:$P$28,11),IF(AND(H177>=1938,H177<1943),VLOOKUP(I177,Feuil2!$F$10:$P$28,10),IF(AND(H177>=1943,H177<1948),VLOOKUP(I177,Feuil2!$F$10:$P$28,9),IF(AND(H177>=1948,H177<1953),VLOOKUP(I177,Feuil2!$F$10:$P$28,8),IF(AND(H177>=1953,H177<1958),VLOOKUP(I177,Feuil2!$F$10:$P$28,7),IF(AND(H177>=1958,H177<1963),VLOOKUP(I177,Feuil2!$F$10:$P$28,6),IF(AND(H177>=1963,H177<1968),VLOOKUP(I177,Feuil2!$F$10:$P$28,5),IF(AND(H177>=1968,H177<1973),VLOOKUP(I177,Feuil2!$F$10:$P$28,4),IF(AND(H177>=1973,H177<1978),VLOOKUP(I177,Feuil2!$F$10:$P$28,3),IF(AND(H177>=1978,H177<1983),VLOOKUP(I177,Feuil2!$F$10:$P$28,2),VLOOKUP(I177,Feuil2!$F$10:$P$28,2))))))))))))","v":{"$error":"#N/A"}},null,{"$f":"T177-HLOOKUP(Y177,Feuil2!$C$1:$CD$9,2,FALSE)","v":{"$error":"#VALUE!"}},{"$f":"T177-HLOOKUP(Y177,Feuil2!$C$1:$CD$9,3,FALSE)","v":{"$error":"#VALUE!"}},{"$f":"T177-HLOOKUP(Y177,Feuil2!$C$1:$CD$9,4,FALSE)","v":{"$error":"#VALUE!"}},{"$f":"T177-HLOOKUP(Y177,Feuil2!$C$1:$CD$9,5,FALSE)","v":{"$error":"#VALUE!"}},{"$f":"T177-HLOOKUP(Y177,Feuil2!$C$1:$CD$9,6,FALSE)","v":{"$error":"#VALUE!"}},{"$f":"T177-HLOOKUP(Y177,Feuil2!$C$1:$CD$9,7,FALSE)","v":{"$error":"#VALUE!"}},{"$f":"T177-HLOOKUP(Y177,Feuil2!$C$1:$CD$9,8,FALSE)","v":{"$error":"#VALUE!"}},{"$f":"T177-HLOOKUP(Y177,Feuil2!$C$1:$CD$9,9,FALSE)","v":{"$error":"#VALUE!"}},null,null,null,null,null,null,null,{"$error":"#VALUE!"},2017,null,{"$f":"IF(AQ177,VLOOKUP(AQ177,HOM!$AS$389:$AT$444,2))","v":4.4930000000000003}]
["H",null,null,null,null,null,null,null,null,null,null,null,null,null,"",null,null,null,"","","","","",false,{"$f":"IF(AND(H178<1920),VLOOKUP(I178,Feuil2!$F$10:$P$28,11),IF(AND(H178>=1920,H178<1939),VLOOKUP(I178,Feuil2!$F$10:$P$28,11),IF(AND(H178>=1938,H178<1943),VLOOKUP(I178,Feuil2!$F$10:$P$28,10),IF(AND(H178>=1943,H178<1948),VLOOKUP(I178,Feuil2!$F$10:$P$28,9),IF(AND(H178>=1948,H178<1953),VLOOKUP(I178,Feuil2!$F$10:$P$28,8),IF(AND(H178>=1953,H178<1958),VLOOKUP(I178,Feuil2!$F$10:$P$28,7),IF(AND(H178>=1958,H178<1963),VLOOKUP(I178,Feuil2!$F$10:$P$28,6),IF(AND(H178>=1963,H178<1968),VLOOKUP(I178,Feuil2!$F$10:$P$28,5),IF(AND(H178>=1968,H178<1973),VLOOKUP(I178,Feuil2!$F$10:$P$28,4),IF(AND(H178>=1973,H178<1978),VLOOKUP(I178,Feuil2!$F$10:$P$28,3),IF(AND(H178>=1978,H178<1983),VLOOKUP(I178,Feuil2!$F$10:$P$28,2),VLOOKUP(I178,Feuil2!$F$10:$P$28,2))))))))))))","v":{"$error":"#N/A"}},null,{"$f":"T178-HLOOKUP(Y178,Feuil2!$C$1:$CD$9,2,FALSE)","v":{"$error":"#VALUE!"}},{"$f":"T178-HLOOKUP(Y178,Feuil2!$C$1:$CD$9,3,FALSE)","v":{"$error":"#VALUE!"}},{"$f":"T178-HLOOKUP(Y178,Feuil2!$C$1:$CD$9,4,FALSE)","v":{"$error":"#VALUE!"}},{"$f":"T178-HLOOKUP(Y178,Feuil2!$C$1:$CD$9,5,FALSE)","v":{"$error":"#VALUE!"}},{"$f":"T178-HLOOKUP(Y178,Feuil2!$C$1:$CD$9,6,FALSE)","v":{"$error":"#VALUE!"}},{"$f":"T178-HLOOKUP(Y178,Feuil2!$C$1:$CD$9,7,FALSE)","v":{"$error":"#VALUE!"}},{"$f":"T178-HLOOKUP(Y178,Feuil2!$C$1:$CD$9,8,FALSE)","v":{"$error":"#VALUE!"}},{"$f":"T178-HLOOKUP(Y178,Feuil2!$C$1:$CD$9,9,FALSE)","v":{"$error":"#VALUE!"}},null,null,null,null,null,null,null,{"$error":"#VALUE!"},2017,null,{"$f":"IF(AQ178,VLOOKUP(AQ178,HOM!$AS$389:$AT$444,2))","v":4.4930000000000003}]
["H",null,null,null,null,null,null,null,null,null,null,null,null,null,"",null,null,null,"","","","","",false,{"$f":"IF(AND(H179<1920),VLOOKUP(I179,Feuil2!$F$10:$P$28,11),IF(AND(H179>=1920,H179<1939),VLOOKUP(I179,Feuil2!$F$10:$P$28,11),IF(AND(H179>=1938,H179<1943),VLOOKUP(I179,Feuil2!$F$10:$P$28,10),IF(AND(H179>=1943,H179<1948),VLOOKUP(I179,Feuil2!$F$10:$P$28,9),IF(AND(H179>=1948,H179<1953),VLOOKUP(I179,Feuil2!$F$10:$P$28,8),IF(AND(H179>=1953,H179<1958),VLOOKUP(I179,Feuil2!$F$10:$P$28,7),IF(AND(H179>=1958,H179<1963),VLOOKUP(I179,Feuil2!$F$10:$P$28,6),IF(AND(H179>=1963,H179<1968),VLOOKUP(I179,Feuil2!$F$10:$P$28,5),IF(AND(H179>=1968,H179<1973),VLOOKUP(I179,Feuil2!$F$10:$P$28,4),IF(AND(H179>=1973,H179<1978),VLOOKUP(I179,Feuil2!$F$10:$P$28,3),IF(AND(H179>=1978,H179<1983),VLOOKUP(I179,Feuil2!$F$10:$P$28,2),VLOOKUP(I179,Feuil2!$F$10:$P$28,2))))))))))))","v":{"$error":"#N/A"}},null,{"$f":"T179-HLOOKUP(Y179,Feuil2!$C$1:$CD$9,2,FALSE)","v":{"$error":"#VALUE!"}},{"$f":"T179-HLOOKUP(Y179,Feuil2!$C$1:$CD$9,3,FALSE)","v":{"$error":"#VALUE!"}},{"$f":"T179-HLOOKUP(Y179,Feuil2!$C$1:$CD$9,4,FALSE)","v":{"$error":"#VALUE!"}},{"$f":"T179-HLOOKUP(Y179,Feuil2!$C$1:$CD$9,5,FALSE)","v":{"$error":"#VALUE!"}},{"$f":"T179-HLOOKUP(Y179,Feuil2!$C$1:$CD$9,6,FALSE)","v":{"$error":"#VALUE!"}},{"$f":"T179-HLOOKUP(Y179,Feuil2!$C$1:$CD$9,7,FALSE)","v":{"$error":"#VALUE!"}},{"$f":"T179-HLOOKUP(Y179,Feuil2!$C$1:$CD$9,8,FALSE)","v":{"$error":"#VALUE!"}},{"$f":"T179-HLOOKUP(Y179,Feuil2!$C$1:$CD$9,9,FALSE)","v":{"$error":"#VALUE!"}},null,null,null,null,null,null,null,{"$error":"#VALUE!"},2017,null,{"$f":"IF(AQ179,VLOOKUP(AQ179,HOM!$AS$389:$AT$444,2))","v":4.4930000000000003}]
["H",null,null,null,null,null,null,null,null,null,null,null,null,null,"",null,null,null,"","","","","",false,{"$f":"IF(AND(H180<1920),VLOOKUP(I180,Feuil2!$F$10:$P$28,11),IF(AND(H180>=1920,H180<1939),VLOOKUP(I180,Feuil2!$F$10:$P$28,11),IF(AND(H180>=1938,H180<1943),VLOOKUP(I180,Feuil2!$F$10:$P$28,10),IF(AND(H180>=1943,H180<1948),VLOOKUP(I180,Feuil2!$F$10:$P$28,9),IF(AND(H180>=1948,H180<1953),VLOOKUP(I180,Feuil2!$F$10:$P$28,8),IF(AND(H180>=1953,H180<1958),VLOOKUP(I180,Feuil2!$F$10:$P$28,7),IF(AND(H180>=1958,H180<1963),VLOOKUP(I180,Feuil2!$F$10:$P$28,6),IF(AND(H180>=1963,H180<1968),VLOOKUP(I180,Feuil2!$F$10:$P$28,5),IF(AND(H180>=1968,H180<1973),VLOOKUP(I180,Feuil2!$F$10:$P$28,4),IF(AND(H180>=1973,H180<1978),VLOOKUP(I180,Feuil2!$F$10:$P$28,3),IF(AND(H180>=1978,H180<1983),VLOOKUP(I180,Feuil2!$F$10:$P$28,2),VLOOKUP(I180,Feuil2!$F$10:$P$28,2))))))))))))","v":{"$error":"#N/A"}},null,{"$f":"T180-HLOOKUP(Y180,Feuil2!$C$1:$CD$9,2,FALSE)","v":{"$error":"#VALUE!"}},{"$f":"T180-HLOOKUP(Y180,Feuil2!$C$1:$CD$9,3,FALSE)","v":{"$error":"#VALUE!"}},{"$f":"T180-HLOOKUP(Y180,Feuil2!$C$1:$CD$9,4,FALSE)","v":{"$error":"#VALUE!"}},{"$f":"T180-HLOOKUP(Y180,Feuil2!$C$1:$CD$9,5,FALSE)","v":{"$error":"#VALUE!"}},{"$f":"T180-HLOOKUP(Y180,Feuil2!$C$1:$CD$9,6,FALSE)","v":{"$error":"#VALUE!"}},{"$f":"T180-HLOOKUP(Y180,Feuil2!$C$1:$CD$9,7,FALSE)","v":{"$error":"#VALUE!"}},{"$f":"T180-HLOOKUP(Y180,Feuil2!$C$1:$CD$9,8,FALSE)","v":{"$error":"#VALUE!"}},{"$f":"T180-HLOOKUP(Y180,Feuil2!$C$1:$CD$9,9,FALSE)","v":{"$error":"#VALUE!"}},null,null,null,null,null,null,null,{"$error":"#VALUE!"},2017,null,{"$f":"IF(AQ180,VLOOKUP(AQ180,HOM!$AS$389:$AT$444,2))","v":4.4930000000000003}]
["H",null,null,null,null,null,null,null,null,null,null,null,null,null,"",null,null,null,"","","","","",false,{"$f":"IF(AND(H181<1920),VLOOKUP(I181,Feuil2!$F$10:$P$28,11),IF(AND(H181>=1920,H181<1939),VLOOKUP(I181,Feuil2!$F$10:$P$28,11),IF(AND(H181>=1938,H181<1943),VLOOKUP(I181,Feuil2!$F$10:$P$28,10),IF(AND(H181>=1943,H181<1948),VLOOKUP(I181,Feuil2!$F$10:$P$28,9),IF(AND(H181>=1948,H181<1953),VLOOKUP(I181,Feuil2!$F$10:$P$28,8),IF(AND(H181>=1953,H181<1958),VLOOKUP(I181,Feuil2!$F$10:$P$28,7),IF(AND(H181>=1958,H181<1963),VLOOKUP(I181,Feuil2!$F$10:$P$28,6),IF(AND(H181>=1963,H181<1968),VLOOKUP(I181,Feuil2!$F$10:$P$28,5),IF(AND(H181>=1968,H181<1973),VLOOKUP(I181,Feuil2!$F$10:$P$28,4),IF(AND(H181>=1973,H181<1978),VLOOKUP(I181,Feuil2!$F$10:$P$28,3),IF(AND(H181>=1978,H181<1983),VLOOKUP(I181,Feuil2!$F$10:$P$28,2),VLOOKUP(I181,Feuil2!$F$10:$P$28,2))))))))))))","v":{"$error":"#N/A"}},null,{"$f":"T181-HLOOKUP(Y181,Feuil2!$C$1:$CD$9,2,FALSE)","v":{"$error":"#VALUE!"}},{"$f":"T181-HLOOKUP(Y181,Feuil2!$C$1:$CD$9,3,FALSE)","v":{"$error":"#VALUE!"}},{"$f":"T181-HLOOKUP(Y181,Feuil2!$C$1:$CD$9,4,FALSE)","v":{"$error":"#VALUE!"}},{"$f":"T181-HLOOKUP(Y181,Feuil2!$C$1:$CD$9,5,FALSE)","v":{"$error":"#VALUE!"}},{"$f":"T181-HLOOKUP(Y181,Feuil2!$C$1:$CD$9,6,FALSE)","v":{"$error":"#VALUE!"}},{"$f":"T181-HLOOKUP(Y181,Feuil2!$C$1:$CD$9,7,FALSE)","v":{"$error":"#VALUE!"}},{"$f":"T181-HLOOKUP(Y181,Feuil2!$C$1:$CD$9,8,FALSE)","v":{"$error":"#VALUE!"}},{"$f":"T181-HLOOKUP(Y181,Feuil2!$C$1:$CD$9,9,FALSE)","v":{"$error":"#VALUE!"}},null,null,null,null,null,null,null,{"$error":"#VALUE!"},2017,null,{"$f":"IF(AQ181,VLOOKUP(AQ181,HOM!$AS$389:$AT$444,2))","v":4.4930000000000003}]
["H",null,null,null,null,null,null,null,null,null,null,null,null,null,"",null,null,null,"","","","","",false,{"$f":"IF(AND(H182<1920),VLOOKUP(I182,Feuil2!$F$10:$P$28,11),IF(AND(H182>=1920,H182<1939),VLOOKUP(I182,Feuil2!$F$10:$P$28,11),IF(AND(H182>=1938,H182<1943),VLOOKUP(I182,Feuil2!$F$10:$P$28,10),IF(AND(H182>=1943,H182<1948),VLOOKUP(I182,Feuil2!$F$10:$P$28,9),IF(AND(H182>=1948,H182<1953),VLOOKUP(I182,Feuil2!$F$10:$P$28,8),IF(AND(H182>=1953,H182<1958),VLOOKUP(I182,Feuil2!$F$10:$P$28,7),IF(AND(H182>=1958,H182<1963),VLOOKUP(I182,Feuil2!$F$10:$P$28,6),IF(AND(H182>=1963,H182<1968),VLOOKUP(I182,Feuil2!$F$10:$P$28,5),IF(AND(H182>=1968,H182<1973),VLOOKUP(I182,Feuil2!$F$10:$P$28,4),IF(AND(H182>=1973,H182<1978),VLOOKUP(I182,Feuil2!$F$10:$P$28,3),IF(AND(H182>=1978,H182<1983),VLOOKUP(I182,Feuil2!$F$10:$P$28,2),VLOOKUP(I182,Feuil2!$F$10:$P$28,2))))))))))))","v":{"$error":"#N/A"}},null,{"$f":"T182-HLOOKUP(Y182,Feuil2!$C$1:$CD$9,2,FALSE)","v":{"$error":"#VALUE!"}},{"$f":"T182-HLOOKUP(Y182,Feuil2!$C$1:$CD$9,3,FALSE)","v":{"$error":"#VALUE!"}},{"$f":"T182-HLOOKUP(Y182,Feuil2!$C$1:$CD$9,4,FALSE)","v":{"$error":"#VALUE!"}},{"$f":"T182-HLOOKUP(Y182,Feuil2!$C$1:$CD$9,5,FALSE)","v":{"$error":"#VALUE!"}},{"$f":"T182-HLOOKUP(Y182,Feuil2!$C$1:$CD$9,6,FALSE)","v":{"$error":"#VALUE!"}},{"$f":"T182-HLOOKUP(Y182,Feuil2!$C$1:$CD$9,7,FALSE)","v":{"$error":"#VALUE!"}},{"$f":"T182-HLOOKUP(Y182,Feuil2!$C$1:$CD$9,8,FALSE)","v":{"$error":"#VALUE!"}},{"$f":"T182-HLOOKUP(Y182,Feuil2!$C$1:$CD$9,9,FALSE)","v":{"$error":"#VALUE!"}},null,null,null,null,null,null,null,{"$error":"#VALUE!"},2017,null,{"$f":"IF(AQ182,VLOOKUP(AQ182,HOM!$AS$389:$AT$444,2))","v":4.4930000000000003}]
["H",null,null,null,null,null,null,null,null,null,null,null,null,null,"",null,null,null,"","","","","",false,{"$f":"IF(AND(H183<1920),VLOOKUP(I183,Feuil2!$F$10:$P$28,11),IF(AND(H183>=1920,H183<1939),VLOOKUP(I183,Feuil2!$F$10:$P$28,11),IF(AND(H183>=1938,H183<1943),VLOOKUP(I183,Feuil2!$F$10:$P$28,10),IF(AND(H183>=1943,H183<1948),VLOOKUP(I183,Feuil2!$F$10:$P$28,9),IF(AND(H183>=1948,H183<1953),VLOOKUP(I183,Feuil2!$F$10:$P$28,8),IF(AND(H183>=1953,H183<1958),VLOOKUP(I183,Feuil2!$F$10:$P$28,7),IF(AND(H183>=1958,H183<1963),VLOOKUP(I183,Feuil2!$F$10:$P$28,6),IF(AND(H183>=1963,H183<1968),VLOOKUP(I183,Feuil2!$F$10:$P$28,5),IF(AND(H183>=1968,H183<1973),VLOOKUP(I183,Feuil2!$F$10:$P$28,4),IF(AND(H183>=1973,H183<1978),VLOOKUP(I183,Feuil2!$F$10:$P$28,3),IF(AND(H183>=1978,H183<1983),VLOOKUP(I183,Feuil2!$F$10:$P$28,2),VLOOKUP(I183,Feuil2!$F$10:$P$28,2))))))))))))","v":{"$error":"#N/A"}},null,{"$f":"T183-HLOOKUP(Y183,Feuil2!$C$1:$CD$9,2,FALSE)","v":{"$error":"#VALUE!"}},{"$f":"T183-HLOOKUP(Y183,Feuil2!$C$1:$CD$9,3,FALSE)","v":{"$error":"#VALUE!"}},{"$f":"T183-HLOOKUP(Y183,Feuil2!$C$1:$CD$9,4,FALSE)","v":{"$error":"#VALUE!"}},{"$f":"T183-HLOOKUP(Y183,Feuil2!$C$1:$CD$9,5,FALSE)","v":{"$error":"#VALUE!"}},{"$f":"T183-HLOOKUP(Y183,Feuil2!$C$1:$CD$9,6,FALSE)","v":{"$error":"#VALUE!"}},{"$f":"T183-HLOOKUP(Y183,Feuil2!$C$1:$CD$9,7,FALSE)","v":{"$error":"#VALUE!"}},{"$f":"T183-HLOOKUP(Y183,Feuil2!$C$1:$CD$9,8,FALSE)","v":{"$error":"#VALUE!"}},{"$f":"T183-HLOOKUP(Y183,Feuil2!$C$1:$CD$9,9,FALSE)","v":{"$error":"#VALUE!"}},null,null,null,null,null,null,null,{"$error":"#VALUE!"},2017,null,{"$f":"IF(AQ183,VLOOKUP(AQ183,HOM!$AS$389:$AT$444,2))","v":4.4930000000000003}]
["H",null,null,null,null,null,null,null,null,null,null,null,null,null,"",null,null,null,"","","","","",false,{"$f":"IF(AND(H184<1920),VLOOKUP(I184,Feuil2!$F$10:$P$28,11),IF(AND(H184>=1920,H184<1939),VLOOKUP(I184,Feuil2!$F$10:$P$28,11),IF(AND(H184>=1938,H184<1943),VLOOKUP(I184,Feuil2!$F$10:$P$28,10),IF(AND(H184>=1943,H184<1948),VLOOKUP(I184,Feuil2!$F$10:$P$28,9),IF(AND(H184>=1948,H184<1953),VLOOKUP(I184,Feuil2!$F$10:$P$28,8),IF(AND(H184>=1953,H184<1958),VLOOKUP(I184,Feuil2!$F$10:$P$28,7),IF(AND(H184>=1958,H184<1963),VLOOKUP(I184,Feuil2!$F$10:$P$28,6),IF(AND(H184>=1963,H184<1968),VLOOKUP(I184,Feuil2!$F$10:$P$28,5),IF(AND(H184>=1968,H184<1973),VLOOKUP(I184,Feuil2!$F$10:$P$28,4),IF(AND(H184>=1973,H184<1978),VLOOKUP(I184,Feuil2!$F$10:$P$28,3),IF(AND(H184>=1978,H184<1983),VLOOKUP(I184,Feuil2!$F$10:$P$28,2),VLOOKUP(I184,Feuil2!$F$10:$P$28,2))))))))))))","v":{"$error":"#N/A"}},null,{"$f":"T184-HLOOKUP(Y184,Feuil2!$C$1:$CD$9,2,FALSE)","v":{"$error":"#VALUE!"}},{"$f":"T184-HLOOKUP(Y184,Feuil2!$C$1:$CD$9,3,FALSE)","v":{"$error":"#VALUE!"}},{"$f":"T184-HLOOKUP(Y184,Feuil2!$C$1:$CD$9,4,FALSE)","v":{"$error":"#VALUE!"}},{"$f":"T184-HLOOKUP(Y184,Feuil2!$C$1:$CD$9,5,FALSE)","v":{"$error":"#VALUE!"}},{"$f":"T184-HLOOKUP(Y184,Feuil2!$C$1:$CD$9,6,FALSE)","v":{"$error":"#VALUE!"}},{"$f":"T184-HLOOKUP(Y184,Feuil2!$C$1:$CD$9,7,FALSE)","v":{"$error":"#VALUE!"}},{"$f":"T184-HLOOKUP(Y184,Feuil2!$C$1:$CD$9,8,FALSE)","v":{"$error":"#VALUE!"}},{"$f":"T184-HLOOKUP(Y184,Feuil2!$C$1:$CD$9,9,FALSE)","v":{"$error":"#VALUE!"}},null,null,null,null,null,null,null,{"$error":"#VALUE!"},2017,null,{"$f":"IF(AQ184,VLOOKUP(AQ184,HOM!$AS$389:$AT$444,2))","v":4.4930000000000003}]
["H",null,null,null,null,null,null,null,null,null,null,null,null,null,"",null,null,null,"","","","","",false,{"$f":"IF(AND(H185<1920),VLOOKUP(I185,Feuil2!$F$10:$P$28,11),IF(AND(H185>=1920,H185<1939),VLOOKUP(I185,Feuil2!$F$10:$P$28,11),IF(AND(H185>=1938,H185<1943),VLOOKUP(I185,Feuil2!$F$10:$P$28,10),IF(AND(H185>=1943,H185<1948),VLOOKUP(I185,Feuil2!$F$10:$P$28,9),IF(AND(H185>=1948,H185<1953),VLOOKUP(I185,Feuil2!$F$10:$P$28,8),IF(AND(H185>=1953,H185<1958),VLOOKUP(I185,Feuil2!$F$10:$P$28,7),IF(AND(H185>=1958,H185<1963),VLOOKUP(I185,Feuil2!$F$10:$P$28,6),IF(AND(H185>=1963,H185<1968),VLOOKUP(I185,Feuil2!$F$10:$P$28,5),IF(AND(H185>=1968,H185<1973),VLOOKUP(I185,Feuil2!$F$10:$P$28,4),IF(AND(H185>=1973,H185<1978),VLOOKUP(I185,Feuil2!$F$10:$P$28,3),IF(AND(H185>=1978,H185<1983),VLOOKUP(I185,Feuil2!$F$10:$P$28,2),VLOOKUP(I185,Feuil2!$F$10:$P$28,2))))))))))))","v":{"$error":"#N/A"}},null,{"$f":"T185-HLOOKUP(Y185,Feuil2!$C$1:$CD$9,2,FALSE)","v":{"$error":"#VALUE!"}},{"$f":"T185-HLOOKUP(Y185,Feuil2!$C$1:$CD$9,3,FALSE)","v":{"$error":"#VALUE!"}},{"$f":"T185-HLOOKUP(Y185,Feuil2!$C$1:$CD$9,4,FALSE)","v":{"$error":"#VALUE!"}},{"$f":"T185-HLOOKUP(Y185,Feuil2!$C$1:$CD$9,5,FALSE)","v":{"$error":"#VALUE!"}},{"$f":"T185-HLOOKUP(Y185,Feuil2!$C$1:$CD$9,6,FALSE)","v":{"$error":"#VALUE!"}},{"$f":"T185-HLOOKUP(Y185,Feuil2!$C$1:$CD$9,7,FALSE)","v":{"$error":"#VALUE!"}},{"$f":"T185-HLOOKUP(Y185,Feuil2!$C$1:$CD$9,8,FALSE)","v":{"$error":"#VALUE!"}},{"$f":"T185-HLOOKUP(Y185,Feuil2!$C$1:$CD$9,9,FALSE)","v":{"$error":"#VALUE!"}},null,null,null,null,null,null,null,{"$error":"#VALUE!"},2017,null,{"$f":"IF(AQ185,VLOOKUP(AQ185,HOM!$AS$389:$AT$444,2))","v":4.4930000000000003}]
["H",null,null,null,null,null,null,null,null,null,null,null,null,null,"",null,null,null,"","","","","",false,{"$f":"IF(AND(H186<1920),VLOOKUP(I186,Feuil2!$F$10:$P$28,11),IF(AND(H186>=1920,H186<1939),VLOOKUP(I186,Feuil2!$F$10:$P$28,11),IF(AND(H186>=1938,H186<1943),VLOOKUP(I186,Feuil2!$F$10:$P$28,10),IF(AND(H186>=1943,H186<1948),VLOOKUP(I186,Feuil2!$F$10:$P$28,9),IF(AND(H186>=1948,H186<1953),VLOOKUP(I186,Feuil2!$F$10:$P$28,8),IF(AND(H186>=1953,H186<1958),VLOOKUP(I186,Feuil2!$F$10:$P$28,7),IF(AND(H186>=1958,H186<1963),VLOOKUP(I186,Feuil2!$F$10:$P$28,6),IF(AND(H186>=1963,H186<1968),VLOOKUP(I186,Feuil2!$F$10:$P$28,5),IF(AND(H186>=1968,H186<1973),VLOOKUP(I186,Feuil2!$F$10:$P$28,4),IF(AND(H186>=1973,H186<1978),VLOOKUP(I186,Feuil2!$F$10:$P$28,3),IF(AND(H186>=1978,H186<1983),VLOOKUP(I186,Feuil2!$F$10:$P$28,2),VLOOKUP(I186,Feuil2!$F$10:$P$28,2))))))))))))","v":{"$error":"#N/A"}},null,{"$f":"T186-HLOOKUP(Y186,Feuil2!$C$1:$CD$9,2,FALSE)","v":{"$error":"#VALUE!"}},{"$f":"T186-HLOOKUP(Y186,Feuil2!$C$1:$CD$9,3,FALSE)","v":{"$error":"#VALUE!"}},{"$f":"T186-HLOOKUP(Y186,Feuil2!$C$1:$CD$9,4,FALSE)","v":{"$error":"#VALUE!"}},{"$f":"T186-HLOOKUP(Y186,Feuil2!$C$1:$CD$9,5,FALSE)","v":{"$error":"#VALUE!"}},{"$f":"T186-HLOOKUP(Y186,Feuil2!$C$1:$CD$9,6,FALSE)","v":{"$error":"#VALUE!"}},{"$f":"T186-HLOOKUP(Y186,Feuil2!$C$1:$CD$9,7,FALSE)","v":{"$error":"#VALUE!"}},{"$f":"T186-HLOOKUP(Y186,Feuil2!$C$1:$CD$9,8,FALSE)","v":{"$error":"#VALUE!"}},{"$f":"T186-HLOOKUP(Y186,Feuil2!$C$1:$CD$9,9,FALSE)","v":{"$error":"#VALUE!"}},null,null,null,null,null,null,null,{"$error":"#VALUE!"},2017,null,{"$f":"IF(AQ186,VLOOKUP(AQ186,HOM!$AS$389:$AT$444,2))","v":4.4930000000000003}]
["H",null,null,null,null,null,null,null,null,null,null,null,null,null,"",null,null,null,"","","","","",false,{"$f":"IF(AND(H187<1920),VLOOKUP(I187,Feuil2!$F$10:$P$28,11),IF(AND(H187>=1920,H187<1939),VLOOKUP(I187,Feuil2!$F$10:$P$28,11),IF(AND(H187>=1938,H187<1943),VLOOKUP(I187,Feuil2!$F$10:$P$28,10),IF(AND(H187>=1943,H187<1948),VLOOKUP(I187,Feuil2!$F$10:$P$28,9),IF(AND(H187>=1948,H187<1953),VLOOKUP(I187,Feuil2!$F$10:$P$28,8),IF(AND(H187>=1953,H187<1958),VLOOKUP(I187,Feuil2!$F$10:$P$28,7),IF(AND(H187>=1958,H187<1963),VLOOKUP(I187,Feuil2!$F$10:$P$28,6),IF(AND(H187>=1963,H187<1968),VLOOKUP(I187,Feuil2!$F$10:$P$28,5),IF(AND(H187>=1968,H187<1973),VLOOKUP(I187,Feuil2!$F$10:$P$28,4),IF(AND(H187>=1973,H187<1978),VLOOKUP(I187,Feuil2!$F$10:$P$28,3),IF(AND(H187>=1978,H187<1983),VLOOKUP(I187,Feuil2!$F$10:$P$28,2),VLOOKUP(I187,Feuil2!$F$10:$P$28,2))))))))))))","v":{"$error":"#N/A"}},null,{"$f":"T187-HLOOKUP(Y187,Feuil2!$C$1:$CD$9,2,FALSE)","v":{"$error":"#VALUE!"}},{"$f":"T187-HLOOKUP(Y187,Feuil2!$C$1:$CD$9,3,FALSE)","v":{"$error":"#VALUE!"}},{"$f":"T187-HLOOKUP(Y187,Feuil2!$C$1:$CD$9,4,FALSE)","v":{"$error":"#VALUE!"}},{"$f":"T187-HLOOKUP(Y187,Feuil2!$C$1:$CD$9,5,FALSE)","v":{"$error":"#VALUE!"}},{"$f":"T187-HLOOKUP(Y187,Feuil2!$C$1:$CD$9,6,FALSE)","v":{"$error":"#VALUE!"}},{"$f":"T187-HLOOKUP(Y187,Feuil2!$C$1:$CD$9,7,FALSE)","v":{"$error":"#VALUE!"}},{"$f":"T187-HLOOKUP(Y187,Feuil2!$C$1:$CD$9,8,FALSE)","v":{"$error":"#VALUE!"}},{"$f":"T187-HLOOKUP(Y187,Feuil2!$C$1:$CD$9,9,FALSE)","v":{"$error":"#VALUE!"}},null,null,null,null,null,null,null,{"$error":"#VALUE!"},2017,null,{"$f":"IF(AQ187,VLOOKUP(AQ187,HOM!$AS$389:$AT$444,2))","v":4.4930000000000003}]
["H",null,null,null,null,null,null,null,null,null,null,null,null,null,"",null,null,null,"","","","","",false,{"$f":"IF(AND(H188<1920),VLOOKUP(I188,Feuil2!$F$10:$P$28,11),IF(AND(H188>=1920,H188<1939),VLOOKUP(I188,Feuil2!$F$10:$P$28,11),IF(AND(H188>=1938,H188<1943),VLOOKUP(I188,Feuil2!$F$10:$P$28,10),IF(AND(H188>=1943,H188<1948),VLOOKUP(I188,Feuil2!$F$10:$P$28,9),IF(AND(H188>=1948,H188<1953),VLOOKUP(I188,Feuil2!$F$10:$P$28,8),IF(AND(H188>=1953,H188<1958),VLOOKUP(I188,Feuil2!$F$10:$P$28,7),IF(AND(H188>=1958,H188<1963),VLOOKUP(I188,Feuil2!$F$10:$P$28,6),IF(AND(H188>=1963,H188<1968),VLOOKUP(I188,Feuil2!$F$10:$P$28,5),IF(AND(H188>=1968,H188<1973),VLOOKUP(I188,Feuil2!$F$10:$P$28,4),IF(AND(H188>=1973,H188<1978),VLOOKUP(I188,Feuil2!$F$10:$P$28,3),IF(AND(H188>=1978,H188<1983),VLOOKUP(I188,Feuil2!$F$10:$P$28,2),VLOOKUP(I188,Feuil2!$F$10:$P$28,2))))))))))))","v":{"$error":"#N/A"}},null,{"$f":"T188-HLOOKUP(Y188,Feuil2!$C$1:$CD$9,2,FALSE)","v":{"$error":"#VALUE!"}},{"$f":"T188-HLOOKUP(Y188,Feuil2!$C$1:$CD$9,3,FALSE)","v":{"$error":"#VALUE!"}},{"$f":"T188-HLOOKUP(Y188,Feuil2!$C$1:$CD$9,4,FALSE)","v":{"$error":"#VALUE!"}},{"$f":"T188-HLOOKUP(Y188,Feuil2!$C$1:$CD$9,5,FALSE)","v":{"$error":"#VALUE!"}},{"$f":"T188-HLOOKUP(Y188,Feuil2!$C$1:$CD$9,6,FALSE)","v":{"$error":"#VALUE!"}},{"$f":"T188-HLOOKUP(Y188,Feuil2!$C$1:$CD$9,7,FALSE)","v":{"$error":"#VALUE!"}},{"$f":"T188-HLOOKUP(Y188,Feuil2!$C$1:$CD$9,8,FALSE)","v":{"$error":"#VALUE!"}},{"$f":"T188-HLOOKUP(Y188,Feuil2!$C$1:$CD$9,9,FALSE)","v":{"$error":"#VALUE!"}},null,null,null,null,null,null,null,{"$error":"#VALUE!"},2017,null,{"$f":"IF(AQ188,VLOOKUP(AQ188,HOM!$AS$389:$AT$444,2))","v":4.4930000000000003}]
["H",null,null,null,null,null,null,null,null,null,null,null,null,null,"",null,null,null,"","","","","",false,{"$f":"IF(AND(H189<1920),VLOOKUP(I189,Feuil2!$F$10:$P$28,11),IF(AND(H189>=1920,H189<1939),VLOOKUP(I189,Feuil2!$F$10:$P$28,11),IF(AND(H189>=1938,H189<1943),VLOOKUP(I189,Feuil2!$F$10:$P$28,10),IF(AND(H189>=1943,H189<1948),VLOOKUP(I189,Feuil2!$F$10:$P$28,9),IF(AND(H189>=1948,H189<1953),VLOOKUP(I189,Feuil2!$F$10:$P$28,8),IF(AND(H189>=1953,H189<1958),VLOOKUP(I189,Feuil2!$F$10:$P$28,7),IF(AND(H189>=1958,H189<1963),VLOOKUP(I189,Feuil2!$F$10:$P$28,6),IF(AND(H189>=1963,H189<1968),VLOOKUP(I189,Feuil2!$F$10:$P$28,5),IF(AND(H189>=1968,H189<1973),VLOOKUP(I189,Feuil2!$F$10:$P$28,4),IF(AND(H189>=1973,H189<1978),VLOOKUP(I189,Feuil2!$F$10:$P$28,3),IF(AND(H189>=1978,H189<1983),VLOOKUP(I189,Feuil2!$F$10:$P$28,2),VLOOKUP(I189,Feuil2!$F$10:$P$28,2))))))))))))","v":{"$error":"#N/A"}},null,{"$f":"T189-HLOOKUP(Y189,Feuil2!$C$1:$CD$9,2,FALSE)","v":{"$error":"#VALUE!"}},{"$f":"T189-HLOOKUP(Y189,Feuil2!$C$1:$CD$9,3,FALSE)","v":{"$error":"#VALUE!"}},{"$f":"T189-HLOOKUP(Y189,Feuil2!$C$1:$CD$9,4,FALSE)","v":{"$error":"#VALUE!"}},{"$f":"T189-HLOOKUP(Y189,Feuil2!$C$1:$CD$9,5,FALSE)","v":{"$error":"#VALUE!"}},{"$f":"T189-HLOOKUP(Y189,Feuil2!$C$1:$CD$9,6,FALSE)","v":{"$error":"#VALUE!"}},{"$f":"T189-HLOOKUP(Y189,Feuil2!$C$1:$CD$9,7,FALSE)","v":{"$error":"#VALUE!"}},{"$f":"T189-HLOOKUP(Y189,Feuil2!$C$1:$CD$9,8,FALSE)","v":{"$error":"#VALUE!"}},{"$f":"T189-HLOOKUP(Y189,Feuil2!$C$1:$CD$9,9,FALSE)","v":{"$error":"#VALUE!"}},null,null,null,null,null,null,null,{"$error":"#VALUE!"},2017,null,{"$f":"IF(AQ189,VLOOKUP(AQ189,HOM!$AS$389:$AT$444,2))","v":4.4930000000000003}]
["H",null,null,null,null,null,null,null,null,null,null,null,null,null,"",null,null,null,"","","","","",false,{"$f":"IF(AND(H190<1920),VLOOKUP(I190,Feuil2!$F$10:$P$28,11),IF(AND(H190>=1920,H190<1939),VLOOKUP(I190,Feuil2!$F$10:$P$28,11),IF(AND(H190>=1938,H190<1943),VLOOKUP(I190,Feuil2!$F$10:$P$28,10),IF(AND(H190>=1943,H190<1948),VLOOKUP(I190,Feuil2!$F$10:$P$28,9),IF(AND(H190>=1948,H190<1953),VLOOKUP(I190,Feuil2!$F$10:$P$28,8),IF(AND(H190>=1953,H190<1958),VLOOKUP(I190,Feuil2!$F$10:$P$28,7),IF(AND(H190>=1958,H190<1963),VLOOKUP(I190,Feuil2!$F$10:$P$28,6),IF(AND(H190>=1963,H190<1968),VLOOKUP(I190,Feuil2!$F$10:$P$28,5),IF(AND(H190>=1968,H190<1973),VLOOKUP(I190,Feuil2!$F$10:$P$28,4),IF(AND(H190>=1973,H190<1978),VLOOKUP(I190,Feuil2!$F$10:$P$28,3),IF(AND(H190>=1978,H190<1983),VLOOKUP(I190,Feuil2!$F$10:$P$28,2),VLOOKUP(I190,Feuil2!$F$10:$P$28,2))))))))))))","v":{"$error":"#N/A"}},null,{"$f":"T190-HLOOKUP(Y190,Feuil2!$C$1:$CD$9,2,FALSE)","v":{"$error":"#VALUE!"}},{"$f":"T190-HLOOKUP(Y190,Feuil2!$C$1:$CD$9,3,FALSE)","v":{"$error":"#VALUE!"}},{"$f":"T190-HLOOKUP(Y190,Feuil2!$C$1:$CD$9,4,FALSE)","v":{"$error":"#VALUE!"}},{"$f":"T190-HLOOKUP(Y190,Feuil2!$C$1:$CD$9,5,FALSE)","v":{"$error":"#VALUE!"}},{"$f":"T190-HLOOKUP(Y190,Feuil2!$C$1:$CD$9,6,FALSE)","v":{"$error":"#VALUE!"}},{"$f":"T190-HLOOKUP(Y190,Feuil2!$C$1:$CD$9,7,FALSE)","v":{"$error":"#VALUE!"}},{"$f":"T190-HLOOKUP(Y190,Feuil2!$C$1:$CD$9,8,FALSE)","v":{"$error":"#VALUE!"}},{"$f":"T190-HLOOKUP(Y190,Feuil2!$C$1:$CD$9,9,FALSE)","v":{"$error":"#VALUE!"}},null,null,null,null,null,null,null,{"$error":"#VALUE!"},2017,null,{"$f":"IF(AQ190,VLOOKUP(AQ190,HOM!$AS$389:$AT$444,2))","v":4.4930000000000003}]
["H",null,null,null,null,null,null,null,null,null,null,null,null,null,"",null,null,null,"","","","","",false,{"$f":"IF(AND(H191<1920),VLOOKUP(I191,Feuil2!$F$10:$P$28,11),IF(AND(H191>=1920,H191<1939),VLOOKUP(I191,Feuil2!$F$10:$P$28,11),IF(AND(H191>=1938,H191<1943),VLOOKUP(I191,Feuil2!$F$10:$P$28,10),IF(AND(H191>=1943,H191<1948),VLOOKUP(I191,Feuil2!$F$10:$P$28,9),IF(AND(H191>=1948,H191<1953),VLOOKUP(I191,Feuil2!$F$10:$P$28,8),IF(AND(H191>=1953,H191<1958),VLOOKUP(I191,Feuil2!$F$10:$P$28,7),IF(AND(H191>=1958,H191<1963),VLOOKUP(I191,Feuil2!$F$10:$P$28,6),IF(AND(H191>=1963,H191<1968),VLOOKUP(I191,Feuil2!$F$10:$P$28,5),IF(AND(H191>=1968,H191<1973),VLOOKUP(I191,Feuil2!$F$10:$P$28,4),IF(AND(H191>=1973,H191<1978),VLOOKUP(I191,Feuil2!$F$10:$P$28,3),IF(AND(H191>=1978,H191<1983),VLOOKUP(I191,Feuil2!$F$10:$P$28,2),VLOOKUP(I191,Feuil2!$F$10:$P$28,2))))))))))))","v":{"$error":"#N/A"}},null,{"$f":"T191-HLOOKUP(Y191,Feuil2!$C$1:$CD$9,2,FALSE)","v":{"$error":"#VALUE!"}},{"$f":"T191-HLOOKUP(Y191,Feuil2!$C$1:$CD$9,3,FALSE)","v":{"$error":"#VALUE!"}},{"$f":"T191-HLOOKUP(Y191,Feuil2!$C$1:$CD$9,4,FALSE)","v":{"$error":"#VALUE!"}},{"$f":"T191-HLOOKUP(Y191,Feuil2!$C$1:$CD$9,5,FALSE)","v":{"$error":"#VALUE!"}},{"$f":"T191-HLOOKUP(Y191,Feuil2!$C$1:$CD$9,6,FALSE)","v":{"$error":"#VALUE!"}},{"$f":"T191-HLOOKUP(Y191,Feuil2!$C$1:$CD$9,7,FALSE)","v":{"$error":"#VALUE!"}},{"$f":"T191-HLOOKUP(Y191,Feuil2!$C$1:$CD$9,8,FALSE)","v":{"$error":"#VALUE!"}},{"$f":"T191-HLOOKUP(Y191,Feuil2!$C$1:$CD$9,9,FALSE)","v":{"$error":"#VALUE!"}},null,null,null,null,null,null,null,{"$error":"#VALUE!"},2017,null,{"$f":"IF(AQ191,VLOOKUP(AQ191,HOM!$AS$389:$AT$444,2))","v":4.4930000000000003}]
["H",null,null,null,null,null,null,null,null,null,null,null,null,null,"",null,null,null,"","","","","",false,{"$f":"IF(AND(H192<1920),VLOOKUP(I192,Feuil2!$F$10:$P$28,11),IF(AND(H192>=1920,H192<1939),VLOOKUP(I192,Feuil2!$F$10:$P$28,11),IF(AND(H192>=1938,H192<1943),VLOOKUP(I192,Feuil2!$F$10:$P$28,10),IF(AND(H192>=1943,H192<1948),VLOOKUP(I192,Feuil2!$F$10:$P$28,9),IF(AND(H192>=1948,H192<1953),VLOOKUP(I192,Feuil2!$F$10:$P$28,8),IF(AND(H192>=1953,H192<1958),VLOOKUP(I192,Feuil2!$F$10:$P$28,7),IF(AND(H192>=1958,H192<1963),VLOOKUP(I192,Feuil2!$F$10:$P$28,6),IF(AND(H192>=1963,H192<1968),VLOOKUP(I192,Feuil2!$F$10:$P$28,5),IF(AND(H192>=1968,H192<1973),VLOOKUP(I192,Feuil2!$F$10:$P$28,4),IF(AND(H192>=1973,H192<1978),VLOOKUP(I192,Feuil2!$F$10:$P$28,3),IF(AND(H192>=1978,H192<1983),VLOOKUP(I192,Feuil2!$F$10:$P$28,2),VLOOKUP(I192,Feuil2!$F$10:$P$28,2))))))))))))","v":{"$error":"#N/A"}},null,{"$f":"T192-HLOOKUP(Y192,Feuil2!$C$1:$CD$9,2,FALSE)","v":{"$error":"#VALUE!"}},{"$f":"T192-HLOOKUP(Y192,Feuil2!$C$1:$CD$9,3,FALSE)","v":{"$error":"#VALUE!"}},{"$f":"T192-HLOOKUP(Y192,Feuil2!$C$1:$CD$9,4,FALSE)","v":{"$error":"#VALUE!"}},{"$f":"T192-HLOOKUP(Y192,Feuil2!$C$1:$CD$9,5,FALSE)","v":{"$error":"#VALUE!"}},{"$f":"T192-HLOOKUP(Y192,Feuil2!$C$1:$CD$9,6,FALSE)","v":{"$error":"#VALUE!"}},{"$f":"T192-HLOOKUP(Y192,Feuil2!$C$1:$CD$9,7,FALSE)","v":{"$error":"#VALUE!"}},{"$f":"T192-HLOOKUP(Y192,Feuil2!$C$1:$CD$9,8,FALSE)","v":{"$error":"#VALUE!"}},{"$f":"T192-HLOOKUP(Y192,Feuil2!$C$1:$CD$9,9,FALSE)","v":{"$error":"#VALUE!"}},null,null,null,null,null,null,null,{"$error":"#VALUE!"},2017,null,{"$f":"IF(AQ192,VLOOKUP(AQ192,HOM!$AS$389:$AT$444,2))","v":4.4930000000000003}]
["H",null,null,null,null,null,null,null,null,null,null,null,null,null,"",null,null,null,"","","","","",false,{"$f":"IF(AND(H193<1920),VLOOKUP(I193,Feuil2!$F$10:$P$28,11),IF(AND(H193>=1920,H193<1939),VLOOKUP(I193,Feuil2!$F$10:$P$28,11),IF(AND(H193>=1938,H193<1943),VLOOKUP(I193,Feuil2!$F$10:$P$28,10),IF(AND(H193>=1943,H193<1948),VLOOKUP(I193,Feuil2!$F$10:$P$28,9),IF(AND(H193>=1948,H193<1953),VLOOKUP(I193,Feuil2!$F$10:$P$28,8),IF(AND(H193>=1953,H193<1958),VLOOKUP(I193,Feuil2!$F$10:$P$28,7),IF(AND(H193>=1958,H193<1963),VLOOKUP(I193,Feuil2!$F$10:$P$28,6),IF(AND(H193>=1963,H193<1968),VLOOKUP(I193,Feuil2!$F$10:$P$28,5),IF(AND(H193>=1968,H193<1973),VLOOKUP(I193,Feuil2!$F$10:$P$28,4),IF(AND(H193>=1973,H193<1978),VLOOKUP(I193,Feuil2!$F$10:$P$28,3),IF(AND(H193>=1978,H193<1983),VLOOKUP(I193,Feuil2!$F$10:$P$28,2),VLOOKUP(I193,Feuil2!$F$10:$P$28,2))))))))))))","v":{"$error":"#N/A"}},null,{"$f":"T193-HLOOKUP(Y193,Feuil2!$C$1:$CD$9,2,FALSE)","v":{"$error":"#VALUE!"}},{"$f":"T193-HLOOKUP(Y193,Feuil2!$C$1:$CD$9,3,FALSE)","v":{"$error":"#VALUE!"}},{"$f":"T193-HLOOKUP(Y193,Feuil2!$C$1:$CD$9,4,FALSE)","v":{"$error":"#VALUE!"}},{"$f":"T193-HLOOKUP(Y193,Feuil2!$C$1:$CD$9,5,FALSE)","v":{"$error":"#VALUE!"}},{"$f":"T193-HLOOKUP(Y193,Feuil2!$C$1:$CD$9,6,FALSE)","v":{"$error":"#VALUE!"}},{"$f":"T193-HLOOKUP(Y193,Feuil2!$C$1:$CD$9,7,FALSE)","v":{"$error":"#VALUE!"}},{"$f":"T193-HLOOKUP(Y193,Feuil2!$C$1:$CD$9,8,FALSE)","v":{"$error":"#VALUE!"}},{"$f":"T193-HLOOKUP(Y193,Feuil2!$C$1:$CD$9,9,FALSE)","v":{"$error":"#VALUE!"}},null,null,null,null,null,null,null,{"$error":"#VALUE!"},2017,null,{"$f":"IF(AQ193,VLOOKUP(AQ193,HOM!$AS$389:$AT$444,2))","v":4.4930000000000003}]
["H",null,null,null,null,null,null,null,null,null,null,null,null,null,"",null,null,null,"","","","","",false,{"$f":"IF(AND(H194<1920),VLOOKUP(I194,Feuil2!$F$10:$P$28,11),IF(AND(H194>=1920,H194<1939),VLOOKUP(I194,Feuil2!$F$10:$P$28,11),IF(AND(H194>=1938,H194<1943),VLOOKUP(I194,Feuil2!$F$10:$P$28,10),IF(AND(H194>=1943,H194<1948),VLOOKUP(I194,Feuil2!$F$10:$P$28,9),IF(AND(H194>=1948,H194<1953),VLOOKUP(I194,Feuil2!$F$10:$P$28,8),IF(AND(H194>=1953,H194<1958),VLOOKUP(I194,Feuil2!$F$10:$P$28,7),IF(AND(H194>=1958,H194<1963),VLOOKUP(I194,Feuil2!$F$10:$P$28,6),IF(AND(H194>=1963,H194<1968),VLOOKUP(I194,Feuil2!$F$10:$P$28,5),IF(AND(H194>=1968,H194<1973),VLOOKUP(I194,Feuil2!$F$10:$P$28,4),IF(AND(H194>=1973,H194<1978),VLOOKUP(I194,Feuil2!$F$10:$P$28,3),IF(AND(H194>=1978,H194<1983),VLOOKUP(I194,Feuil2!$F$10:$P$28,2),VLOOKUP(I194,Feuil2!$F$10:$P$28,2))))))))))))","v":{"$error":"#N/A"}},null,{"$f":"T194-HLOOKUP(Y194,Feuil2!$C$1:$CD$9,2,FALSE)","v":{"$error":"#VALUE!"}},{"$f":"T194-HLOOKUP(Y194,Feuil2!$C$1:$CD$9,3,FALSE)","v":{"$error":"#VALUE!"}},{"$f":"T194-HLOOKUP(Y194,Feuil2!$C$1:$CD$9,4,FALSE)","v":{"$error":"#VALUE!"}},{"$f":"T194-HLOOKUP(Y194,Feuil2!$C$1:$CD$9,5,FALSE)","v":{"$error":"#VALUE!"}},{"$f":"T194-HLOOKUP(Y194,Feuil2!$C$1:$CD$9,6,FALSE)","v":{"$error":"#VALUE!"}},{"$f":"T194-HLOOKUP(Y194,Feuil2!$C$1:$CD$9,7,FALSE)","v":{"$error":"#VALUE!"}},{"$f":"T194-HLOOKUP(Y194,Feuil2!$C$1:$CD$9,8,FALSE)","v":{"$error":"#VALUE!"}},{"$f":"T194-HLOOKUP(Y194,Feuil2!$C$1:$CD$9,9,FALSE)","v":{"$error":"#VALUE!"}},null,null,null,null,null,null,null,{"$error":"#VALUE!"},2017,null,{"$f":"IF(AQ194,VLOOKUP(AQ194,HOM!$AS$389:$AT$444,2))","v":4.4930000000000003}]
["H",null,null,null,null,null,null,null,null,null,null,null,null,null,"",null,null,null,"","","","","",false,{"$f":"IF(AND(H195<1920),VLOOKUP(I195,Feuil2!$F$10:$P$28,11),IF(AND(H195>=1920,H195<1939),VLOOKUP(I195,Feuil2!$F$10:$P$28,11),IF(AND(H195>=1938,H195<1943),VLOOKUP(I195,Feuil2!$F$10:$P$28,10),IF(AND(H195>=1943,H195<1948),VLOOKUP(I195,Feuil2!$F$10:$P$28,9),IF(AND(H195>=1948,H195<1953),VLOOKUP(I195,Feuil2!$F$10:$P$28,8),IF(AND(H195>=1953,H195<1958),VLOOKUP(I195,Feuil2!$F$10:$P$28,7),IF(AND(H195>=1958,H195<1963),VLOOKUP(I195,Feuil2!$F$10:$P$28,6),IF(AND(H195>=1963,H195<1968),VLOOKUP(I195,Feuil2!$F$10:$P$28,5),IF(AND(H195>=1968,H195<1973),VLOOKUP(I195,Feuil2!$F$10:$P$28,4),IF(AND(H195>=1973,H195<1978),VLOOKUP(I195,Feuil2!$F$10:$P$28,3),IF(AND(H195>=1978,H195<1983),VLOOKUP(I195,Feuil2!$F$10:$P$28,2),VLOOKUP(I195,Feuil2!$F$10:$P$28,2))))))))))))","v":{"$error":"#N/A"}},null,{"$f":"T195-HLOOKUP(Y195,Feuil2!$C$1:$CD$9,2,FALSE)","v":{"$error":"#VALUE!"}},{"$f":"T195-HLOOKUP(Y195,Feuil2!$C$1:$CD$9,3,FALSE)","v":{"$error":"#VALUE!"}},{"$f":"T195-HLOOKUP(Y195,Feuil2!$C$1:$CD$9,4,FALSE)","v":{"$error":"#VALUE!"}},{"$f":"T195-HLOOKUP(Y195,Feuil2!$C$1:$CD$9,5,FALSE)","v":{"$error":"#VALUE!"}},{"$f":"T195-HLOOKUP(Y195,Feuil2!$C$1:$CD$9,6,FALSE)","v":{"$error":"#VALUE!"}},{"$f":"T195-HLOOKUP(Y195,Feuil2!$C$1:$CD$9,7,FALSE)","v":{"$error":"#VALUE!"}},{"$f":"T195-HLOOKUP(Y195,Feuil2!$C$1:$CD$9,8,FALSE)","v":{"$error":"#VALUE!"}},{"$f":"T195-HLOOKUP(Y195,Feuil2!$C$1:$CD$9,9,FALSE)","v":{"$error":"#VALUE!"}},null,null,null,null,null,null,null,{"$error":"#VALUE!"},2017,null,{"$f":"IF(AQ195,VLOOKUP(AQ195,HOM!$AS$389:$AT$444,2))","v":4.4930000000000003}]
["H",null,null,null,null,null,null,null,null,null,null,null,null,null,"",null,null,null,"","","","","",false,{"$f":"IF(AND(H196<1920),VLOOKUP(I196,Feuil2!$F$10:$P$28,11),IF(AND(H196>=1920,H196<1939),VLOOKUP(I196,Feuil2!$F$10:$P$28,11),IF(AND(H196>=1938,H196<1943),VLOOKUP(I196,Feuil2!$F$10:$P$28,10),IF(AND(H196>=1943,H196<1948),VLOOKUP(I196,Feuil2!$F$10:$P$28,9),IF(AND(H196>=1948,H196<1953),VLOOKUP(I196,Feuil2!$F$10:$P$28,8),IF(AND(H196>=1953,H196<1958),VLOOKUP(I196,Feuil2!$F$10:$P$28,7),IF(AND(H196>=1958,H196<1963),VLOOKUP(I196,Feuil2!$F$10:$P$28,6),IF(AND(H196>=1963,H196<1968),VLOOKUP(I196,Feuil2!$F$10:$P$28,5),IF(AND(H196>=1968,H196<1973),VLOOKUP(I196,Feuil2!$F$10:$P$28,4),IF(AND(H196>=1973,H196<1978),VLOOKUP(I196,Feuil2!$F$10:$P$28,3),IF(AND(H196>=1978,H196<1983),VLOOKUP(I196,Feuil2!$F$10:$P$28,2),VLOOKUP(I196,Feuil2!$F$10:$P$28,2))))))))))))","v":{"$error":"#N/A"}},null,{"$f":"T196-HLOOKUP(Y196,Feuil2!$C$1:$CD$9,2,FALSE)","v":{"$error":"#VALUE!"}},{"$f":"T196-HLOOKUP(Y196,Feuil2!$C$1:$CD$9,3,FALSE)","v":{"$error":"#VALUE!"}},{"$f":"T196-HLOOKUP(Y196,Feuil2!$C$1:$CD$9,4,FALSE)","v":{"$error":"#VALUE!"}},{"$f":"T196-HLOOKUP(Y196,Feuil2!$C$1:$CD$9,5,FALSE)","v":{"$error":"#VALUE!"}},{"$f":"T196-HLOOKUP(Y196,Feuil2!$C$1:$CD$9,6,FALSE)","v":{"$error":"#VALUE!"}},{"$f":"T196-HLOOKUP(Y196,Feuil2!$C$1:$CD$9,7,FALSE)","v":{"$error":"#VALUE!"}},{"$f":"T196-HLOOKUP(Y196,Feuil2!$C$1:$CD$9,8,FALSE)","v":{"$error":"#VALUE!"}},{"$f":"T196-HLOOKUP(Y196,Feuil2!$C$1:$CD$9,9,FALSE)","v":{"$error":"#VALUE!"}},null,null,null,null,null,null,null,{"$error":"#VALUE!"},2017,null,{"$f":"IF(AQ196,VLOOKUP(AQ196,HOM!$AS$389:$AT$444,2))","v":4.4930000000000003}]
["H",null,null,null,null,null,null,null,null,null,null,null,null,null,"",null,null,null,"","","","","",false,{"$f":"IF(AND(H197<1920),VLOOKUP(I197,Feuil2!$F$10:$P$28,11),IF(AND(H197>=1920,H197<1939),VLOOKUP(I197,Feuil2!$F$10:$P$28,11),IF(AND(H197>=1938,H197<1943),VLOOKUP(I197,Feuil2!$F$10:$P$28,10),IF(AND(H197>=1943,H197<1948),VLOOKUP(I197,Feuil2!$F$10:$P$28,9),IF(AND(H197>=1948,H197<1953),VLOOKUP(I197,Feuil2!$F$10:$P$28,8),IF(AND(H197>=1953,H197<1958),VLOOKUP(I197,Feuil2!$F$10:$P$28,7),IF(AND(H197>=1958,H197<1963),VLOOKUP(I197,Feuil2!$F$10:$P$28,6),IF(AND(H197>=1963,H197<1968),VLOOKUP(I197,Feuil2!$F$10:$P$28,5),IF(AND(H197>=1968,H197<1973),VLOOKUP(I197,Feuil2!$F$10:$P$28,4),IF(AND(H197>=1973,H197<1978),VLOOKUP(I197,Feuil2!$F$10:$P$28,3),IF(AND(H197>=1978,H197<1983),VLOOKUP(I197,Feuil2!$F$10:$P$28,2),VLOOKUP(I197,Feuil2!$F$10:$P$28,2))))))))))))","v":{"$error":"#N/A"}},null,{"$f":"T197-HLOOKUP(Y197,Feuil2!$C$1:$CD$9,2,FALSE)","v":{"$error":"#VALUE!"}},{"$f":"T197-HLOOKUP(Y197,Feuil2!$C$1:$CD$9,3,FALSE)","v":{"$error":"#VALUE!"}},{"$f":"T197-HLOOKUP(Y197,Feuil2!$C$1:$CD$9,4,FALSE)","v":{"$error":"#VALUE!"}},{"$f":"T197-HLOOKUP(Y197,Feuil2!$C$1:$CD$9,5,FALSE)","v":{"$error":"#VALUE!"}},{"$f":"T197-HLOOKUP(Y197,Feuil2!$C$1:$CD$9,6,FALSE)","v":{"$error":"#VALUE!"}},{"$f":"T197-HLOOKUP(Y197,Feuil2!$C$1:$CD$9,7,FALSE)","v":{"$error":"#VALUE!"}},{"$f":"T197-HLOOKUP(Y197,Feuil2!$C$1:$CD$9,8,FALSE)","v":{"$error":"#VALUE!"}},{"$f":"T197-HLOOKUP(Y197,Feuil2!$C$1:$CD$9,9,FALSE)","v":{"$error":"#VALUE!"}},null,null,null,null,null,null,null,{"$error":"#VALUE!"},2017,null,{"$f":"IF(AQ197,VLOOKUP(AQ197,HOM!$AS$389:$AT$444,2))","v":4.4930000000000003}]
["H",null,null,null,null,null,null,null,null,null,null,null,null,null,"",null,null,null,{"$f":"IF(I198=\"\",\"\",IF(MAXA(P198:R198)<=0,0,MAXA(P198:R198)))","v":""},{"$f":"IF(I198=\"\",\"\",IF(OR(O198=0,S198=0),0,O198+S198))","v":""},{"$f":"IF(I198=\"\",\"\",IF(A198=\"H\",10^(0.794358141*LOG(I198/174.393)^2)*T198*AS198,IF(A198=\"F\",10^(0.89726074 * LOG(I198/148.026)^2)*T198*AS198,\"\")))","v":""},{"$f":"IF(I198=\"\",\"\",AP198)","v":""},{"$f":"IF(I198=\"\",\"\",IF(AH198>=0,AH198,IF(AG198>=0,AG198,IF(AF198>=0,AF198,IF(AE198>=0,AE198,IF(AD198>=0,AD198,IF(AC198>=0,AC198,IF(AB198>=0,AB198,AA198))))))))","v":""},{"$f":"IF(AQ198<95,IF(AQ198<=90,VLOOKUP(AQ198,$AQ$255:$AR$444,2)))","v":false},{"$f":"IF(AND(H198<1920),VLOOKUP(I198,Feuil2!$F$10:$P$28,11),IF(AND(H198>=1920,H198<1939),VLOOKUP(I198,Feuil2!$F$10:$P$28,11),IF(AND(H198>=1938,H198<1943),VLOOKUP(I198,Feuil2!$F$10:$P$28,10),IF(AND(H198>=1943,H198<1948),VLOOKUP(I198,Feuil2!$F$10:$P$28,9),IF(AND(H198>=1948,H198<1953),VLOOKUP(I198,Feuil2!$F$10:$P$28,8),IF(AND(H198>=1953,H198<1958),VLOOKUP(I198,Feuil2!$F$10:$P$28,7),IF(AND(H198>=1958,H198<1963),VLOOKUP(I198,Feuil2!$F$10:$P$28,6),IF(AND(H198>=1963,H198<1968),VLOOKUP(I198,Feuil2!$F$10:$P$28,5),IF(AND(H198>=1968,H198<1973),VLOOKUP(I198,Feuil2!$F$10:$P$28,4),IF(AND(H198>=1973,H198<1978),VLOOKUP(I198,Feuil2!$F$10:$P$28,3),IF(AND(H198>=1978,H198<1983),VLOOKUP(I198,Feuil2!$F$10:$P$28,2),VLOOKUP(I198,Feuil2!$F$10:$P$28,2))))))))))))","v":{"$error":"#N/A"}},null,{"$f":"T198-HLOOKUP(Y198,Feuil2!$C$1:$CD$9,2,FALSE)","v":{"$error":"#VALUE!"}},{"$f":"T198-HLOOKUP(Y198,Feuil2!$C$1:$CD$9,3,FALSE)","v":{"$error":"#VALUE!"}},{"$f":"T198-HLOOKUP(Y198,Feuil2!$C$1:$CD$9,4,FALSE)","v":{"$error":"#VALUE!"}},{"$f":"T198-HLOOKUP(Y198,Feuil2!$C$1:$CD$9,5,FALSE)","v":{"$error":"#VALUE!"}},{"$f":"T198-HLOOKUP(Y198,Feuil2!$C$1:$CD$9,6,FALSE)","v":{"$error":"#VALUE!"}},{"$f":"T198-HLOOKUP(Y198,Feuil2!$C$1:$CD$9,7,FALSE)","v":{"$error":"#VALUE!"}},{"$f":"T198-HLOOKUP(Y198,Feuil2!$C$1:$CD$9,8,FALSE)","v":{"$error":"#VALUE!"}},{"$f":"T198-HLOOKUP(Y198,Feuil2!$C$1:$CD$9,9,FALSE)","v":{"$error":"#VALUE!"}},null,null,null,null,null,null,null,{"$f":"IF(AH198>=0,$AH$5,IF(AG198>=0,$AG$5,IF(AF198>=0,$AF$5,IF(AE198>=0,$AE$5,IF(AD198>=0,$AD$5,IF(AC198>=0,$AC$5,IF(AB198>=0,$AB$5,IF(AA198>=0,$AA$5,$AI$5))))))))","v":{"$error":"#VALUE!"}},{"$f":"2017-H198","v":2017},null,{"$f":"IF(AQ198,VLOOKUP(AQ198,HOM!$AS$389:$AT$444,2))","v":4.4930000000000003}]
["H",null,null,null,null,null,null,null,null,null,null,null,null,null,{"$f":"IF(I199=\"\",\"\",IF(MAXA(L199:N199)<=0,0,MAXA(L199:N199)))","v":""},null,null,null,"","","","","",false,{"$f":"IF(AND(H199<1920),VLOOKUP(I199,Feuil2!$F$10:$P$28,11),IF(AND(H199>=1920,H199<1939),VLOOKUP(I199,Feuil2!$F$10:$P$28,11),IF(AND(H199>=1938,H199<1943),VLOOKUP(I199,Feuil2!$F$10:$P$28,10),IF(AND(H199>=1943,H199<1948),VLOOKUP(I199,Feuil2!$F$10:$P$28,9),IF(AND(H199>=1948,H199<1953),VLOOKUP(I199,Feuil2!$F$10:$P$28,8),IF(AND(H199>=1953,H199<1958),VLOOKUP(I199,Feuil2!$F$10:$P$28,7),IF(AND(H199>=1958,H199<1963),VLOOKUP(I199,Feuil2!$F$10:$P$28,6),IF(AND(H199>=1963,H199<1968),VLOOKUP(I199,Feuil2!$F$10:$P$28,5),IF(AND(H199>=1968,H199<1973),VLOOKUP(I199,Feuil2!$F$10:$P$28,4),IF(AND(H199>=1973,H199<1978),VLOOKUP(I199,Feuil2!$F$10:$P$28,3),IF(AND(H199>=1978,H199<1983),VLOOKUP(I199,Feuil2!$F$10:$P$28,2),VLOOKUP(I199,Feuil2!$F$10:$P$28,2))))))))))))","v":{"$error":"#N/A"}},null,{"$f":"T199-HLOOKUP(Y199,Feuil2!$C$1:$CD$9,2,FALSE)","v":{"$error":"#VALUE!"}},{"$f":"T199-HLOOKUP(Y199,Feuil2!$C$1:$CD$9,3,FALSE)","v":{"$error":"#VALUE!"}},{"$f":"T199-HLOOKUP(Y199,Feuil2!$C$1:$CD$9,4,FALSE)","v":{"$error":"#VALUE!"}},{"$f":"T199-HLOOKUP(Y199,Feuil2!$C$1:$CD$9,5,FALSE)","v":{"$error":"#VALUE!"}},{"$f":"T199-HLOOKUP(Y199,Feuil2!$C$1:$CD$9,6,FALSE)","v":{"$error":"#VALUE!"}},{"$f":"T199-HLOOKUP(Y199,Feuil2!$C$1:$CD$9,7,FALSE)","v":{"$error":"#VALUE!"}},{"$f":"T199-HLOOKUP(Y199,Feuil2!$C$1:$CD$9,8,FALSE)","v":{"$error":"#VALUE!"}},{"$f":"T199-HLOOKUP(Y199,Feuil2!$C$1:$CD$9,9,FALSE)","v":{"$error":"#VALUE!"}},null,null,null,null,null,null,null,{"$error":"#VALUE!"},2017,null,{"$f":"IF(AQ199,VLOOKUP(AQ199,HOM!$AS$389:$AT$444,2))","v":4.4930000000000003}]
["H",null,null,null,null,null,null,null,null,null,null,null,null,null,"",null,null,null,"","","","","",false,{"$f":"IF(AND(H200<1920),VLOOKUP(I200,Feuil2!$F$10:$P$28,11),IF(AND(H200>=1920,H200<1939),VLOOKUP(I200,Feuil2!$F$10:$P$28,11),IF(AND(H200>=1938,H200<1943),VLOOKUP(I200,Feuil2!$F$10:$P$28,10),IF(AND(H200>=1943,H200<1948),VLOOKUP(I200,Feuil2!$F$10:$P$28,9),IF(AND(H200>=1948,H200<1953),VLOOKUP(I200,Feuil2!$F$10:$P$28,8),IF(AND(H200>=1953,H200<1958),VLOOKUP(I200,Feuil2!$F$10:$P$28,7),IF(AND(H200>=1958,H200<1963),VLOOKUP(I200,Feuil2!$F$10:$P$28,6),IF(AND(H200>=1963,H200<1968),VLOOKUP(I200,Feuil2!$F$10:$P$28,5),IF(AND(H200>=1968,H200<1973),VLOOKUP(I200,Feuil2!$F$10:$P$28,4),IF(AND(H200>=1973,H200<1978),VLOOKUP(I200,Feuil2!$F$10:$P$28,3),IF(AND(H200>=1978,H200<1983),VLOOKUP(I200,Feuil2!$F$10:$P$28,2),VLOOKUP(I200,Feuil2!$F$10:$P$28,2))))))))))))","v":{"$error":"#N/A"}},null,{"$f":"T200-HLOOKUP(Y200,Feuil2!$C$1:$CD$9,2,FALSE)","v":{"$error":"#VALUE!"}},{"$f":"T200-HLOOKUP(Y200,Feuil2!$C$1:$CD$9,3,FALSE)","v":{"$error":"#VALUE!"}},{"$f":"T200-HLOOKUP(Y200,Feuil2!$C$1:$CD$9,4,FALSE)","v":{"$error":"#VALUE!"}},{"$f":"T200-HLOOKUP(Y200,Feuil2!$C$1:$CD$9,5,FALSE)","v":{"$error":"#VALUE!"}},{"$f":"T200-HLOOKUP(Y200,Feuil2!$C$1:$CD$9,6,FALSE)","v":{"$error":"#VALUE!"}},{"$f":"T200-HLOOKUP(Y200,Feuil2!$C$1:$CD$9,7,FALSE)","v":{"$error":"#VALUE!"}},{"$f":"T200-HLOOKUP(Y200,Feuil2!$C$1:$CD$9,8,FALSE)","v":{"$error":"#VALUE!"}},{"$f":"T200-HLOOKUP(Y200,Feuil2!$C$1:$CD$9,9,FALSE)","v":{"$error":"#VALUE!"}},null,null,null,null,null,null,null,{"$error":"#VALUE!"},2017,null,{"$f":"IF(AQ200,VLOOKUP(AQ200,HOM!$AS$389:$AT$444,2))","v":4.4930000000000003}]
["H",null,null,null,null,null,null,null,null,null,null,null,null,null,"",null,null,null,"","","","","",false,{"$f":"IF(AND(H201<1920),VLOOKUP(I201,Feuil2!$F$10:$P$28,11),IF(AND(H201>=1920,H201<1939),VLOOKUP(I201,Feuil2!$F$10:$P$28,11),IF(AND(H201>=1938,H201<1943),VLOOKUP(I201,Feuil2!$F$10:$P$28,10),IF(AND(H201>=1943,H201<1948),VLOOKUP(I201,Feuil2!$F$10:$P$28,9),IF(AND(H201>=1948,H201<1953),VLOOKUP(I201,Feuil2!$F$10:$P$28,8),IF(AND(H201>=1953,H201<1958),VLOOKUP(I201,Feuil2!$F$10:$P$28,7),IF(AND(H201>=1958,H201<1963),VLOOKUP(I201,Feuil2!$F$10:$P$28,6),IF(AND(H201>=1963,H201<1968),VLOOKUP(I201,Feuil2!$F$10:$P$28,5),IF(AND(H201>=1968,H201<1973),VLOOKUP(I201,Feuil2!$F$10:$P$28,4),IF(AND(H201>=1973,H201<1978),VLOOKUP(I201,Feuil2!$F$10:$P$28,3),IF(AND(H201>=1978,H201<1983),VLOOKUP(I201,Feuil2!$F$10:$P$28,2),VLOOKUP(I201,Feuil2!$F$10:$P$28,2))))))))))))","v":{"$error":"#N/A"}},null,{"$f":"T201-HLOOKUP(Y201,Feuil2!$C$1:$CD$9,2,FALSE)","v":{"$error":"#VALUE!"}},{"$f":"T201-HLOOKUP(Y201,Feuil2!$C$1:$CD$9,3,FALSE)","v":{"$error":"#VALUE!"}},{"$f":"T201-HLOOKUP(Y201,Feuil2!$C$1:$CD$9,4,FALSE)","v":{"$error":"#VALUE!"}},{"$f":"T201-HLOOKUP(Y201,Feuil2!$C$1:$CD$9,5,FALSE)","v":{"$error":"#VALUE!"}},{"$f":"T201-HLOOKUP(Y201,Feuil2!$C$1:$CD$9,6,FALSE)","v":{"$error":"#VALUE!"}},{"$f":"T201-HLOOKUP(Y201,Feuil2!$C$1:$CD$9,7,FALSE)","v":{"$error":"#VALUE!"}},{"$f":"T201-HLOOKUP(Y201,Feuil2!$C$1:$CD$9,8,FALSE)","v":{"$error":"#VALUE!"}},{"$f":"T201-HLOOKUP(Y201,Feuil2!$C$1:$CD$9,9,FALSE)","v":{"$error":"#VALUE!"}},null,null,null,null,null,null,null,{"$error":"#VALUE!"},2017,null,{"$f":"IF(AQ201,VLOOKUP(AQ201,HOM!$AS$389:$AT$444,2))","v":4.4930000000000003}]
["H",null,null,null,null,null,null,null,null,null,null,null,null,null,"",null,null,null,"","","","","",false,{"$f":"IF(AND(H202<1920),VLOOKUP(I202,Feuil2!$F$10:$P$28,11),IF(AND(H202>=1920,H202<1939),VLOOKUP(I202,Feuil2!$F$10:$P$28,11),IF(AND(H202>=1938,H202<1943),VLOOKUP(I202,Feuil2!$F$10:$P$28,10),IF(AND(H202>=1943,H202<1948),VLOOKUP(I202,Feuil2!$F$10:$P$28,9),IF(AND(H202>=1948,H202<1953),VLOOKUP(I202,Feuil2!$F$10:$P$28,8),IF(AND(H202>=1953,H202<1958),VLOOKUP(I202,Feuil2!$F$10:$P$28,7),IF(AND(H202>=1958,H202<1963),VLOOKUP(I202,Feuil2!$F$10:$P$28,6),IF(AND(H202>=1963,H202<1968),VLOOKUP(I202,Feuil2!$F$10:$P$28,5),IF(AND(H202>=1968,H202<1973),VLOOKUP(I202,Feuil2!$F$10:$P$28,4),IF(AND(H202>=1973,H202<1978),VLOOKUP(I202,Feuil2!$F$10:$P$28,3),IF(AND(H202>=1978,H202<1983),VLOOKUP(I202,Feuil2!$F$10:$P$28,2),VLOOKUP(I202,Feuil2!$F$10:$P$28,2))))))))))))","v":{"$error":"#N/A"}},null,{"$f":"T202-HLOOKUP(Y202,Feuil2!$C$1:$CD$9,2,FALSE)","v":{"$error":"#VALUE!"}},{"$f":"T202-HLOOKUP(Y202,Feuil2!$C$1:$CD$9,3,FALSE)","v":{"$error":"#VALUE!"}},{"$f":"T202-HLOOKUP(Y202,Feuil2!$C$1:$CD$9,4,FALSE)","v":{"$error":"#VALUE!"}},{"$f":"T202-HLOOKUP(Y202,Feuil2!$C$1:$CD$9,5,FALSE)","v":{"$error":"#VALUE!"}},{"$f":"T202-HLOOKUP(Y202,Feuil2!$C$1:$CD$9,6,FALSE)","v":{"$error":"#VALUE!"}},{"$f":"T202-HLOOKUP(Y202,Feuil2!$C$1:$CD$9,7,FALSE)","v":{"$error":"#VALUE!"}},{"$f":"T202-HLOOKUP(Y202,Feuil2!$C$1:$CD$9,8,FALSE)","v":{"$error":"#VALUE!"}},{"$f":"T202-HLOOKUP(Y202,Feuil2!$C$1:$CD$9,9,FALSE)","v":{"$error":"#VALUE!"}},null,null,null,null,null,null,null,{"$error":"#VALUE!"},2017,null,{"$f":"IF(AQ202,VLOOKUP(AQ202,HOM!$AS$389:$AT$444,2))","v":4.4930000000000003}]
["H",null,null,null,null,null,null,null,null,null,null,null,null,null,"",null,null,null,"","","","","",false,{"$f":"IF(AND(H203<1920),VLOOKUP(I203,Feuil2!$F$10:$P$28,11),IF(AND(H203>=1920,H203<1939),VLOOKUP(I203,Feuil2!$F$10:$P$28,11),IF(AND(H203>=1938,H203<1943),VLOOKUP(I203,Feuil2!$F$10:$P$28,10),IF(AND(H203>=1943,H203<1948),VLOOKUP(I203,Feuil2!$F$10:$P$28,9),IF(AND(H203>=1948,H203<1953),VLOOKUP(I203,Feuil2!$F$10:$P$28,8),IF(AND(H203>=1953,H203<1958),VLOOKUP(I203,Feuil2!$F$10:$P$28,7),IF(AND(H203>=1958,H203<1963),VLOOKUP(I203,Feuil2!$F$10:$P$28,6),IF(AND(H203>=1963,H203<1968),VLOOKUP(I203,Feuil2!$F$10:$P$28,5),IF(AND(H203>=1968,H203<1973),VLOOKUP(I203,Feuil2!$F$10:$P$28,4),IF(AND(H203>=1973,H203<1978),VLOOKUP(I203,Feuil2!$F$10:$P$28,3),IF(AND(H203>=1978,H203<1983),VLOOKUP(I203,Feuil2!$F$10:$P$28,2),VLOOKUP(I203,Feuil2!$F$10:$P$28,2))))))))))))","v":{"$error":"#N/A"}},null,{"$f":"T203-HLOOKUP(Y203,Feuil2!$C$1:$CD$9,2,FALSE)","v":{"$error":"#VALUE!"}},{"$f":"T203-HLOOKUP(Y203,Feuil2!$C$1:$CD$9,3,FALSE)","v":{"$error":"#VALUE!"}},{"$f":"T203-HLOOKUP(Y203,Feuil2!$C$1:$CD$9,4,FALSE)","v":{"$error":"#VALUE!"}},{"$f":"T203-HLOOKUP(Y203,Feuil2!$C$1:$CD$9,5,FALSE)","v":{"$error":"#VALUE!"}},{"$f":"T203-HLOOKUP(Y203,Feuil2!$C$1:$CD$9,6,FALSE)","v":{"$error":"#VALUE!"}},{"$f":"T203-HLOOKUP(Y203,Feuil2!$C$1:$CD$9,7,FALSE)","v":{"$error":"#VALUE!"}},{"$f":"T203-HLOOKUP(Y203,Feuil2!$C$1:$CD$9,8,FALSE)","v":{"$error":"#VALUE!"}},{"$f":"T203-HLOOKUP(Y203,Feuil2!$C$1:$CD$9,9,FALSE)","v":{"$error":"#VALUE!"}},null,null,null,null,null,null,null,{"$error":"#VALUE!"},2017,null,{"$f":"IF(AQ203,VLOOKUP(AQ203,HOM!$AS$389:$AT$444,2))","v":4.4930000000000003}]
["H",null,null,null,null,null,null,null,null,null,null,null,null,null,"",null,null,null,{"$f":"IF(I204=\"\",\"\",IF(MAXA(P204:R204)<=0,0,MAXA(P204:R204)))","v":""},{"$f":"IF(I204=\"\",\"\",IF(OR(O204=0,S204=0),0,O204+S204))","v":""},"",{"$f":"IF(I204=\"\",\"\",AP204)","v":""},{"$f":"IF(I204=\"\",\"\",IF(AH204>=0,AH204,IF(AG204>=0,AG204,IF(AF204>=0,AF204,IF(AE204>=0,AE204,IF(AD204>=0,AD204,IF(AC204>=0,AC204,IF(AB204>=0,AB204,AA204))))))))","v":""},{"$f":"IF(AQ204<95,IF(AQ204<=90,VLOOKUP(AQ204,$AQ$255:$AR$444,2)))","v":false},{"$f":"IF(AND(H204<1920),VLOOKUP(I204,Feuil2!$F$10:$P$28,11),IF(AND(H204>=1920,H204<1939),VLOOKUP(I204,Feuil2!$F$10:$P$28,11),IF(AND(H204>=1938,H204<1943),VLOOKUP(I204,Feuil2!$F$10:$P$28,10),IF(AND(H204>=1943,H204<1948),VLOOKUP(I204,Feuil2!$F$10:$P$28,9),IF(AND(H204>=1948,H204<1953),VLOOKUP(I204,Feuil2!$F$10:$P$28,8),IF(AND(H204>=1953,H204<1958),VLOOKUP(I204,Feuil2!$F$10:$P$28,7),IF(AND(H204>=1958,H204<1963),VLOOKUP(I204,Feuil2!$F$10:$P$28,6),IF(AND(H204>=1963,H204<1968),VLOOKUP(I204,Feuil2!$F$10:$P$28,5),IF(AND(H204>=1968,H204<1973),VLOOKUP(I204,Feuil2!$F$10:$P$28,4),IF(AND(H204>=1973,H204<1978),VLOOKUP(I204,Feuil2!$F$10:$P$28,3),IF(AND(H204>=1978,H204<1983),VLOOKUP(I204,Feuil2!$F$10:$P$28,2),VLOOKUP(I204,Feuil2!$F$10:$P$28,2))))))))))))","v":{"$error":"#N/A"}},null,{"$f":"T204-HLOOKUP(Y204,Feuil2!$C$1:$CD$9,2,FALSE)","v":{"$error":"#VALUE!"}},{"$f":"T204-HLOOKUP(Y204,Feuil2!$C$1:$CD$9,3,FALSE)","v":{"$error":"#VALUE!"}},{"$f":"T204-HLOOKUP(Y204,Feuil2!$C$1:$CD$9,4,FALSE)","v":{"$error":"#VALUE!"}},{"$f":"T204-HLOOKUP(Y204,Feuil2!$C$1:$CD$9,5,FALSE)","v":{"$error":"#VALUE!"}},{"$f":"T204-HLOOKUP(Y204,Feuil2!$C$1:$CD$9,6,FALSE)","v":{"$error":"#VALUE!"}},{"$f":"T204-HLOOKUP(Y204,Feuil2!$C$1:$CD$9,7,FALSE)","v":{"$error":"#VALUE!"}},{"$f":"T204-HLOOKUP(Y204,Feuil2!$C$1:$CD$9,8,FALSE)","v":{"$error":"#VALUE!"}},{"$f":"T204-HLOOKUP(Y204,Feuil2!$C$1:$CD$9,9,FALSE)","v":{"$error":"#VALUE!"}},null,null,null,null,null,null,null,{"$f":"IF(AH204>=0,$AH$5,IF(AG204>=0,$AG$5,IF(AF204>=0,$AF$5,IF(AE204>=0,$AE$5,IF(AD204>=0,$AD$5,IF(AC204>=0,$AC$5,IF(AB204>=0,$AB$5,IF(AA204>=0,$AA$5,$AI$5))))))))","v":{"$error":"#VALUE!"}},{"$f":"2017-H204","v":2017},null,{"$f":"IF(AQ204,VLOOKUP(AQ204,HOM!$AS$389:$AT$444,2))","v":4.4930000000000003}]
["H",null,null,null,null,null,null,null,null,null,null,null,null,null,"",null,null,null,"","","","","",false,{"$f":"IF(AND(H205<1920),VLOOKUP(I205,Feuil2!$F$10:$P$28,11),IF(AND(H205>=1920,H205<1939),VLOOKUP(I205,Feuil2!$F$10:$P$28,11),IF(AND(H205>=1938,H205<1943),VLOOKUP(I205,Feuil2!$F$10:$P$28,10),IF(AND(H205>=1943,H205<1948),VLOOKUP(I205,Feuil2!$F$10:$P$28,9),IF(AND(H205>=1948,H205<1953),VLOOKUP(I205,Feuil2!$F$10:$P$28,8),IF(AND(H205>=1953,H205<1958),VLOOKUP(I205,Feuil2!$F$10:$P$28,7),IF(AND(H205>=1958,H205<1963),VLOOKUP(I205,Feuil2!$F$10:$P$28,6),IF(AND(H205>=1963,H205<1968),VLOOKUP(I205,Feuil2!$F$10:$P$28,5),IF(AND(H205>=1968,H205<1973),VLOOKUP(I205,Feuil2!$F$10:$P$28,4),IF(AND(H205>=1973,H205<1978),VLOOKUP(I205,Feuil2!$F$10:$P$28,3),IF(AND(H205>=1978,H205<1983),VLOOKUP(I205,Feuil2!$F$10:$P$28,2),VLOOKUP(I205,Feuil2!$F$10:$P$28,2))))))))))))","v":{"$error":"#N/A"}},null,{"$f":"T205-HLOOKUP(Y205,Feuil2!$C$1:$CD$9,2,FALSE)","v":{"$error":"#VALUE!"}},{"$f":"T205-HLOOKUP(Y205,Feuil2!$C$1:$CD$9,3,FALSE)","v":{"$error":"#VALUE!"}},{"$f":"T205-HLOOKUP(Y205,Feuil2!$C$1:$CD$9,4,FALSE)","v":{"$error":"#VALUE!"}},{"$f":"T205-HLOOKUP(Y205,Feuil2!$C$1:$CD$9,5,FALSE)","v":{"$error":"#VALUE!"}},{"$f":"T205-HLOOKUP(Y205,Feuil2!$C$1:$CD$9,6,FALSE)","v":{"$error":"#VALUE!"}},{"$f":"T205-HLOOKUP(Y205,Feuil2!$C$1:$CD$9,7,FALSE)","v":{"$error":"#VALUE!"}},{"$f":"T205-HLOOKUP(Y205,Feuil2!$C$1:$CD$9,8,FALSE)","v":{"$error":"#VALUE!"}},{"$f":"T205-HLOOKUP(Y205,Feuil2!$C$1:$CD$9,9,FALSE)","v":{"$error":"#VALUE!"}},null,null,null,null,null,null,null,{"$error":"#VALUE!"},2017,null,{"$f":"IF(AQ205,VLOOKUP(AQ205,HOM!$AS$389:$AT$444,2))","v":4.4930000000000003}]
["H",null,null,null,null,null,null,null,null,null,null,null,null,null,"",null,null,null,"","","","","",false,{"$f":"IF(AND(H206<1920),VLOOKUP(I206,Feuil2!$F$10:$P$28,11),IF(AND(H206>=1920,H206<1939),VLOOKUP(I206,Feuil2!$F$10:$P$28,11),IF(AND(H206>=1938,H206<1943),VLOOKUP(I206,Feuil2!$F$10:$P$28,10),IF(AND(H206>=1943,H206<1948),VLOOKUP(I206,Feuil2!$F$10:$P$28,9),IF(AND(H206>=1948,H206<1953),VLOOKUP(I206,Feuil2!$F$10:$P$28,8),IF(AND(H206>=1953,H206<1958),VLOOKUP(I206,Feuil2!$F$10:$P$28,7),IF(AND(H206>=1958,H206<1963),VLOOKUP(I206,Feuil2!$F$10:$P$28,6),IF(AND(H206>=1963,H206<1968),VLOOKUP(I206,Feuil2!$F$10:$P$28,5),IF(AND(H206>=1968,H206<1973),VLOOKUP(I206,Feuil2!$F$10:$P$28,4),IF(AND(H206>=1973,H206<1978),VLOOKUP(I206,Feuil2!$F$10:$P$28,3),IF(AND(H206>=1978,H206<1983),VLOOKUP(I206,Feuil2!$F$10:$P$28,2),VLOOKUP(I206,Feuil2!$F$10:$P$28,2))))))))))))","v":{"$error":"#N/A"}},null,{"$f":"T206-HLOOKUP(Y206,Feuil2!$C$1:$CD$9,2,FALSE)","v":{"$error":"#VALUE!"}},{"$f":"T206-HLOOKUP(Y206,Feuil2!$C$1:$CD$9,3,FALSE)","v":{"$error":"#VALUE!"}},{"$f":"T206-HLOOKUP(Y206,Feuil2!$C$1:$CD$9,4,FALSE)","v":{"$error":"#VALUE!"}},{"$f":"T206-HLOOKUP(Y206,Feuil2!$C$1:$CD$9,5,FALSE)","v":{"$error":"#VALUE!"}},{"$f":"T206-HLOOKUP(Y206,Feuil2!$C$1:$CD$9,6,FALSE)","v":{"$error":"#VALUE!"}},{"$f":"T206-HLOOKUP(Y206,Feuil2!$C$1:$CD$9,7,FALSE)","v":{"$error":"#VALUE!"}},{"$f":"T206-HLOOKUP(Y206,Feuil2!$C$1:$CD$9,8,FALSE)","v":{"$error":"#VALUE!"}},{"$f":"T206-HLOOKUP(Y206,Feuil2!$C$1:$CD$9,9,FALSE)","v":{"$error":"#VALUE!"}},null,null,null,null,null,null,null,{"$error":"#VALUE!"},2017,null,{"$f":"IF(AQ206,VLOOKUP(AQ206,HOM!$AS$389:$AT$444,2))","v":4.4930000000000003}]
["H",null,null,null,null,null,null,null,null,null,null,null,null,null,"",null,null,null,"","","","","",false,{"$f":"IF(AND(H207<1920),VLOOKUP(I207,Feuil2!$F$10:$P$28,11),IF(AND(H207>=1920,H207<1939),VLOOKUP(I207,Feuil2!$F$10:$P$28,11),IF(AND(H207>=1938,H207<1943),VLOOKUP(I207,Feuil2!$F$10:$P$28,10),IF(AND(H207>=1943,H207<1948),VLOOKUP(I207,Feuil2!$F$10:$P$28,9),IF(AND(H207>=1948,H207<1953),VLOOKUP(I207,Feuil2!$F$10:$P$28,8),IF(AND(H207>=1953,H207<1958),VLOOKUP(I207,Feuil2!$F$10:$P$28,7),IF(AND(H207>=1958,H207<1963),VLOOKUP(I207,Feuil2!$F$10:$P$28,6),IF(AND(H207>=1963,H207<1968),VLOOKUP(I207,Feuil2!$F$10:$P$28,5),IF(AND(H207>=1968,H207<1973),VLOOKUP(I207,Feuil2!$F$10:$P$28,4),IF(AND(H207>=1973,H207<1978),VLOOKUP(I207,Feuil2!$F$10:$P$28,3),IF(AND(H207>=1978,H207<1983),VLOOKUP(I207,Feuil2!$F$10:$P$28,2),VLOOKUP(I207,Feuil2!$F$10:$P$28,2))))))))))))","v":{"$error":"#N/A"}},null,{"$f":"T207-HLOOKUP(Y207,Feuil2!$C$1:$CD$9,2,FALSE)","v":{"$error":"#VALUE!"}},{"$f":"T207-HLOOKUP(Y207,Feuil2!$C$1:$CD$9,3,FALSE)","v":{"$error":"#VALUE!"}},{"$f":"T207-HLOOKUP(Y207,Feuil2!$C$1:$CD$9,4,FALSE)","v":{"$error":"#VALUE!"}},{"$f":"T207-HLOOKUP(Y207,Feuil2!$C$1:$CD$9,5,FALSE)","v":{"$error":"#VALUE!"}},{"$f":"T207-HLOOKUP(Y207,Feuil2!$C$1:$CD$9,6,FALSE)","v":{"$error":"#VALUE!"}},{"$f":"T207-HLOOKUP(Y207,Feuil2!$C$1:$CD$9,7,FALSE)","v":{"$error":"#VALUE!"}},{"$f":"T207-HLOOKUP(Y207,Feuil2!$C$1:$CD$9,8,FALSE)","v":{"$error":"#VALUE!"}},{"$f":"T207-HLOOKUP(Y207,Feuil2!$C$1:$CD$9,9,FALSE)","v":{"$error":"#VALUE!"}},null,null,null,null,null,null,null,{"$error":"#VALUE!"},2017,null,{"$f":"IF(AQ207,VLOOKUP(AQ207,HOM!$AS$389:$AT$444,2))","v":4.4930000000000003}]
["H",null,null,null,null,null,null,null,null,null,null,null,null,null,"",null,null,null,"","","","","",false,{"$f":"IF(AND(H208<1920),VLOOKUP(I208,Feuil2!$F$10:$P$28,11),IF(AND(H208>=1920,H208<1939),VLOOKUP(I208,Feuil2!$F$10:$P$28,11),IF(AND(H208>=1938,H208<1943),VLOOKUP(I208,Feuil2!$F$10:$P$28,10),IF(AND(H208>=1943,H208<1948),VLOOKUP(I208,Feuil2!$F$10:$P$28,9),IF(AND(H208>=1948,H208<1953),VLOOKUP(I208,Feuil2!$F$10:$P$28,8),IF(AND(H208>=1953,H208<1958),VLOOKUP(I208,Feuil2!$F$10:$P$28,7),IF(AND(H208>=1958,H208<1963),VLOOKUP(I208,Feuil2!$F$10:$P$28,6),IF(AND(H208>=1963,H208<1968),VLOOKUP(I208,Feuil2!$F$10:$P$28,5),IF(AND(H208>=1968,H208<1973),VLOOKUP(I208,Feuil2!$F$10:$P$28,4),IF(AND(H208>=1973,H208<1978),VLOOKUP(I208,Feuil2!$F$10:$P$28,3),IF(AND(H208>=1978,H208<1983),VLOOKUP(I208,Feuil2!$F$10:$P$28,2),VLOOKUP(I208,Feuil2!$F$10:$P$28,2))))))))))))","v":{"$error":"#N/A"}},null,{"$f":"T208-HLOOKUP(Y208,Feuil2!$C$1:$CD$9,2,FALSE)","v":{"$error":"#VALUE!"}},{"$f":"T208-HLOOKUP(Y208,Feuil2!$C$1:$CD$9,3,FALSE)","v":{"$error":"#VALUE!"}},{"$f":"T208-HLOOKUP(Y208,Feuil2!$C$1:$CD$9,4,FALSE)","v":{"$error":"#VALUE!"}},{"$f":"T208-HLOOKUP(Y208,Feuil2!$C$1:$CD$9,5,FALSE)","v":{"$error":"#VALUE!"}},{"$f":"T208-HLOOKUP(Y208,Feuil2!$C$1:$CD$9,6,FALSE)","v":{"$error":"#VALUE!"}},{"$f":"T208-HLOOKUP(Y208,Feuil2!$C$1:$CD$9,7,FALSE)","v":{"$error":"#VALUE!"}},{"$f":"T208-HLOOKUP(Y208,Feuil2!$C$1:$CD$9,8,FALSE)","v":{"$error":"#VALUE!"}},{"$f":"T208-HLOOKUP(Y208,Feuil2!$C$1:$CD$9,9,FALSE)","v":{"$error":"#VALUE!"}},null,null,null,null,null,null,null,{"$error":"#VALUE!"},2017,null,{"$f":"IF(AQ208,VLOOKUP(AQ208,HOM!$AS$389:$AT$444,2))","v":4.4930000000000003}]
["H",null,null,null,null,null,null,null,null,null,null,null,null,null,"",null,null,null,"","","","","",false,{"$f":"IF(AND(H209<1920),VLOOKUP(I209,Feuil2!$F$10:$P$28,11),IF(AND(H209>=1920,H209<1939),VLOOKUP(I209,Feuil2!$F$10:$P$28,11),IF(AND(H209>=1938,H209<1943),VLOOKUP(I209,Feuil2!$F$10:$P$28,10),IF(AND(H209>=1943,H209<1948),VLOOKUP(I209,Feuil2!$F$10:$P$28,9),IF(AND(H209>=1948,H209<1953),VLOOKUP(I209,Feuil2!$F$10:$P$28,8),IF(AND(H209>=1953,H209<1958),VLOOKUP(I209,Feuil2!$F$10:$P$28,7),IF(AND(H209>=1958,H209<1963),VLOOKUP(I209,Feuil2!$F$10:$P$28,6),IF(AND(H209>=1963,H209<1968),VLOOKUP(I209,Feuil2!$F$10:$P$28,5),IF(AND(H209>=1968,H209<1973),VLOOKUP(I209,Feuil2!$F$10:$P$28,4),IF(AND(H209>=1973,H209<1978),VLOOKUP(I209,Feuil2!$F$10:$P$28,3),IF(AND(H209>=1978,H209<1983),VLOOKUP(I209,Feuil2!$F$10:$P$28,2),VLOOKUP(I209,Feuil2!$F$10:$P$28,2))))))))))))","v":{"$error":"#N/A"}},null,{"$f":"T209-HLOOKUP(Y209,Feuil2!$C$1:$CD$9,2,FALSE)","v":{"$error":"#VALUE!"}},{"$f":"T209-HLOOKUP(Y209,Feuil2!$C$1:$CD$9,3,FALSE)","v":{"$error":"#VALUE!"}},{"$f":"T209-HLOOKUP(Y209,Feuil2!$C$1:$CD$9,4,FALSE)","v":{"$error":"#VALUE!"}},{"$f":"T209-HLOOKUP(Y209,Feuil2!$C$1:$CD$9,5,FALSE)","v":{"$error":"#VALUE!"}},{"$f":"T209-HLOOKUP(Y209,Feuil2!$C$1:$CD$9,6,FALSE)","v":{"$error":"#VALUE!"}},{"$f":"T209-HLOOKUP(Y209,Feuil2!$C$1:$CD$9,7,FALSE)","v":{"$error":"#VALUE!"}},{"$f":"T209-HLOOKUP(Y209,Feuil2!$C$1:$CD$9,8,FALSE)","v":{"$error":"#VALUE!"}},{"$f":"T209-HLOOKUP(Y209,Feuil2!$C$1:$CD$9,9,FALSE)","v":{"$error":"#VALUE!"}},null,null,null,null,null,null,null,{"$error":"#VALUE!"},2017,null,{"$f":"IF(AQ209,VLOOKUP(AQ209,HOM!$AS$389:$AT$444,2))","v":4.4930000000000003}]
["H",null,null,null,null,null,null,null,null,null,null,null,null,null,"",null,null,null,"","","","","",false,{"$f":"IF(AND(H210<1920),VLOOKUP(I210,Feuil2!$F$10:$P$28,11),IF(AND(H210>=1920,H210<1939),VLOOKUP(I210,Feuil2!$F$10:$P$28,11),IF(AND(H210>=1938,H210<1943),VLOOKUP(I210,Feuil2!$F$10:$P$28,10),IF(AND(H210>=1943,H210<1948),VLOOKUP(I210,Feuil2!$F$10:$P$28,9),IF(AND(H210>=1948,H210<1953),VLOOKUP(I210,Feuil2!$F$10:$P$28,8),IF(AND(H210>=1953,H210<1958),VLOOKUP(I210,Feuil2!$F$10:$P$28,7),IF(AND(H210>=1958,H210<1963),VLOOKUP(I210,Feuil2!$F$10:$P$28,6),IF(AND(H210>=1963,H210<1968),VLOOKUP(I210,Feuil2!$F$10:$P$28,5),IF(AND(H210>=1968,H210<1973),VLOOKUP(I210,Feuil2!$F$10:$P$28,4),IF(AND(H210>=1973,H210<1978),VLOOKUP(I210,Feuil2!$F$10:$P$28,3),IF(AND(H210>=1978,H210<1983),VLOOKUP(I210,Feuil2!$F$10:$P$28,2),VLOOKUP(I210,Feuil2!$F$10:$P$28,2))))))))))))","v":{"$error":"#N/A"}},null,{"$f":"T210-HLOOKUP(Y210,Feuil2!$C$1:$CD$9,2,FALSE)","v":{"$error":"#VALUE!"}},{"$f":"T210-HLOOKUP(Y210,Feuil2!$C$1:$CD$9,3,FALSE)","v":{"$error":"#VALUE!"}},{"$f":"T210-HLOOKUP(Y210,Feuil2!$C$1:$CD$9,4,FALSE)","v":{"$error":"#VALUE!"}},{"$f":"T210-HLOOKUP(Y210,Feuil2!$C$1:$CD$9,5,FALSE)","v":{"$error":"#VALUE!"}},{"$f":"T210-HLOOKUP(Y210,Feuil2!$C$1:$CD$9,6,FALSE)","v":{"$error":"#VALUE!"}},{"$f":"T210-HLOOKUP(Y210,Feuil2!$C$1:$CD$9,7,FALSE)","v":{"$error":"#VALUE!"}},{"$f":"T210-HLOOKUP(Y210,Feuil2!$C$1:$CD$9,8,FALSE)","v":{"$error":"#VALUE!"}},{"$f":"T210-HLOOKUP(Y210,Feuil2!$C$1:$CD$9,9,FALSE)","v":{"$error":"#VALUE!"}},null,null,null,null,null,null,null,{"$error":"#VALUE!"},2017,null,{"$f":"IF(AQ210,VLOOKUP(AQ210,HOM!$AS$389:$AT$444,2))","v":4.4930000000000003}]
["H",null,null,null,null,null,null,null,null,null,null,null,null,null,"",null,null,null,"","","","","",false,{"$f":"IF(AND(H211<1920),VLOOKUP(I211,Feuil2!$F$10:$P$28,11),IF(AND(H211>=1920,H211<1939),VLOOKUP(I211,Feuil2!$F$10:$P$28,11),IF(AND(H211>=1938,H211<1943),VLOOKUP(I211,Feuil2!$F$10:$P$28,10),IF(AND(H211>=1943,H211<1948),VLOOKUP(I211,Feuil2!$F$10:$P$28,9),IF(AND(H211>=1948,H211<1953),VLOOKUP(I211,Feuil2!$F$10:$P$28,8),IF(AND(H211>=1953,H211<1958),VLOOKUP(I211,Feuil2!$F$10:$P$28,7),IF(AND(H211>=1958,H211<1963),VLOOKUP(I211,Feuil2!$F$10:$P$28,6),IF(AND(H211>=1963,H211<1968),VLOOKUP(I211,Feuil2!$F$10:$P$28,5),IF(AND(H211>=1968,H211<1973),VLOOKUP(I211,Feuil2!$F$10:$P$28,4),IF(AND(H211>=1973,H211<1978),VLOOKUP(I211,Feuil2!$F$10:$P$28,3),IF(AND(H211>=1978,H211<1983),VLOOKUP(I211,Feuil2!$F$10:$P$28,2),VLOOKUP(I211,Feuil2!$F$10:$P$28,2))))))))))))","v":{"$error":"#N/A"}},null,{"$f":"T211-HLOOKUP(Y211,Feuil2!$C$1:$CD$9,2,FALSE)","v":{"$error":"#VALUE!"}},{"$f":"T211-HLOOKUP(Y211,Feuil2!$C$1:$CD$9,3,FALSE)","v":{"$error":"#VALUE!"}},{"$f":"T211-HLOOKUP(Y211,Feuil2!$C$1:$CD$9,4,FALSE)","v":{"$error":"#VALUE!"}},{"$f":"T211-HLOOKUP(Y211,Feuil2!$C$1:$CD$9,5,FALSE)","v":{"$error":"#VALUE!"}},{"$f":"T211-HLOOKUP(Y211,Feuil2!$C$1:$CD$9,6,FALSE)","v":{"$error":"#VALUE!"}},{"$f":"T211-HLOOKUP(Y211,Feuil2!$C$1:$CD$9,7,FALSE)","v":{"$error":"#VALUE!"}},{"$f":"T211-HLOOKUP(Y211,Feuil2!$C$1:$CD$9,8,FALSE)","v":{"$error":"#VALUE!"}},{"$f":"T211-HLOOKUP(Y211,Feuil2!$C$1:$CD$9,9,FALSE)","v":{"$error":"#VALUE!"}},null,null,null,null,null,null,null,{"$error":"#VALUE!"},2017,null,{"$f":"IF(AQ211,VLOOKUP(AQ211,HOM!$AS$389:$AT$444,2))","v":4.4930000000000003}]
["H",null,null,null,null,null,null,null,null,null,null,null,null,null,"",null,null,null,"","","","","",false,{"$f":"IF(AND(H212<1920),VLOOKUP(I212,Feuil2!$F$10:$P$28,11),IF(AND(H212>=1920,H212<1939),VLOOKUP(I212,Feuil2!$F$10:$P$28,11),IF(AND(H212>=1938,H212<1943),VLOOKUP(I212,Feuil2!$F$10:$P$28,10),IF(AND(H212>=1943,H212<1948),VLOOKUP(I212,Feuil2!$F$10:$P$28,9),IF(AND(H212>=1948,H212<1953),VLOOKUP(I212,Feuil2!$F$10:$P$28,8),IF(AND(H212>=1953,H212<1958),VLOOKUP(I212,Feuil2!$F$10:$P$28,7),IF(AND(H212>=1958,H212<1963),VLOOKUP(I212,Feuil2!$F$10:$P$28,6),IF(AND(H212>=1963,H212<1968),VLOOKUP(I212,Feuil2!$F$10:$P$28,5),IF(AND(H212>=1968,H212<1973),VLOOKUP(I212,Feuil2!$F$10:$P$28,4),IF(AND(H212>=1973,H212<1978),VLOOKUP(I212,Feuil2!$F$10:$P$28,3),IF(AND(H212>=1978,H212<1983),VLOOKUP(I212,Feuil2!$F$10:$P$28,2),VLOOKUP(I212,Feuil2!$F$10:$P$28,2))))))))))))","v":{"$error":"#N/A"}},null,{"$f":"T212-HLOOKUP(Y212,Feuil2!$C$1:$CD$9,2,FALSE)","v":{"$error":"#VALUE!"}},{"$f":"T212-HLOOKUP(Y212,Feuil2!$C$1:$CD$9,3,FALSE)","v":{"$error":"#VALUE!"}},{"$f":"T212-HLOOKUP(Y212,Feuil2!$C$1:$CD$9,4,FALSE)","v":{"$error":"#VALUE!"}},{"$f":"T212-HLOOKUP(Y212,Feuil2!$C$1:$CD$9,5,FALSE)","v":{"$error":"#VALUE!"}},{"$f":"T212-HLOOKUP(Y212,Feuil2!$C$1:$CD$9,6,FALSE)","v":{"$error":"#VALUE!"}},{"$f":"T212-HLOOKUP(Y212,Feuil2!$C$1:$CD$9,7,FALSE)","v":{"$error":"#VALUE!"}},{"$f":"T212-HLOOKUP(Y212,Feuil2!$C$1:$CD$9,8,FALSE)","v":{"$error":"#VALUE!"}},{"$f":"T212-HLOOKUP(Y212,Feuil2!$C$1:$CD$9,9,FALSE)","v":{"$error":"#VALUE!"}},null,null,null,null,null,null,null,{"$error":"#VALUE!"},2017,null,{"$f":"IF(AQ212,VLOOKUP(AQ212,HOM!$AS$389:$AT$444,2))","v":4.4930000000000003}]
["H",null,null,null,null,null,null,null,null,null,null,null,null,null,"",null,null,null,"","","","","",false,{"$f":"IF(AND(H213<1920),VLOOKUP(I213,Feuil2!$F$10:$P$28,11),IF(AND(H213>=1920,H213<1939),VLOOKUP(I213,Feuil2!$F$10:$P$28,11),IF(AND(H213>=1938,H213<1943),VLOOKUP(I213,Feuil2!$F$10:$P$28,10),IF(AND(H213>=1943,H213<1948),VLOOKUP(I213,Feuil2!$F$10:$P$28,9),IF(AND(H213>=1948,H213<1953),VLOOKUP(I213,Feuil2!$F$10:$P$28,8),IF(AND(H213>=1953,H213<1958),VLOOKUP(I213,Feuil2!$F$10:$P$28,7),IF(AND(H213>=1958,H213<1963),VLOOKUP(I213,Feuil2!$F$10:$P$28,6),IF(AND(H213>=1963,H213<1968),VLOOKUP(I213,Feuil2!$F$10:$P$28,5),IF(AND(H213>=1968,H213<1973),VLOOKUP(I213,Feuil2!$F$10:$P$28,4),IF(AND(H213>=1973,H213<1978),VLOOKUP(I213,Feuil2!$F$10:$P$28,3),IF(AND(H213>=1978,H213<1983),VLOOKUP(I213,Feuil2!$F$10:$P$28,2),VLOOKUP(I213,Feuil2!$F$10:$P$28,2))))))))))))","v":{"$error":"#N/A"}},null,{"$f":"T213-HLOOKUP(Y213,Feuil2!$C$1:$CD$9,2,FALSE)","v":{"$error":"#VALUE!"}},{"$f":"T213-HLOOKUP(Y213,Feuil2!$C$1:$CD$9,3,FALSE)","v":{"$error":"#VALUE!"}},{"$f":"T213-HLOOKUP(Y213,Feuil2!$C$1:$CD$9,4,FALSE)","v":{"$error":"#VALUE!"}},{"$f":"T213-HLOOKUP(Y213,Feuil2!$C$1:$CD$9,5,FALSE)","v":{"$error":"#VALUE!"}},{"$f":"T213-HLOOKUP(Y213,Feuil2!$C$1:$CD$9,6,FALSE)","v":{"$error":"#VALUE!"}},{"$f":"T213-HLOOKUP(Y213,Feuil2!$C$1:$CD$9,7,FALSE)","v":{"$error":"#VALUE!"}},{"$f":"T213-HLOOKUP(Y213,Feuil2!$C$1:$CD$9,8,FALSE)","v":{"$error":"#VALUE!"}},{"$f":"T213-HLOOKUP(Y213,Feuil2!$C$1:$CD$9,9,FALSE)","v":{"$error":"#VALUE!"}},null,null,null,null,null,null,null,{"$error":"#VALUE!"},2017,null,{"$f":"IF(AQ213,VLOOKUP(AQ213,HOM!$AS$389:$AT$444,2))","v":4.4930000000000003}]
["H",null,null,null,null,null,null,null,null,null,null,null,null,null,"",null,null,null,"","","","","",false,{"$f":"IF(AND(H214<1920),VLOOKUP(I214,Feuil2!$F$10:$P$28,11),IF(AND(H214>=1920,H214<1939),VLOOKUP(I214,Feuil2!$F$10:$P$28,11),IF(AND(H214>=1938,H214<1943),VLOOKUP(I214,Feuil2!$F$10:$P$28,10),IF(AND(H214>=1943,H214<1948),VLOOKUP(I214,Feuil2!$F$10:$P$28,9),IF(AND(H214>=1948,H214<1953),VLOOKUP(I214,Feuil2!$F$10:$P$28,8),IF(AND(H214>=1953,H214<1958),VLOOKUP(I214,Feuil2!$F$10:$P$28,7),IF(AND(H214>=1958,H214<1963),VLOOKUP(I214,Feuil2!$F$10:$P$28,6),IF(AND(H214>=1963,H214<1968),VLOOKUP(I214,Feuil2!$F$10:$P$28,5),IF(AND(H214>=1968,H214<1973),VLOOKUP(I214,Feuil2!$F$10:$P$28,4),IF(AND(H214>=1973,H214<1978),VLOOKUP(I214,Feuil2!$F$10:$P$28,3),IF(AND(H214>=1978,H214<1983),VLOOKUP(I214,Feuil2!$F$10:$P$28,2),VLOOKUP(I214,Feuil2!$F$10:$P$28,2))))))))))))","v":{"$error":"#N/A"}},null,{"$f":"T214-HLOOKUP(Y214,Feuil2!$C$1:$CD$9,2,FALSE)","v":{"$error":"#VALUE!"}},{"$f":"T214-HLOOKUP(Y214,Feuil2!$C$1:$CD$9,3,FALSE)","v":{"$error":"#VALUE!"}},{"$f":"T214-HLOOKUP(Y214,Feuil2!$C$1:$CD$9,4,FALSE)","v":{"$error":"#VALUE!"}},{"$f":"T214-HLOOKUP(Y214,Feuil2!$C$1:$CD$9,5,FALSE)","v":{"$error":"#VALUE!"}},{"$f":"T214-HLOOKUP(Y214,Feuil2!$C$1:$CD$9,6,FALSE)","v":{"$error":"#VALUE!"}},{"$f":"T214-HLOOKUP(Y214,Feuil2!$C$1:$CD$9,7,FALSE)","v":{"$error":"#VALUE!"}},{"$f":"T214-HLOOKUP(Y214,Feuil2!$C$1:$CD$9,8,FALSE)","v":{"$error":"#VALUE!"}},{"$f":"T214-HLOOKUP(Y214,Feuil2!$C$1:$CD$9,9,FALSE)","v":{"$error":"#VALUE!"}},null,null,null,null,null,null,null,{"$error":"#VALUE!"},2017,null,{"$f":"IF(AQ214,VLOOKUP(AQ214,HOM!$AS$389:$AT$444,2))","v":4.4930000000000003}]
["H",null,null,null,null,null,null,null,null,null,null,null,null,null,"",null,null,null,"","","","","",false,{"$f":"IF(AND(H215<1920),VLOOKUP(I215,Feuil2!$F$10:$P$28,11),IF(AND(H215>=1920,H215<1939),VLOOKUP(I215,Feuil2!$F$10:$P$28,11),IF(AND(H215>=1938,H215<1943),VLOOKUP(I215,Feuil2!$F$10:$P$28,10),IF(AND(H215>=1943,H215<1948),VLOOKUP(I215,Feuil2!$F$10:$P$28,9),IF(AND(H215>=1948,H215<1953),VLOOKUP(I215,Feuil2!$F$10:$P$28,8),IF(AND(H215>=1953,H215<1958),VLOOKUP(I215,Feuil2!$F$10:$P$28,7),IF(AND(H215>=1958,H215<1963),VLOOKUP(I215,Feuil2!$F$10:$P$28,6),IF(AND(H215>=1963,H215<1968),VLOOKUP(I215,Feuil2!$F$10:$P$28,5),IF(AND(H215>=1968,H215<1973),VLOOKUP(I215,Feuil2!$F$10:$P$28,4),IF(AND(H215>=1973,H215<1978),VLOOKUP(I215,Feuil2!$F$10:$P$28,3),IF(AND(H215>=1978,H215<1983),VLOOKUP(I215,Feuil2!$F$10:$P$28,2),VLOOKUP(I215,Feuil2!$F$10:$P$28,2))))))))))))","v":{"$error":"#N/A"}},null,{"$f":"T215-HLOOKUP(Y215,Feuil2!$C$1:$CD$9,2,FALSE)","v":{"$error":"#VALUE!"}},{"$f":"T215-HLOOKUP(Y215,Feuil2!$C$1:$CD$9,3,FALSE)","v":{"$error":"#VALUE!"}},{"$f":"T215-HLOOKUP(Y215,Feuil2!$C$1:$CD$9,4,FALSE)","v":{"$error":"#VALUE!"}},{"$f":"T215-HLOOKUP(Y215,Feuil2!$C$1:$CD$9,5,FALSE)","v":{"$error":"#VALUE!"}},{"$f":"T215-HLOOKUP(Y215,Feuil2!$C$1:$CD$9,6,FALSE)","v":{"$error":"#VALUE!"}},{"$f":"T215-HLOOKUP(Y215,Feuil2!$C$1:$CD$9,7,FALSE)","v":{"$error":"#VALUE!"}},{"$f":"T215-HLOOKUP(Y215,Feuil2!$C$1:$CD$9,8,FALSE)","v":{"$error":"#VALUE!"}},{"$f":"T215-HLOOKUP(Y215,Feuil2!$C$1:$CD$9,9,FALSE)","v":{"$error":"#VALUE!"}},null,null,null,null,null,null,null,{"$error":"#VALUE!"},2017,null,{"$f":"IF(AQ215,VLOOKUP(AQ215,HOM!$AS$389:$AT$444,2))","v":4.4930000000000003}]
["H",null,null,null,null,null,null,null,null,null,null,null,null,null,"",null,null,null,"","","","","",false,{"$f":"IF(AND(H216<1920),VLOOKUP(I216,Feuil2!$F$10:$P$28,11),IF(AND(H216>=1920,H216<1939),VLOOKUP(I216,Feuil2!$F$10:$P$28,11),IF(AND(H216>=1938,H216<1943),VLOOKUP(I216,Feuil2!$F$10:$P$28,10),IF(AND(H216>=1943,H216<1948),VLOOKUP(I216,Feuil2!$F$10:$P$28,9),IF(AND(H216>=1948,H216<1953),VLOOKUP(I216,Feuil2!$F$10:$P$28,8),IF(AND(H216>=1953,H216<1958),VLOOKUP(I216,Feuil2!$F$10:$P$28,7),IF(AND(H216>=1958,H216<1963),VLOOKUP(I216,Feuil2!$F$10:$P$28,6),IF(AND(H216>=1963,H216<1968),VLOOKUP(I216,Feuil2!$F$10:$P$28,5),IF(AND(H216>=1968,H216<1973),VLOOKUP(I216,Feuil2!$F$10:$P$28,4),IF(AND(H216>=1973,H216<1978),VLOOKUP(I216,Feuil2!$F$10:$P$28,3),IF(AND(H216>=1978,H216<1983),VLOOKUP(I216,Feuil2!$F$10:$P$28,2),VLOOKUP(I216,Feuil2!$F$10:$P$28,2))))))))))))","v":{"$error":"#N/A"}},null,{"$f":"T216-HLOOKUP(Y216,Feuil2!$C$1:$CD$9,2,FALSE)","v":{"$error":"#VALUE!"}},{"$f":"T216-HLOOKUP(Y216,Feuil2!$C$1:$CD$9,3,FALSE)","v":{"$error":"#VALUE!"}},{"$f":"T216-HLOOKUP(Y216,Feuil2!$C$1:$CD$9,4,FALSE)","v":{"$error":"#VALUE!"}},{"$f":"T216-HLOOKUP(Y216,Feuil2!$C$1:$CD$9,5,FALSE)","v":{"$error":"#VALUE!"}},{"$f":"T216-HLOOKUP(Y216,Feuil2!$C$1:$CD$9,6,FALSE)","v":{"$error":"#VALUE!"}},{"$f":"T216-HLOOKUP(Y216,Feuil2!$C$1:$CD$9,7,FALSE)","v":{"$error":"#VALUE!"}},{"$f":"T216-HLOOKUP(Y216,Feuil2!$C$1:$CD$9,8,FALSE)","v":{"$error":"#VALUE!"}},{"$f":"T216-HLOOKUP(Y216,Feuil2!$C$1:$CD$9,9,FALSE)","v":{"$error":"#VALUE!"}},null,null,null,null,null,null,null,{"$error":"#VALUE!"},2017,null,{"$f":"IF(AQ216,VLOOKUP(AQ216,HOM!$AS$389:$AT$444,2))","v":4.4930000000000003}]
["H",null,null,null,null,null,null,null,null,null,null,null,null,null,"",null,null,null,"","","","","",false,{"$f":"IF(AND(H217<1920),VLOOKUP(I217,Feuil2!$F$10:$P$28,11),IF(AND(H217>=1920,H217<1939),VLOOKUP(I217,Feuil2!$F$10:$P$28,11),IF(AND(H217>=1938,H217<1943),VLOOKUP(I217,Feuil2!$F$10:$P$28,10),IF(AND(H217>=1943,H217<1948),VLOOKUP(I217,Feuil2!$F$10:$P$28,9),IF(AND(H217>=1948,H217<1953),VLOOKUP(I217,Feuil2!$F$10:$P$28,8),IF(AND(H217>=1953,H217<1958),VLOOKUP(I217,Feuil2!$F$10:$P$28,7),IF(AND(H217>=1958,H217<1963),VLOOKUP(I217,Feuil2!$F$10:$P$28,6),IF(AND(H217>=1963,H217<1968),VLOOKUP(I217,Feuil2!$F$10:$P$28,5),IF(AND(H217>=1968,H217<1973),VLOOKUP(I217,Feuil2!$F$10:$P$28,4),IF(AND(H217>=1973,H217<1978),VLOOKUP(I217,Feuil2!$F$10:$P$28,3),IF(AND(H217>=1978,H217<1983),VLOOKUP(I217,Feuil2!$F$10:$P$28,2),VLOOKUP(I217,Feuil2!$F$10:$P$28,2))))))))))))","v":{"$error":"#N/A"}},null,{"$f":"T217-HLOOKUP(Y217,Feuil2!$C$1:$CD$9,2,FALSE)","v":{"$error":"#VALUE!"}},{"$f":"T217-HLOOKUP(Y217,Feuil2!$C$1:$CD$9,3,FALSE)","v":{"$error":"#VALUE!"}},{"$f":"T217-HLOOKUP(Y217,Feuil2!$C$1:$CD$9,4,FALSE)","v":{"$error":"#VALUE!"}},{"$f":"T217-HLOOKUP(Y217,Feuil2!$C$1:$CD$9,5,FALSE)","v":{"$error":"#VALUE!"}},{"$f":"T217-HLOOKUP(Y217,Feuil2!$C$1:$CD$9,6,FALSE)","v":{"$error":"#VALUE!"}},{"$f":"T217-HLOOKUP(Y217,Feuil2!$C$1:$CD$9,7,FALSE)","v":{"$error":"#VALUE!"}},{"$f":"T217-HLOOKUP(Y217,Feuil2!$C$1:$CD$9,8,FALSE)","v":{"$error":"#VALUE!"}},{"$f":"T217-HLOOKUP(Y217,Feuil2!$C$1:$CD$9,9,FALSE)","v":{"$error":"#VALUE!"}},null,null,null,null,null,null,null,{"$error":"#VALUE!"},2017,null,{"$f":"IF(AQ217,VLOOKUP(AQ217,HOM!$AS$389:$AT$444,2))","v":4.4930000000000003}]
["H",null,null,null,null,null,null,null,null,null,null,null,null,null,"",null,null,null,"","","","","",false,{"$f":"IF(AND(H218<1920),VLOOKUP(I218,Feuil2!$F$10:$P$28,11),IF(AND(H218>=1920,H218<1939),VLOOKUP(I218,Feuil2!$F$10:$P$28,11),IF(AND(H218>=1938,H218<1943),VLOOKUP(I218,Feuil2!$F$10:$P$28,10),IF(AND(H218>=1943,H218<1948),VLOOKUP(I218,Feuil2!$F$10:$P$28,9),IF(AND(H218>=1948,H218<1953),VLOOKUP(I218,Feuil2!$F$10:$P$28,8),IF(AND(H218>=1953,H218<1958),VLOOKUP(I218,Feuil2!$F$10:$P$28,7),IF(AND(H218>=1958,H218<1963),VLOOKUP(I218,Feuil2!$F$10:$P$28,6),IF(AND(H218>=1963,H218<1968),VLOOKUP(I218,Feuil2!$F$10:$P$28,5),IF(AND(H218>=1968,H218<1973),VLOOKUP(I218,Feuil2!$F$10:$P$28,4),IF(AND(H218>=1973,H218<1978),VLOOKUP(I218,Feuil2!$F$10:$P$28,3),IF(AND(H218>=1978,H218<1983),VLOOKUP(I218,Feuil2!$F$10:$P$28,2),VLOOKUP(I218,Feuil2!$F$10:$P$28,2))))))))))))","v":{"$error":"#N/A"}},null,{"$f":"T218-HLOOKUP(Y218,Feuil2!$C$1:$CD$9,2,FALSE)","v":{"$error":"#VALUE!"}},{"$f":"T218-HLOOKUP(Y218,Feuil2!$C$1:$CD$9,3,FALSE)","v":{"$error":"#VALUE!"}},{"$f":"T218-HLOOKUP(Y218,Feuil2!$C$1:$CD$9,4,FALSE)","v":{"$error":"#VALUE!"}},{"$f":"T218-HLOOKUP(Y218,Feuil2!$C$1:$CD$9,5,FALSE)","v":{"$error":"#VALUE!"}},{"$f":"T218-HLOOKUP(Y218,Feuil2!$C$1:$CD$9,6,FALSE)","v":{"$error":"#VALUE!"}},{"$f":"T218-HLOOKUP(Y218,Feuil2!$C$1:$CD$9,7,FALSE)","v":{"$error":"#VALUE!"}},{"$f":"T218-HLOOKUP(Y218,Feuil2!$C$1:$CD$9,8,FALSE)","v":{"$error":"#VALUE!"}},{"$f":"T218-HLOOKUP(Y218,Feuil2!$C$1:$CD$9,9,FALSE)","v":{"$error":"#VALUE!"}},null,null,null,null,null,null,null,{"$error":"#VALUE!"},2017,null,{"$f":"IF(AQ218,VLOOKUP(AQ218,HOM!$AS$389:$AT$444,2))","v":4.4930000000000003}]
["H",null,null,null,null,null,null,null,null,null,null,null,null,null,"",null,null,null,"","","","","",false,{"$f":"IF(AND(H219<1920),VLOOKUP(I219,Feuil2!$F$10:$P$28,11),IF(AND(H219>=1920,H219<1939),VLOOKUP(I219,Feuil2!$F$10:$P$28,11),IF(AND(H219>=1938,H219<1943),VLOOKUP(I219,Feuil2!$F$10:$P$28,10),IF(AND(H219>=1943,H219<1948),VLOOKUP(I219,Feuil2!$F$10:$P$28,9),IF(AND(H219>=1948,H219<1953),VLOOKUP(I219,Feuil2!$F$10:$P$28,8),IF(AND(H219>=1953,H219<1958),VLOOKUP(I219,Feuil2!$F$10:$P$28,7),IF(AND(H219>=1958,H219<1963),VLOOKUP(I219,Feuil2!$F$10:$P$28,6),IF(AND(H219>=1963,H219<1968),VLOOKUP(I219,Feuil2!$F$10:$P$28,5),IF(AND(H219>=1968,H219<1973),VLOOKUP(I219,Feuil2!$F$10:$P$28,4),IF(AND(H219>=1973,H219<1978),VLOOKUP(I219,Feuil2!$F$10:$P$28,3),IF(AND(H219>=1978,H219<1983),VLOOKUP(I219,Feuil2!$F$10:$P$28,2),VLOOKUP(I219,Feuil2!$F$10:$P$28,2))))))))))))","v":{"$error":"#N/A"}},null,{"$f":"T219-HLOOKUP(Y219,Feuil2!$C$1:$CD$9,2,FALSE)","v":{"$error":"#VALUE!"}},{"$f":"T219-HLOOKUP(Y219,Feuil2!$C$1:$CD$9,3,FALSE)","v":{"$error":"#VALUE!"}},{"$f":"T219-HLOOKUP(Y219,Feuil2!$C$1:$CD$9,4,FALSE)","v":{"$error":"#VALUE!"}},{"$f":"T219-HLOOKUP(Y219,Feuil2!$C$1:$CD$9,5,FALSE)","v":{"$error":"#VALUE!"}},{"$f":"T219-HLOOKUP(Y219,Feuil2!$C$1:$CD$9,6,FALSE)","v":{"$error":"#VALUE!"}},{"$f":"T219-HLOOKUP(Y219,Feuil2!$C$1:$CD$9,7,FALSE)","v":{"$error":"#VALUE!"}},{"$f":"T219-HLOOKUP(Y219,Feuil2!$C$1:$CD$9,8,FALSE)","v":{"$error":"#VALUE!"}},{"$f":"T219-HLOOKUP(Y219,Feuil2!$C$1:$CD$9,9,FALSE)","v":{"$error":"#VALUE!"}},null,null,null,null,null,null,null,{"$error":"#VALUE!"},2017,null,{"$f":"IF(AQ219,VLOOKUP(AQ219,HOM!$AS$389:$AT$444,2))","v":4.4930000000000003}]
["H",null,null,null,null,null,null,null,null,null,null,null,null,null,"",null,null,null,"","","","","",false,{"$f":"IF(AND(H220<1920),VLOOKUP(I220,Feuil2!$F$10:$P$28,11),IF(AND(H220>=1920,H220<1939),VLOOKUP(I220,Feuil2!$F$10:$P$28,11),IF(AND(H220>=1938,H220<1943),VLOOKUP(I220,Feuil2!$F$10:$P$28,10),IF(AND(H220>=1943,H220<1948),VLOOKUP(I220,Feuil2!$F$10:$P$28,9),IF(AND(H220>=1948,H220<1953),VLOOKUP(I220,Feuil2!$F$10:$P$28,8),IF(AND(H220>=1953,H220<1958),VLOOKUP(I220,Feuil2!$F$10:$P$28,7),IF(AND(H220>=1958,H220<1963),VLOOKUP(I220,Feuil2!$F$10:$P$28,6),IF(AND(H220>=1963,H220<1968),VLOOKUP(I220,Feuil2!$F$10:$P$28,5),IF(AND(H220>=1968,H220<1973),VLOOKUP(I220,Feuil2!$F$10:$P$28,4),IF(AND(H220>=1973,H220<1978),VLOOKUP(I220,Feuil2!$F$10:$P$28,3),IF(AND(H220>=1978,H220<1983),VLOOKUP(I220,Feuil2!$F$10:$P$28,2),VLOOKUP(I220,Feuil2!$F$10:$P$28,2))))))))))))","v":{"$error":"#N/A"}},null,{"$f":"T220-HLOOKUP(Y220,Feuil2!$C$1:$CD$9,2,FALSE)","v":{"$error":"#VALUE!"}},{"$f":"T220-HLOOKUP(Y220,Feuil2!$C$1:$CD$9,3,FALSE)","v":{"$error":"#VALUE!"}},{"$f":"T220-HLOOKUP(Y220,Feuil2!$C$1:$CD$9,4,FALSE)","v":{"$error":"#VALUE!"}},{"$f":"T220-HLOOKUP(Y220,Feuil2!$C$1:$CD$9,5,FALSE)","v":{"$error":"#VALUE!"}},{"$f":"T220-HLOOKUP(Y220,Feuil2!$C$1:$CD$9,6,FALSE)","v":{"$error":"#VALUE!"}},{"$f":"T220-HLOOKUP(Y220,Feuil2!$C$1:$CD$9,7,FALSE)","v":{"$error":"#VALUE!"}},{"$f":"T220-HLOOKUP(Y220,Feuil2!$C$1:$CD$9,8,FALSE)","v":{"$error":"#VALUE!"}},{"$f":"T220-HLOOKUP(Y220,Feuil2!$C$1:$CD$9,9,FALSE)","v":{"$error":"#VALUE!"}},null,null,null,null,null,null,null,{"$error":"#VALUE!"},2017,null,{"$f":"IF(AQ220,VLOOKUP(AQ220,HOM!$AS$389:$AT$444,2))","v":4.4930000000000003}]
["H",null,null,null,null,null,null,null,null,null,null,null,null,null,"",null,null,null,"","","","","",false,{"$f":"IF(AND(H221<1920),VLOOKUP(I221,Feuil2!$F$10:$P$28,11),IF(AND(H221>=1920,H221<1939),VLOOKUP(I221,Feuil2!$F$10:$P$28,11),IF(AND(H221>=1938,H221<1943),VLOOKUP(I221,Feuil2!$F$10:$P$28,10),IF(AND(H221>=1943,H221<1948),VLOOKUP(I221,Feuil2!$F$10:$P$28,9),IF(AND(H221>=1948,H221<1953),VLOOKUP(I221,Feuil2!$F$10:$P$28,8),IF(AND(H221>=1953,H221<1958),VLOOKUP(I221,Feuil2!$F$10:$P$28,7),IF(AND(H221>=1958,H221<1963),VLOOKUP(I221,Feuil2!$F$10:$P$28,6),IF(AND(H221>=1963,H221<1968),VLOOKUP(I221,Feuil2!$F$10:$P$28,5),IF(AND(H221>=1968,H221<1973),VLOOKUP(I221,Feuil2!$F$10:$P$28,4),IF(AND(H221>=1973,H221<1978),VLOOKUP(I221,Feuil2!$F$10:$P$28,3),IF(AND(H221>=1978,H221<1983),VLOOKUP(I221,Feuil2!$F$10:$P$28,2),VLOOKUP(I221,Feuil2!$F$10:$P$28,2))))))))))))","v":{"$error":"#N/A"}},null,{"$f":"T221-HLOOKUP(Y221,Feuil2!$C$1:$CD$9,2,FALSE)","v":{"$error":"#VALUE!"}},{"$f":"T221-HLOOKUP(Y221,Feuil2!$C$1:$CD$9,3,FALSE)","v":{"$error":"#VALUE!"}},{"$f":"T221-HLOOKUP(Y221,Feuil2!$C$1:$CD$9,4,FALSE)","v":{"$error":"#VALUE!"}},{"$f":"T221-HLOOKUP(Y221,Feuil2!$C$1:$CD$9,5,FALSE)","v":{"$error":"#VALUE!"}},{"$f":"T221-HLOOKUP(Y221,Feuil2!$C$1:$CD$9,6,FALSE)","v":{"$error":"#VALUE!"}},{"$f":"T221-HLOOKUP(Y221,Feuil2!$C$1:$CD$9,7,FALSE)","v":{"$error":"#VALUE!"}},{"$f":"T221-HLOOKUP(Y221,Feuil2!$C$1:$CD$9,8,FALSE)","v":{"$error":"#VALUE!"}},{"$f":"T221-HLOOKUP(Y221,Feuil2!$C$1:$CD$9,9,FALSE)","v":{"$error":"#VALUE!"}},null,null,null,null,null,null,null,{"$error":"#VALUE!"},2017,null,{"$f":"IF(AQ221,VLOOKUP(AQ221,HOM!$AS$389:$AT$444,2))","v":4.4930000000000003}]
["H",null,null,null,null,null,null,null,null,null,null,null,null,null,"",null,null,null,"","","","","",false,{"$f":"IF(AND(H222<1920),VLOOKUP(I222,Feuil2!$F$10:$P$28,11),IF(AND(H222>=1920,H222<1939),VLOOKUP(I222,Feuil2!$F$10:$P$28,11),IF(AND(H222>=1938,H222<1943),VLOOKUP(I222,Feuil2!$F$10:$P$28,10),IF(AND(H222>=1943,H222<1948),VLOOKUP(I222,Feuil2!$F$10:$P$28,9),IF(AND(H222>=1948,H222<1953),VLOOKUP(I222,Feuil2!$F$10:$P$28,8),IF(AND(H222>=1953,H222<1958),VLOOKUP(I222,Feuil2!$F$10:$P$28,7),IF(AND(H222>=1958,H222<1963),VLOOKUP(I222,Feuil2!$F$10:$P$28,6),IF(AND(H222>=1963,H222<1968),VLOOKUP(I222,Feuil2!$F$10:$P$28,5),IF(AND(H222>=1968,H222<1973),VLOOKUP(I222,Feuil2!$F$10:$P$28,4),IF(AND(H222>=1973,H222<1978),VLOOKUP(I222,Feuil2!$F$10:$P$28,3),IF(AND(H222>=1978,H222<1983),VLOOKUP(I222,Feuil2!$F$10:$P$28,2),VLOOKUP(I222,Feuil2!$F$10:$P$28,2))))))))))))","v":{"$error":"#N/A"}},null,{"$f":"T222-HLOOKUP(Y222,Feuil2!$C$1:$CD$9,2,FALSE)","v":{"$error":"#VALUE!"}},{"$f":"T222-HLOOKUP(Y222,Feuil2!$C$1:$CD$9,3,FALSE)","v":{"$error":"#VALUE!"}},{"$f":"T222-HLOOKUP(Y222,Feuil2!$C$1:$CD$9,4,FALSE)","v":{"$error":"#VALUE!"}},{"$f":"T222-HLOOKUP(Y222,Feuil2!$C$1:$CD$9,5,FALSE)","v":{"$error":"#VALUE!"}},{"$f":"T222-HLOOKUP(Y222,Feuil2!$C$1:$CD$9,6,FALSE)","v":{"$error":"#VALUE!"}},{"$f":"T222-HLOOKUP(Y222,Feuil2!$C$1:$CD$9,7,FALSE)","v":{"$error":"#VALUE!"}},{"$f":"T222-HLOOKUP(Y222,Feuil2!$C$1:$CD$9,8,FALSE)","v":{"$error":"#VALUE!"}},{"$f":"T222-HLOOKUP(Y222,Feuil2!$C$1:$CD$9,9,FALSE)","v":{"$error":"#VALUE!"}},null,null,null,null,null,null,null,{"$error":"#VALUE!"},2017,null,{"$f":"IF(AQ222,VLOOKUP(AQ222,HOM!$AS$389:$AT$444,2))","v":4.4930000000000003}]
["H",null,null,null,null,null,null,null,null,null,null,null,null,null,"",null,null,null,"","","","","",false,{"$f":"IF(AND(H223<1920),VLOOKUP(I223,Feuil2!$F$10:$P$28,11),IF(AND(H223>=1920,H223<1939),VLOOKUP(I223,Feuil2!$F$10:$P$28,11),IF(AND(H223>=1938,H223<1943),VLOOKUP(I223,Feuil2!$F$10:$P$28,10),IF(AND(H223>=1943,H223<1948),VLOOKUP(I223,Feuil2!$F$10:$P$28,9),IF(AND(H223>=1948,H223<1953),VLOOKUP(I223,Feuil2!$F$10:$P$28,8),IF(AND(H223>=1953,H223<1958),VLOOKUP(I223,Feuil2!$F$10:$P$28,7),IF(AND(H223>=1958,H223<1963),VLOOKUP(I223,Feuil2!$F$10:$P$28,6),IF(AND(H223>=1963,H223<1968),VLOOKUP(I223,Feuil2!$F$10:$P$28,5),IF(AND(H223>=1968,H223<1973),VLOOKUP(I223,Feuil2!$F$10:$P$28,4),IF(AND(H223>=1973,H223<1978),VLOOKUP(I223,Feuil2!$F$10:$P$28,3),IF(AND(H223>=1978,H223<1983),VLOOKUP(I223,Feuil2!$F$10:$P$28,2),VLOOKUP(I223,Feuil2!$F$10:$P$28,2))))))))))))","v":{"$error":"#N/A"}},null,{"$f":"T223-HLOOKUP(Y223,Feuil2!$C$1:$CD$9,2,FALSE)","v":{"$error":"#VALUE!"}},{"$f":"T223-HLOOKUP(Y223,Feuil2!$C$1:$CD$9,3,FALSE)","v":{"$error":"#VALUE!"}},{"$f":"T223-HLOOKUP(Y223,Feuil2!$C$1:$CD$9,4,FALSE)","v":{"$error":"#VALUE!"}},{"$f":"T223-HLOOKUP(Y223,Feuil2!$C$1:$CD$9,5,FALSE)","v":{"$error":"#VALUE!"}},{"$f":"T223-HLOOKUP(Y223,Feuil2!$C$1:$CD$9,6,FALSE)","v":{"$error":"#VALUE!"}},{"$f":"T223-HLOOKUP(Y223,Feuil2!$C$1:$CD$9,7,FALSE)","v":{"$error":"#VALUE!"}},{"$f":"T223-HLOOKUP(Y223,Feuil2!$C$1:$CD$9,8,FALSE)","v":{"$error":"#VALUE!"}},{"$f":"T223-HLOOKUP(Y223,Feuil2!$C$1:$CD$9,9,FALSE)","v":{"$error":"#VALUE!"}},null,null,null,null,null,null,null,{"$error":"#VALUE!"},2017,null,{"$f":"IF(AQ223,VLOOKUP(AQ223,HOM!$AS$389:$AT$444,2))","v":4.4930000000000003}]
["H",null,null,null,null,null,null,null,null,null,null,null,null,null,"",null,null,null,"","","","","",false,{"$f":"IF(AND(H224<1920),VLOOKUP(I224,Feuil2!$F$10:$P$28,11),IF(AND(H224>=1920,H224<1939),VLOOKUP(I224,Feuil2!$F$10:$P$28,11),IF(AND(H224>=1938,H224<1943),VLOOKUP(I224,Feuil2!$F$10:$P$28,10),IF(AND(H224>=1943,H224<1948),VLOOKUP(I224,Feuil2!$F$10:$P$28,9),IF(AND(H224>=1948,H224<1953),VLOOKUP(I224,Feuil2!$F$10:$P$28,8),IF(AND(H224>=1953,H224<1958),VLOOKUP(I224,Feuil2!$F$10:$P$28,7),IF(AND(H224>=1958,H224<1963),VLOOKUP(I224,Feuil2!$F$10:$P$28,6),IF(AND(H224>=1963,H224<1968),VLOOKUP(I224,Feuil2!$F$10:$P$28,5),IF(AND(H224>=1968,H224<1973),VLOOKUP(I224,Feuil2!$F$10:$P$28,4),IF(AND(H224>=1973,H224<1978),VLOOKUP(I224,Feuil2!$F$10:$P$28,3),IF(AND(H224>=1978,H224<1983),VLOOKUP(I224,Feuil2!$F$10:$P$28,2),VLOOKUP(I224,Feuil2!$F$10:$P$28,2))))))))))))","v":{"$error":"#N/A"}},null,{"$f":"T224-HLOOKUP(Y224,Feuil2!$C$1:$CD$9,2,FALSE)","v":{"$error":"#VALUE!"}},{"$f":"T224-HLOOKUP(Y224,Feuil2!$C$1:$CD$9,3,FALSE)","v":{"$error":"#VALUE!"}},{"$f":"T224-HLOOKUP(Y224,Feuil2!$C$1:$CD$9,4,FALSE)","v":{"$error":"#VALUE!"}},{"$f":"T224-HLOOKUP(Y224,Feuil2!$C$1:$CD$9,5,FALSE)","v":{"$error":"#VALUE!"}},{"$f":"T224-HLOOKUP(Y224,Feuil2!$C$1:$CD$9,6,FALSE)","v":{"$error":"#VALUE!"}},{"$f":"T224-HLOOKUP(Y224,Feuil2!$C$1:$CD$9,7,FALSE)","v":{"$error":"#VALUE!"}},{"$f":"T224-HLOOKUP(Y224,Feuil2!$C$1:$CD$9,8,FALSE)","v":{"$error":"#VALUE!"}},{"$f":"T224-HLOOKUP(Y224,Feuil2!$C$1:$CD$9,9,FALSE)","v":{"$error":"#VALUE!"}},null,null,null,null,null,null,null,{"$error":"#VALUE!"},2017,null,{"$f":"IF(AQ224,VLOOKUP(AQ224,HOM!$AS$389:$AT$444,2))","v":4.4930000000000003}]
["H",null,null,null,null,null,null,null,null,null,null,null,null,null,"",null,null,null,"","","","","",false,{"$f":"IF(AND(H225<1920),VLOOKUP(I225,Feuil2!$F$10:$P$28,11),IF(AND(H225>=1920,H225<1939),VLOOKUP(I225,Feuil2!$F$10:$P$28,11),IF(AND(H225>=1938,H225<1943),VLOOKUP(I225,Feuil2!$F$10:$P$28,10),IF(AND(H225>=1943,H225<1948),VLOOKUP(I225,Feuil2!$F$10:$P$28,9),IF(AND(H225>=1948,H225<1953),VLOOKUP(I225,Feuil2!$F$10:$P$28,8),IF(AND(H225>=1953,H225<1958),VLOOKUP(I225,Feuil2!$F$10:$P$28,7),IF(AND(H225>=1958,H225<1963),VLOOKUP(I225,Feuil2!$F$10:$P$28,6),IF(AND(H225>=1963,H225<1968),VLOOKUP(I225,Feuil2!$F$10:$P$28,5),IF(AND(H225>=1968,H225<1973),VLOOKUP(I225,Feuil2!$F$10:$P$28,4),IF(AND(H225>=1973,H225<1978),VLOOKUP(I225,Feuil2!$F$10:$P$28,3),IF(AND(H225>=1978,H225<1983),VLOOKUP(I225,Feuil2!$F$10:$P$28,2),VLOOKUP(I225,Feuil2!$F$10:$P$28,2))))))))))))","v":{"$error":"#N/A"}},null,{"$f":"T225-HLOOKUP(Y225,Feuil2!$C$1:$CD$9,2,FALSE)","v":{"$error":"#VALUE!"}},{"$f":"T225-HLOOKUP(Y225,Feuil2!$C$1:$CD$9,3,FALSE)","v":{"$error":"#VALUE!"}},{"$f":"T225-HLOOKUP(Y225,Feuil2!$C$1:$CD$9,4,FALSE)","v":{"$error":"#VALUE!"}},{"$f":"T225-HLOOKUP(Y225,Feuil2!$C$1:$CD$9,5,FALSE)","v":{"$error":"#VALUE!"}},{"$f":"T225-HLOOKUP(Y225,Feuil2!$C$1:$CD$9,6,FALSE)","v":{"$error":"#VALUE!"}},{"$f":"T225-HLOOKUP(Y225,Feuil2!$C$1:$CD$9,7,FALSE)","v":{"$error":"#VALUE!"}},{"$f":"T225-HLOOKUP(Y225,Feuil2!$C$1:$CD$9,8,FALSE)","v":{"$error":"#VALUE!"}},{"$f":"T225-HLOOKUP(Y225,Feuil2!$C$1:$CD$9,9,FALSE)","v":{"$error":"#VALUE!"}},null,null,null,null,null,null,null,{"$error":"#VALUE!"},2017,null,{"$f":"IF(AQ225,VLOOKUP(AQ225,HOM!$AS$389:$AT$444,2))","v":4.4930000000000003}]
["H",null,null,null,null,null,null,null,null,null,null,null,null,null,"",null,null,null,"","","","","",false,{"$f":"IF(AND(H226<1920),VLOOKUP(I226,Feuil2!$F$10:$P$28,11),IF(AND(H226>=1920,H226<1939),VLOOKUP(I226,Feuil2!$F$10:$P$28,11),IF(AND(H226>=1938,H226<1943),VLOOKUP(I226,Feuil2!$F$10:$P$28,10),IF(AND(H226>=1943,H226<1948),VLOOKUP(I226,Feuil2!$F$10:$P$28,9),IF(AND(H226>=1948,H226<1953),VLOOKUP(I226,Feuil2!$F$10:$P$28,8),IF(AND(H226>=1953,H226<1958),VLOOKUP(I226,Feuil2!$F$10:$P$28,7),IF(AND(H226>=1958,H226<1963),VLOOKUP(I226,Feuil2!$F$10:$P$28,6),IF(AND(H226>=1963,H226<1968),VLOOKUP(I226,Feuil2!$F$10:$P$28,5),IF(AND(H226>=1968,H226<1973),VLOOKUP(I226,Feuil2!$F$10:$P$28,4),IF(AND(H226>=1973,H226<1978),VLOOKUP(I226,Feuil2!$F$10:$P$28,3),IF(AND(H226>=1978,H226<1983),VLOOKUP(I226,Feuil2!$F$10:$P$28,2),VLOOKUP(I226,Feuil2!$F$10:$P$28,2))))))))))))","v":{"$error":"#N/A"}},null,{"$f":"T226-HLOOKUP(Y226,Feuil2!$C$1:$CD$9,2,FALSE)","v":{"$error":"#VALUE!"}},{"$f":"T226-HLOOKUP(Y226,Feuil2!$C$1:$CD$9,3,FALSE)","v":{"$error":"#VALUE!"}},{"$f":"T226-HLOOKUP(Y226,Feuil2!$C$1:$CD$9,4,FALSE)","v":{"$error":"#VALUE!"}},{"$f":"T226-HLOOKUP(Y226,Feuil2!$C$1:$CD$9,5,FALSE)","v":{"$error":"#VALUE!"}},{"$f":"T226-HLOOKUP(Y226,Feuil2!$C$1:$CD$9,6,FALSE)","v":{"$error":"#VALUE!"}},{"$f":"T226-HLOOKUP(Y226,Feuil2!$C$1:$CD$9,7,FALSE)","v":{"$error":"#VALUE!"}},{"$f":"T226-HLOOKUP(Y226,Feuil2!$C$1:$CD$9,8,FALSE)","v":{"$error":"#VALUE!"}},{"$f":"T226-HLOOKUP(Y226,Feuil2!$C$1:$CD$9,9,FALSE)","v":{"$error":"#VALUE!"}},null,null,null,null,null,null,null,{"$error":"#VALUE!"},2017,null,{"$f":"IF(AQ226,VLOOKUP(AQ226,HOM!$AS$389:$AT$444,2))","v":4.4930000000000003}]
["H",null,null,null,null,null,null,null,null,null,null,null,null,null,"",null,null,null,"","","","","",false,{"$f":"IF(AND(H227<1920),VLOOKUP(I227,Feuil2!$F$10:$P$28,11),IF(AND(H227>=1920,H227<1939),VLOOKUP(I227,Feuil2!$F$10:$P$28,11),IF(AND(H227>=1938,H227<1943),VLOOKUP(I227,Feuil2!$F$10:$P$28,10),IF(AND(H227>=1943,H227<1948),VLOOKUP(I227,Feuil2!$F$10:$P$28,9),IF(AND(H227>=1948,H227<1953),VLOOKUP(I227,Feuil2!$F$10:$P$28,8),IF(AND(H227>=1953,H227<1958),VLOOKUP(I227,Feuil2!$F$10:$P$28,7),IF(AND(H227>=1958,H227<1963),VLOOKUP(I227,Feuil2!$F$10:$P$28,6),IF(AND(H227>=1963,H227<1968),VLOOKUP(I227,Feuil2!$F$10:$P$28,5),IF(AND(H227>=1968,H227<1973),VLOOKUP(I227,Feuil2!$F$10:$P$28,4),IF(AND(H227>=1973,H227<1978),VLOOKUP(I227,Feuil2!$F$10:$P$28,3),IF(AND(H227>=1978,H227<1983),VLOOKUP(I227,Feuil2!$F$10:$P$28,2),VLOOKUP(I227,Feuil2!$F$10:$P$28,2))))))))))))","v":{"$error":"#N/A"}},null,{"$f":"T227-HLOOKUP(Y227,Feuil2!$C$1:$CD$9,2,FALSE)","v":{"$error":"#VALUE!"}},{"$f":"T227-HLOOKUP(Y227,Feuil2!$C$1:$CD$9,3,FALSE)","v":{"$error":"#VALUE!"}},{"$f":"T227-HLOOKUP(Y227,Feuil2!$C$1:$CD$9,4,FALSE)","v":{"$error":"#VALUE!"}},{"$f":"T227-HLOOKUP(Y227,Feuil2!$C$1:$CD$9,5,FALSE)","v":{"$error":"#VALUE!"}},{"$f":"T227-HLOOKUP(Y227,Feuil2!$C$1:$CD$9,6,FALSE)","v":{"$error":"#VALUE!"}},{"$f":"T227-HLOOKUP(Y227,Feuil2!$C$1:$CD$9,7,FALSE)","v":{"$error":"#VALUE!"}},{"$f":"T227-HLOOKUP(Y227,Feuil2!$C$1:$CD$9,8,FALSE)","v":{"$error":"#VALUE!"}},{"$f":"T227-HLOOKUP(Y227,Feuil2!$C$1:$CD$9,9,FALSE)","v":{"$error":"#VALUE!"}},null,null,null,null,null,null,null,{"$error":"#VALUE!"},2017,null,{"$f":"IF(AQ227,VLOOKUP(AQ227,HOM!$AS$389:$AT$444,2))","v":4.4930000000000003}]
["H",null,null,null,null,null,null,null,null,null,null,null,null,null,"",null,null,null,"","","","","",false,{"$f":"IF(AND(H228<1920),VLOOKUP(I228,Feuil2!$F$10:$P$28,11),IF(AND(H228>=1920,H228<1939),VLOOKUP(I228,Feuil2!$F$10:$P$28,11),IF(AND(H228>=1938,H228<1943),VLOOKUP(I228,Feuil2!$F$10:$P$28,10),IF(AND(H228>=1943,H228<1948),VLOOKUP(I228,Feuil2!$F$10:$P$28,9),IF(AND(H228>=1948,H228<1953),VLOOKUP(I228,Feuil2!$F$10:$P$28,8),IF(AND(H228>=1953,H228<1958),VLOOKUP(I228,Feuil2!$F$10:$P$28,7),IF(AND(H228>=1958,H228<1963),VLOOKUP(I228,Feuil2!$F$10:$P$28,6),IF(AND(H228>=1963,H228<1968),VLOOKUP(I228,Feuil2!$F$10:$P$28,5),IF(AND(H228>=1968,H228<1973),VLOOKUP(I228,Feuil2!$F$10:$P$28,4),IF(AND(H228>=1973,H228<1978),VLOOKUP(I228,Feuil2!$F$10:$P$28,3),IF(AND(H228>=1978,H228<1983),VLOOKUP(I228,Feuil2!$F$10:$P$28,2),VLOOKUP(I228,Feuil2!$F$10:$P$28,2))))))))))))","v":{"$error":"#N/A"}},null,{"$f":"T228-HLOOKUP(Y228,Feuil2!$C$1:$CD$9,2,FALSE)","v":{"$error":"#VALUE!"}},{"$f":"T228-HLOOKUP(Y228,Feuil2!$C$1:$CD$9,3,FALSE)","v":{"$error":"#VALUE!"}},{"$f":"T228-HLOOKUP(Y228,Feuil2!$C$1:$CD$9,4,FALSE)","v":{"$error":"#VALUE!"}},{"$f":"T228-HLOOKUP(Y228,Feuil2!$C$1:$CD$9,5,FALSE)","v":{"$error":"#VALUE!"}},{"$f":"T228-HLOOKUP(Y228,Feuil2!$C$1:$CD$9,6,FALSE)","v":{"$error":"#VALUE!"}},{"$f":"T228-HLOOKUP(Y228,Feuil2!$C$1:$CD$9,7,FALSE)","v":{"$error":"#VALUE!"}},{"$f":"T228-HLOOKUP(Y228,Feuil2!$C$1:$CD$9,8,FALSE)","v":{"$error":"#VALUE!"}},{"$f":"T228-HLOOKUP(Y228,Feuil2!$C$1:$CD$9,9,FALSE)","v":{"$error":"#VALUE!"}},null,null,null,null,null,null,null,{"$error":"#VALUE!"},2017,null,{"$f":"IF(AQ228,VLOOKUP(AQ228,HOM!$AS$389:$AT$444,2))","v":4.4930000000000003}]
["H",null,null,null,null,null,null,null,null,null,null,null,null,null,"",null,null,null,"","","","","",false,{"$f":"IF(AND(H229<1920),VLOOKUP(I229,Feuil2!$F$10:$P$28,11),IF(AND(H229>=1920,H229<1939),VLOOKUP(I229,Feuil2!$F$10:$P$28,11),IF(AND(H229>=1938,H229<1943),VLOOKUP(I229,Feuil2!$F$10:$P$28,10),IF(AND(H229>=1943,H229<1948),VLOOKUP(I229,Feuil2!$F$10:$P$28,9),IF(AND(H229>=1948,H229<1953),VLOOKUP(I229,Feuil2!$F$10:$P$28,8),IF(AND(H229>=1953,H229<1958),VLOOKUP(I229,Feuil2!$F$10:$P$28,7),IF(AND(H229>=1958,H229<1963),VLOOKUP(I229,Feuil2!$F$10:$P$28,6),IF(AND(H229>=1963,H229<1968),VLOOKUP(I229,Feuil2!$F$10:$P$28,5),IF(AND(H229>=1968,H229<1973),VLOOKUP(I229,Feuil2!$F$10:$P$28,4),IF(AND(H229>=1973,H229<1978),VLOOKUP(I229,Feuil2!$F$10:$P$28,3),IF(AND(H229>=1978,H229<1983),VLOOKUP(I229,Feuil2!$F$10:$P$28,2),VLOOKUP(I229,Feuil2!$F$10:$P$28,2))))))))))))","v":{"$error":"#N/A"}},null,{"$f":"T229-HLOOKUP(Y229,Feuil2!$C$1:$CD$9,2,FALSE)","v":{"$error":"#VALUE!"}},{"$f":"T229-HLOOKUP(Y229,Feuil2!$C$1:$CD$9,3,FALSE)","v":{"$error":"#VALUE!"}},{"$f":"T229-HLOOKUP(Y229,Feuil2!$C$1:$CD$9,4,FALSE)","v":{"$error":"#VALUE!"}},{"$f":"T229-HLOOKUP(Y229,Feuil2!$C$1:$CD$9,5,FALSE)","v":{"$error":"#VALUE!"}},{"$f":"T229-HLOOKUP(Y229,Feuil2!$C$1:$CD$9,6,FALSE)","v":{"$error":"#VALUE!"}},{"$f":"T229-HLOOKUP(Y229,Feuil2!$C$1:$CD$9,7,FALSE)","v":{"$error":"#VALUE!"}},{"$f":"T229-HLOOKUP(Y229,Feuil2!$C$1:$CD$9,8,FALSE)","v":{"$error":"#VALUE!"}},{"$f":"T229-HLOOKUP(Y229,Feuil2!$C$1:$CD$9,9,FALSE)","v":{"$error":"#VALUE!"}},null,null,null,null,null,null,null,{"$error":"#VALUE!"},2017,null,{"$f":"IF(AQ229,VLOOKUP(AQ229,HOM!$AS$389:$AT$444,2))","v":4.4930000000000003}]
["H",null,null,null,null,null,null,null,null,null,null,null,null,null,"",null,null,null,"","","","","",false,{"$f":"IF(AND(H230<1920),VLOOKUP(I230,Feuil2!$F$10:$P$28,11),IF(AND(H230>=1920,H230<1939),VLOOKUP(I230,Feuil2!$F$10:$P$28,11),IF(AND(H230>=1938,H230<1943),VLOOKUP(I230,Feuil2!$F$10:$P$28,10),IF(AND(H230>=1943,H230<1948),VLOOKUP(I230,Feuil2!$F$10:$P$28,9),IF(AND(H230>=1948,H230<1953),VLOOKUP(I230,Feuil2!$F$10:$P$28,8),IF(AND(H230>=1953,H230<1958),VLOOKUP(I230,Feuil2!$F$10:$P$28,7),IF(AND(H230>=1958,H230<1963),VLOOKUP(I230,Feuil2!$F$10:$P$28,6),IF(AND(H230>=1963,H230<1968),VLOOKUP(I230,Feuil2!$F$10:$P$28,5),IF(AND(H230>=1968,H230<1973),VLOOKUP(I230,Feuil2!$F$10:$P$28,4),IF(AND(H230>=1973,H230<1978),VLOOKUP(I230,Feuil2!$F$10:$P$28,3),IF(AND(H230>=1978,H230<1983),VLOOKUP(I230,Feuil2!$F$10:$P$28,2),VLOOKUP(I230,Feuil2!$F$10:$P$28,2))))))))))))","v":{"$error":"#N/A"}},null,{"$f":"T230-HLOOKUP(Y230,Feuil2!$C$1:$CD$9,2,FALSE)","v":{"$error":"#VALUE!"}},{"$f":"T230-HLOOKUP(Y230,Feuil2!$C$1:$CD$9,3,FALSE)","v":{"$error":"#VALUE!"}},{"$f":"T230-HLOOKUP(Y230,Feuil2!$C$1:$CD$9,4,FALSE)","v":{"$error":"#VALUE!"}},{"$f":"T230-HLOOKUP(Y230,Feuil2!$C$1:$CD$9,5,FALSE)","v":{"$error":"#VALUE!"}},{"$f":"T230-HLOOKUP(Y230,Feuil2!$C$1:$CD$9,6,FALSE)","v":{"$error":"#VALUE!"}},{"$f":"T230-HLOOKUP(Y230,Feuil2!$C$1:$CD$9,7,FALSE)","v":{"$error":"#VALUE!"}},{"$f":"T230-HLOOKUP(Y230,Feuil2!$C$1:$CD$9,8,FALSE)","v":{"$error":"#VALUE!"}},{"$f":"T230-HLOOKUP(Y230,Feuil2!$C$1:$CD$9,9,FALSE)","v":{"$error":"#VALUE!"}},null,null,null,null,null,null,null,{"$error":"#VALUE!"},2017,null,{"$f":"IF(AQ230,VLOOKUP(AQ230,HOM!$AS$389:$AT$444,2))","v":4.4930000000000003}]
["H",null,null,null,null,null,null,null,null,null,null,null,null,null,"",null,null,null,"","","","","",false,{"$f":"IF(AND(H231<1920),VLOOKUP(I231,Feuil2!$F$10:$P$28,11),IF(AND(H231>=1920,H231<1939),VLOOKUP(I231,Feuil2!$F$10:$P$28,11),IF(AND(H231>=1938,H231<1943),VLOOKUP(I231,Feuil2!$F$10:$P$28,10),IF(AND(H231>=1943,H231<1948),VLOOKUP(I231,Feuil2!$F$10:$P$28,9),IF(AND(H231>=1948,H231<1953),VLOOKUP(I231,Feuil2!$F$10:$P$28,8),IF(AND(H231>=1953,H231<1958),VLOOKUP(I231,Feuil2!$F$10:$P$28,7),IF(AND(H231>=1958,H231<1963),VLOOKUP(I231,Feuil2!$F$10:$P$28,6),IF(AND(H231>=1963,H231<1968),VLOOKUP(I231,Feuil2!$F$10:$P$28,5),IF(AND(H231>=1968,H231<1973),VLOOKUP(I231,Feuil2!$F$10:$P$28,4),IF(AND(H231>=1973,H231<1978),VLOOKUP(I231,Feuil2!$F$10:$P$28,3),IF(AND(H231>=1978,H231<1983),VLOOKUP(I231,Feuil2!$F$10:$P$28,2),VLOOKUP(I231,Feuil2!$F$10:$P$28,2))))))))))))","v":{"$error":"#N/A"}},null,{"$f":"T231-HLOOKUP(Y231,Feuil2!$C$1:$CD$9,2,FALSE)","v":{"$error":"#VALUE!"}},{"$f":"T231-HLOOKUP(Y231,Feuil2!$C$1:$CD$9,3,FALSE)","v":{"$error":"#VALUE!"}},{"$f":"T231-HLOOKUP(Y231,Feuil2!$C$1:$CD$9,4,FALSE)","v":{"$error":"#VALUE!"}},{"$f":"T231-HLOOKUP(Y231,Feuil2!$C$1:$CD$9,5,FALSE)","v":{"$error":"#VALUE!"}},{"$f":"T231-HLOOKUP(Y231,Feuil2!$C$1:$CD$9,6,FALSE)","v":{"$error":"#VALUE!"}},{"$f":"T231-HLOOKUP(Y231,Feuil2!$C$1:$CD$9,7,FALSE)","v":{"$error":"#VALUE!"}},{"$f":"T231-HLOOKUP(Y231,Feuil2!$C$1:$CD$9,8,FALSE)","v":{"$error":"#VALUE!"}},{"$f":"T231-HLOOKUP(Y231,Feuil2!$C$1:$CD$9,9,FALSE)","v":{"$error":"#VALUE!"}},null,null,null,null,null,null,null,{"$error":"#VALUE!"},2017,null,{"$f":"IF(AQ231,VLOOKUP(AQ231,HOM!$AS$389:$AT$444,2))","v":4.4930000000000003}]
["H",null,null,null,null,null,null,null,null,null,null,null,null,null,"",null,null,null,"","","","","",false,{"$f":"IF(AND(H232<1920),VLOOKUP(I232,Feuil2!$F$10:$P$28,11),IF(AND(H232>=1920,H232<1939),VLOOKUP(I232,Feuil2!$F$10:$P$28,11),IF(AND(H232>=1938,H232<1943),VLOOKUP(I232,Feuil2!$F$10:$P$28,10),IF(AND(H232>=1943,H232<1948),VLOOKUP(I232,Feuil2!$F$10:$P$28,9),IF(AND(H232>=1948,H232<1953),VLOOKUP(I232,Feuil2!$F$10:$P$28,8),IF(AND(H232>=1953,H232<1958),VLOOKUP(I232,Feuil2!$F$10:$P$28,7),IF(AND(H232>=1958,H232<1963),VLOOKUP(I232,Feuil2!$F$10:$P$28,6),IF(AND(H232>=1963,H232<1968),VLOOKUP(I232,Feuil2!$F$10:$P$28,5),IF(AND(H232>=1968,H232<1973),VLOOKUP(I232,Feuil2!$F$10:$P$28,4),IF(AND(H232>=1973,H232<1978),VLOOKUP(I232,Feuil2!$F$10:$P$28,3),IF(AND(H232>=1978,H232<1983),VLOOKUP(I232,Feuil2!$F$10:$P$28,2),VLOOKUP(I232,Feuil2!$F$10:$P$28,2))))))))))))","v":{"$error":"#N/A"}},null,{"$f":"T232-HLOOKUP(Y232,Feuil2!$C$1:$CD$9,2,FALSE)","v":{"$error":"#VALUE!"}},{"$f":"T232-HLOOKUP(Y232,Feuil2!$C$1:$CD$9,3,FALSE)","v":{"$error":"#VALUE!"}},{"$f":"T232-HLOOKUP(Y232,Feuil2!$C$1:$CD$9,4,FALSE)","v":{"$error":"#VALUE!"}},{"$f":"T232-HLOOKUP(Y232,Feuil2!$C$1:$CD$9,5,FALSE)","v":{"$error":"#VALUE!"}},{"$f":"T232-HLOOKUP(Y232,Feuil2!$C$1:$CD$9,6,FALSE)","v":{"$error":"#VALUE!"}},{"$f":"T232-HLOOKUP(Y232,Feuil2!$C$1:$CD$9,7,FALSE)","v":{"$error":"#VALUE!"}},{"$f":"T232-HLOOKUP(Y232,Feuil2!$C$1:$CD$9,8,FALSE)","v":{"$error":"#VALUE!"}},{"$f":"T232-HLOOKUP(Y232,Feuil2!$C$1:$CD$9,9,FALSE)","v":{"$error":"#VALUE!"}},null,null,null,null,null,null,null,{"$error":"#VALUE!"},2017,null,{"$f":"IF(AQ232,VLOOKUP(AQ232,HOM!$AS$389:$AT$444,2))","v":4.4930000000000003}]
["H",null,null,null,null,null,null,null,null,null,null,null,null,null,"",null,null,null,"","","","","",false,{"$f":"IF(AND(H233<1920),VLOOKUP(I233,Feuil2!$F$10:$P$28,11),IF(AND(H233>=1920,H233<1939),VLOOKUP(I233,Feuil2!$F$10:$P$28,11),IF(AND(H233>=1938,H233<1943),VLOOKUP(I233,Feuil2!$F$10:$P$28,10),IF(AND(H233>=1943,H233<1948),VLOOKUP(I233,Feuil2!$F$10:$P$28,9),IF(AND(H233>=1948,H233<1953),VLOOKUP(I233,Feuil2!$F$10:$P$28,8),IF(AND(H233>=1953,H233<1958),VLOOKUP(I233,Feuil2!$F$10:$P$28,7),IF(AND(H233>=1958,H233<1963),VLOOKUP(I233,Feuil2!$F$10:$P$28,6),IF(AND(H233>=1963,H233<1968),VLOOKUP(I233,Feuil2!$F$10:$P$28,5),IF(AND(H233>=1968,H233<1973),VLOOKUP(I233,Feuil2!$F$10:$P$28,4),IF(AND(H233>=1973,H233<1978),VLOOKUP(I233,Feuil2!$F$10:$P$28,3),IF(AND(H233>=1978,H233<1983),VLOOKUP(I233,Feuil2!$F$10:$P$28,2),VLOOKUP(I233,Feuil2!$F$10:$P$28,2))))))))))))","v":{"$error":"#N/A"}},null,{"$f":"T233-HLOOKUP(Y233,Feuil2!$C$1:$CD$9,2,FALSE)","v":{"$error":"#VALUE!"}},{"$f":"T233-HLOOKUP(Y233,Feuil2!$C$1:$CD$9,3,FALSE)","v":{"$error":"#VALUE!"}},{"$f":"T233-HLOOKUP(Y233,Feuil2!$C$1:$CD$9,4,FALSE)","v":{"$error":"#VALUE!"}},{"$f":"T233-HLOOKUP(Y233,Feuil2!$C$1:$CD$9,5,FALSE)","v":{"$error":"#VALUE!"}},{"$f":"T233-HLOOKUP(Y233,Feuil2!$C$1:$CD$9,6,FALSE)","v":{"$error":"#VALUE!"}},{"$f":"T233-HLOOKUP(Y233,Feuil2!$C$1:$CD$9,7,FALSE)","v":{"$error":"#VALUE!"}},{"$f":"T233-HLOOKUP(Y233,Feuil2!$C$1:$CD$9,8,FALSE)","v":{"$error":"#VALUE!"}},{"$f":"T233-HLOOKUP(Y233,Feuil2!$C$1:$CD$9,9,FALSE)","v":{"$error":"#VALUE!"}},null,null,null,null,null,null,null,{"$error":"#VALUE!"},2017,null,{"$f":"IF(AQ233,VLOOKUP(AQ233,HOM!$AS$389:$AT$444,2))","v":4.4930000000000003}]
["H",null,null,null,null,null,null,null,null,null,null,null,null,null,"",null,null,null,"","","","","",false,{"$f":"IF(AND(H234<1920),VLOOKUP(I234,Feuil2!$F$10:$P$28,11),IF(AND(H234>=1920,H234<1939),VLOOKUP(I234,Feuil2!$F$10:$P$28,11),IF(AND(H234>=1938,H234<1943),VLOOKUP(I234,Feuil2!$F$10:$P$28,10),IF(AND(H234>=1943,H234<1948),VLOOKUP(I234,Feuil2!$F$10:$P$28,9),IF(AND(H234>=1948,H234<1953),VLOOKUP(I234,Feuil2!$F$10:$P$28,8),IF(AND(H234>=1953,H234<1958),VLOOKUP(I234,Feuil2!$F$10:$P$28,7),IF(AND(H234>=1958,H234<1963),VLOOKUP(I234,Feuil2!$F$10:$P$28,6),IF(AND(H234>=1963,H234<1968),VLOOKUP(I234,Feuil2!$F$10:$P$28,5),IF(AND(H234>=1968,H234<1973),VLOOKUP(I234,Feuil2!$F$10:$P$28,4),IF(AND(H234>=1973,H234<1978),VLOOKUP(I234,Feuil2!$F$10:$P$28,3),IF(AND(H234>=1978,H234<1983),VLOOKUP(I234,Feuil2!$F$10:$P$28,2),VLOOKUP(I234,Feuil2!$F$10:$P$28,2))))))))))))","v":{"$error":"#N/A"}},null,{"$f":"T234-HLOOKUP(Y234,Feuil2!$C$1:$CD$9,2,FALSE)","v":{"$error":"#VALUE!"}},{"$f":"T234-HLOOKUP(Y234,Feuil2!$C$1:$CD$9,3,FALSE)","v":{"$error":"#VALUE!"}},{"$f":"T234-HLOOKUP(Y234,Feuil2!$C$1:$CD$9,4,FALSE)","v":{"$error":"#VALUE!"}},{"$f":"T234-HLOOKUP(Y234,Feuil2!$C$1:$CD$9,5,FALSE)","v":{"$error":"#VALUE!"}},{"$f":"T234-HLOOKUP(Y234,Feuil2!$C$1:$CD$9,6,FALSE)","v":{"$error":"#VALUE!"}},{"$f":"T234-HLOOKUP(Y234,Feuil2!$C$1:$CD$9,7,FALSE)","v":{"$error":"#VALUE!"}},{"$f":"T234-HLOOKUP(Y234,Feuil2!$C$1:$CD$9,8,FALSE)","v":{"$error":"#VALUE!"}},{"$f":"T234-HLOOKUP(Y234,Feuil2!$C$1:$CD$9,9,FALSE)","v":{"$error":"#VALUE!"}},null,null,null,null,null,null,null,{"$error":"#VALUE!"},2017,null,{"$f":"IF(AQ234,VLOOKUP(AQ234,HOM!$AS$389:$AT$444,2))","v":4.4930000000000003}]
["H",null,null,null,null,null,null,null,null,null,null,null,null,null,"",null,null,null,"","","","","",false,{"$f":"IF(AND(H235<1920),VLOOKUP(I235,Feuil2!$F$10:$P$28,11),IF(AND(H235>=1920,H235<1939),VLOOKUP(I235,Feuil2!$F$10:$P$28,11),IF(AND(H235>=1938,H235<1943),VLOOKUP(I235,Feuil2!$F$10:$P$28,10),IF(AND(H235>=1943,H235<1948),VLOOKUP(I235,Feuil2!$F$10:$P$28,9),IF(AND(H235>=1948,H235<1953),VLOOKUP(I235,Feuil2!$F$10:$P$28,8),IF(AND(H235>=1953,H235<1958),VLOOKUP(I235,Feuil2!$F$10:$P$28,7),IF(AND(H235>=1958,H235<1963),VLOOKUP(I235,Feuil2!$F$10:$P$28,6),IF(AND(H235>=1963,H235<1968),VLOOKUP(I235,Feuil2!$F$10:$P$28,5),IF(AND(H235>=1968,H235<1973),VLOOKUP(I235,Feuil2!$F$10:$P$28,4),IF(AND(H235>=1973,H235<1978),VLOOKUP(I235,Feuil2!$F$10:$P$28,3),IF(AND(H235>=1978,H235<1983),VLOOKUP(I235,Feuil2!$F$10:$P$28,2),VLOOKUP(I235,Feuil2!$F$10:$P$28,2))))))))))))","v":{"$error":"#N/A"}},null,{"$f":"T235-HLOOKUP(Y235,Feuil2!$C$1:$CD$9,2,FALSE)","v":{"$error":"#VALUE!"}},{"$f":"T235-HLOOKUP(Y235,Feuil2!$C$1:$CD$9,3,FALSE)","v":{"$error":"#VALUE!"}},{"$f":"T235-HLOOKUP(Y235,Feuil2!$C$1:$CD$9,4,FALSE)","v":{"$error":"#VALUE!"}},{"$f":"T235-HLOOKUP(Y235,Feuil2!$C$1:$CD$9,5,FALSE)","v":{"$error":"#VALUE!"}},{"$f":"T235-HLOOKUP(Y235,Feuil2!$C$1:$CD$9,6,FALSE)","v":{"$error":"#VALUE!"}},{"$f":"T235-HLOOKUP(Y235,Feuil2!$C$1:$CD$9,7,FALSE)","v":{"$error":"#VALUE!"}},{"$f":"T235-HLOOKUP(Y235,Feuil2!$C$1:$CD$9,8,FALSE)","v":{"$error":"#VALUE!"}},{"$f":"T235-HLOOKUP(Y235,Feuil2!$C$1:$CD$9,9,FALSE)","v":{"$error":"#VALUE!"}},null,null,null,null,null,null,null,{"$error":"#VALUE!"},2017,null,{"$f":"IF(AQ235,VLOOKUP(AQ235,HOM!$AS$389:$AT$444,2))","v":4.4930000000000003}]
["H",null,null,null,null,null,null,null,null,null,null,null,null,null,"",null,null,null,"","","","","",false,{"$f":"IF(AND(H236<1920),VLOOKUP(I236,Feuil2!$F$10:$P$28,11),IF(AND(H236>=1920,H236<1939),VLOOKUP(I236,Feuil2!$F$10:$P$28,11),IF(AND(H236>=1938,H236<1943),VLOOKUP(I236,Feuil2!$F$10:$P$28,10),IF(AND(H236>=1943,H236<1948),VLOOKUP(I236,Feuil2!$F$10:$P$28,9),IF(AND(H236>=1948,H236<1953),VLOOKUP(I236,Feuil2!$F$10:$P$28,8),IF(AND(H236>=1953,H236<1958),VLOOKUP(I236,Feuil2!$F$10:$P$28,7),IF(AND(H236>=1958,H236<1963),VLOOKUP(I236,Feuil2!$F$10:$P$28,6),IF(AND(H236>=1963,H236<1968),VLOOKUP(I236,Feuil2!$F$10:$P$28,5),IF(AND(H236>=1968,H236<1973),VLOOKUP(I236,Feuil2!$F$10:$P$28,4),IF(AND(H236>=1973,H236<1978),VLOOKUP(I236,Feuil2!$F$10:$P$28,3),IF(AND(H236>=1978,H236<1983),VLOOKUP(I236,Feuil2!$F$10:$P$28,2),VLOOKUP(I236,Feuil2!$F$10:$P$28,2))))))))))))","v":{"$error":"#N/A"}},null,{"$f":"T236-HLOOKUP(Y236,Feuil2!$C$1:$CD$9,2,FALSE)","v":{"$error":"#VALUE!"}},{"$f":"T236-HLOOKUP(Y236,Feuil2!$C$1:$CD$9,3,FALSE)","v":{"$error":"#VALUE!"}},{"$f":"T236-HLOOKUP(Y236,Feuil2!$C$1:$CD$9,4,FALSE)","v":{"$error":"#VALUE!"}},{"$f":"T236-HLOOKUP(Y236,Feuil2!$C$1:$CD$9,5,FALSE)","v":{"$error":"#VALUE!"}},{"$f":"T236-HLOOKUP(Y236,Feuil2!$C$1:$CD$9,6,FALSE)","v":{"$error":"#VALUE!"}},{"$f":"T236-HLOOKUP(Y236,Feuil2!$C$1:$CD$9,7,FALSE)","v":{"$error":"#VALUE!"}},{"$f":"T236-HLOOKUP(Y236,Feuil2!$C$1:$CD$9,8,FALSE)","v":{"$error":"#VALUE!"}},{"$f":"T236-HLOOKUP(Y236,Feuil2!$C$1:$CD$9,9,FALSE)","v":{"$error":"#VALUE!"}},null,null,null,null,null,null,null,{"$error":"#VALUE!"},2017,null,{"$f":"IF(AQ236,VLOOKUP(AQ236,HOM!$AS$389:$AT$444,2))","v":4.4930000000000003}]
["H",null,null,null,null,null,null,null,null,null,null,null,null,null,"",null,null,null,"","","","","",false,{"$f":"IF(AND(H237<1920),VLOOKUP(I237,Feuil2!$F$10:$P$28,11),IF(AND(H237>=1920,H237<1939),VLOOKUP(I237,Feuil2!$F$10:$P$28,11),IF(AND(H237>=1938,H237<1943),VLOOKUP(I237,Feuil2!$F$10:$P$28,10),IF(AND(H237>=1943,H237<1948),VLOOKUP(I237,Feuil2!$F$10:$P$28,9),IF(AND(H237>=1948,H237<1953),VLOOKUP(I237,Feuil2!$F$10:$P$28,8),IF(AND(H237>=1953,H237<1958),VLOOKUP(I237,Feuil2!$F$10:$P$28,7),IF(AND(H237>=1958,H237<1963),VLOOKUP(I237,Feuil2!$F$10:$P$28,6),IF(AND(H237>=1963,H237<1968),VLOOKUP(I237,Feuil2!$F$10:$P$28,5),IF(AND(H237>=1968,H237<1973),VLOOKUP(I237,Feuil2!$F$10:$P$28,4),IF(AND(H237>=1973,H237<1978),VLOOKUP(I237,Feuil2!$F$10:$P$28,3),IF(AND(H237>=1978,H237<1983),VLOOKUP(I237,Feuil2!$F$10:$P$28,2),VLOOKUP(I237,Feuil2!$F$10:$P$28,2))))))))))))","v":{"$error":"#N/A"}},null,{"$f":"T237-HLOOKUP(Y237,Feuil2!$C$1:$CD$9,2,FALSE)","v":{"$error":"#VALUE!"}},{"$f":"T237-HLOOKUP(Y237,Feuil2!$C$1:$CD$9,3,FALSE)","v":{"$error":"#VALUE!"}},{"$f":"T237-HLOOKUP(Y237,Feuil2!$C$1:$CD$9,4,FALSE)","v":{"$error":"#VALUE!"}},{"$f":"T237-HLOOKUP(Y237,Feuil2!$C$1:$CD$9,5,FALSE)","v":{"$error":"#VALUE!"}},{"$f":"T237-HLOOKUP(Y237,Feuil2!$C$1:$CD$9,6,FALSE)","v":{"$error":"#VALUE!"}},{"$f":"T237-HLOOKUP(Y237,Feuil2!$C$1:$CD$9,7,FALSE)","v":{"$error":"#VALUE!"}},{"$f":"T237-HLOOKUP(Y237,Feuil2!$C$1:$CD$9,8,FALSE)","v":{"$error":"#VALUE!"}},{"$f":"T237-HLOOKUP(Y237,Feuil2!$C$1:$CD$9,9,FALSE)","v":{"$error":"#VALUE!"}},null,null,null,null,null,null,null,{"$error":"#VALUE!"},2017,null,{"$f":"IF(AQ237,VLOOKUP(AQ237,HOM!$AS$389:$AT$444,2))","v":4.4930000000000003}]
["H",null,null,null,null,null,null,null,null,null,null,null,null,null,"",null,null,null,"","","","","",false,{"$f":"IF(AND(H238<1920),VLOOKUP(I238,Feuil2!$F$10:$P$28,11),IF(AND(H238>=1920,H238<1939),VLOOKUP(I238,Feuil2!$F$10:$P$28,11),IF(AND(H238>=1938,H238<1943),VLOOKUP(I238,Feuil2!$F$10:$P$28,10),IF(AND(H238>=1943,H238<1948),VLOOKUP(I238,Feuil2!$F$10:$P$28,9),IF(AND(H238>=1948,H238<1953),VLOOKUP(I238,Feuil2!$F$10:$P$28,8),IF(AND(H238>=1953,H238<1958),VLOOKUP(I238,Feuil2!$F$10:$P$28,7),IF(AND(H238>=1958,H238<1963),VLOOKUP(I238,Feuil2!$F$10:$P$28,6),IF(AND(H238>=1963,H238<1968),VLOOKUP(I238,Feuil2!$F$10:$P$28,5),IF(AND(H238>=1968,H238<1973),VLOOKUP(I238,Feuil2!$F$10:$P$28,4),IF(AND(H238>=1973,H238<1978),VLOOKUP(I238,Feuil2!$F$10:$P$28,3),IF(AND(H238>=1978,H238<1983),VLOOKUP(I238,Feuil2!$F$10:$P$28,2),VLOOKUP(I238,Feuil2!$F$10:$P$28,2))))))))))))","v":{"$error":"#N/A"}},null,{"$f":"T238-HLOOKUP(Y238,Feuil2!$C$1:$CD$9,2,FALSE)","v":{"$error":"#VALUE!"}},{"$f":"T238-HLOOKUP(Y238,Feuil2!$C$1:$CD$9,3,FALSE)","v":{"$error":"#VALUE!"}},{"$f":"T238-HLOOKUP(Y238,Feuil2!$C$1:$CD$9,4,FALSE)","v":{"$error":"#VALUE!"}},{"$f":"T238-HLOOKUP(Y238,Feuil2!$C$1:$CD$9,5,FALSE)","v":{"$error":"#VALUE!"}},{"$f":"T238-HLOOKUP(Y238,Feuil2!$C$1:$CD$9,6,FALSE)","v":{"$error":"#VALUE!"}},{"$f":"T238-HLOOKUP(Y238,Feuil2!$C$1:$CD$9,7,FALSE)","v":{"$error":"#VALUE!"}},{"$f":"T238-HLOOKUP(Y238,Feuil2!$C$1:$CD$9,8,FALSE)","v":{"$error":"#VALUE!"}},{"$f":"T238-HLOOKUP(Y238,Feuil2!$C$1:$CD$9,9,FALSE)","v":{"$error":"#VALUE!"}},null,null,null,null,null,null,null,{"$error":"#VALUE!"},2017,null,{"$f":"IF(AQ238,VLOOKUP(AQ238,HOM!$AS$389:$AT$444,2))","v":4.4930000000000003}]
["H",null,null,null,null,null,null,null,null,null,null,null,null,null,"",null,null,null,"","","","","",false,{"$f":"IF(AND(H239<1920),VLOOKUP(I239,Feuil2!$F$10:$P$28,11),IF(AND(H239>=1920,H239<1939),VLOOKUP(I239,Feuil2!$F$10:$P$28,11),IF(AND(H239>=1938,H239<1943),VLOOKUP(I239,Feuil2!$F$10:$P$28,10),IF(AND(H239>=1943,H239<1948),VLOOKUP(I239,Feuil2!$F$10:$P$28,9),IF(AND(H239>=1948,H239<1953),VLOOKUP(I239,Feuil2!$F$10:$P$28,8),IF(AND(H239>=1953,H239<1958),VLOOKUP(I239,Feuil2!$F$10:$P$28,7),IF(AND(H239>=1958,H239<1963),VLOOKUP(I239,Feuil2!$F$10:$P$28,6),IF(AND(H239>=1963,H239<1968),VLOOKUP(I239,Feuil2!$F$10:$P$28,5),IF(AND(H239>=1968,H239<1973),VLOOKUP(I239,Feuil2!$F$10:$P$28,4),IF(AND(H239>=1973,H239<1978),VLOOKUP(I239,Feuil2!$F$10:$P$28,3),IF(AND(H239>=1978,H239<1983),VLOOKUP(I239,Feuil2!$F$10:$P$28,2),VLOOKUP(I239,Feuil2!$F$10:$P$28,2))))))))))))","v":{"$error":"#N/A"}},null,{"$f":"T239-HLOOKUP(Y239,Feuil2!$C$1:$CD$9,2,FALSE)","v":{"$error":"#VALUE!"}},{"$f":"T239-HLOOKUP(Y239,Feuil2!$C$1:$CD$9,3,FALSE)","v":{"$error":"#VALUE!"}},{"$f":"T239-HLOOKUP(Y239,Feuil2!$C$1:$CD$9,4,FALSE)","v":{"$error":"#VALUE!"}},{"$f":"T239-HLOOKUP(Y239,Feuil2!$C$1:$CD$9,5,FALSE)","v":{"$error":"#VALUE!"}},{"$f":"T239-HLOOKUP(Y239,Feuil2!$C$1:$CD$9,6,FALSE)","v":{"$error":"#VALUE!"}},{"$f":"T239-HLOOKUP(Y239,Feuil2!$C$1:$CD$9,7,FALSE)","v":{"$error":"#VALUE!"}},{"$f":"T239-HLOOKUP(Y239,Feuil2!$C$1:$CD$9,8,FALSE)","v":{"$error":"#VALUE!"}},{"$f":"T239-HLOOKUP(Y239,Feuil2!$C$1:$CD$9,9,FALSE)","v":{"$error":"#VALUE!"}},null,null,null,null,null,null,null,{"$error":"#VALUE!"},2017,null,{"$f":"IF(AQ239,VLOOKUP(AQ239,HOM!$AS$389:$AT$444,2))","v":4.4930000000000003}]
["H",null,null,null,null,null,null,null,null,null,null,null,null,null,"",null,null,null,"","","","","",false,{"$f":"IF(AND(H240<1920),VLOOKUP(I240,Feuil2!$F$10:$P$28,11),IF(AND(H240>=1920,H240<1939),VLOOKUP(I240,Feuil2!$F$10:$P$28,11),IF(AND(H240>=1938,H240<1943),VLOOKUP(I240,Feuil2!$F$10:$P$28,10),IF(AND(H240>=1943,H240<1948),VLOOKUP(I240,Feuil2!$F$10:$P$28,9),IF(AND(H240>=1948,H240<1953),VLOOKUP(I240,Feuil2!$F$10:$P$28,8),IF(AND(H240>=1953,H240<1958),VLOOKUP(I240,Feuil2!$F$10:$P$28,7),IF(AND(H240>=1958,H240<1963),VLOOKUP(I240,Feuil2!$F$10:$P$28,6),IF(AND(H240>=1963,H240<1968),VLOOKUP(I240,Feuil2!$F$10:$P$28,5),IF(AND(H240>=1968,H240<1973),VLOOKUP(I240,Feuil2!$F$10:$P$28,4),IF(AND(H240>=1973,H240<1978),VLOOKUP(I240,Feuil2!$F$10:$P$28,3),IF(AND(H240>=1978,H240<1983),VLOOKUP(I240,Feuil2!$F$10:$P$28,2),VLOOKUP(I240,Feuil2!$F$10:$P$28,2))))))))))))","v":{"$error":"#N/A"}},null,{"$f":"T240-HLOOKUP(Y240,Feuil2!$C$1:$CD$9,2,FALSE)","v":{"$error":"#VALUE!"}},{"$f":"T240-HLOOKUP(Y240,Feuil2!$C$1:$CD$9,3,FALSE)","v":{"$error":"#VALUE!"}},{"$f":"T240-HLOOKUP(Y240,Feuil2!$C$1:$CD$9,4,FALSE)","v":{"$error":"#VALUE!"}},{"$f":"T240-HLOOKUP(Y240,Feuil2!$C$1:$CD$9,5,FALSE)","v":{"$error":"#VALUE!"}},{"$f":"T240-HLOOKUP(Y240,Feuil2!$C$1:$CD$9,6,FALSE)","v":{"$error":"#VALUE!"}},{"$f":"T240-HLOOKUP(Y240,Feuil2!$C$1:$CD$9,7,FALSE)","v":{"$error":"#VALUE!"}},{"$f":"T240-HLOOKUP(Y240,Feuil2!$C$1:$CD$9,8,FALSE)","v":{"$error":"#VALUE!"}},{"$f":"T240-HLOOKUP(Y240,Feuil2!$C$1:$CD$9,9,FALSE)","v":{"$error":"#VALUE!"}},null,null,null,null,null,null,null,{"$error":"#VALUE!"},2017,null,{"$f":"IF(AQ240,VLOOKUP(AQ240,HOM!$AS$389:$AT$444,2))","v":4.4930000000000003}]
["H",null,null,null,null,null,null,null,null,null,null,null,null,null,"",null,null,null,"","","","","",false,{"$f":"IF(AND(H241<1920),VLOOKUP(I241,Feuil2!$F$10:$P$28,11),IF(AND(H241>=1920,H241<1939),VLOOKUP(I241,Feuil2!$F$10:$P$28,11),IF(AND(H241>=1938,H241<1943),VLOOKUP(I241,Feuil2!$F$10:$P$28,10),IF(AND(H241>=1943,H241<1948),VLOOKUP(I241,Feuil2!$F$10:$P$28,9),IF(AND(H241>=1948,H241<1953),VLOOKUP(I241,Feuil2!$F$10:$P$28,8),IF(AND(H241>=1953,H241<1958),VLOOKUP(I241,Feuil2!$F$10:$P$28,7),IF(AND(H241>=1958,H241<1963),VLOOKUP(I241,Feuil2!$F$10:$P$28,6),IF(AND(H241>=1963,H241<1968),VLOOKUP(I241,Feuil2!$F$10:$P$28,5),IF(AND(H241>=1968,H241<1973),VLOOKUP(I241,Feuil2!$F$10:$P$28,4),IF(AND(H241>=1973,H241<1978),VLOOKUP(I241,Feuil2!$F$10:$P$28,3),IF(AND(H241>=1978,H241<1983),VLOOKUP(I241,Feuil2!$F$10:$P$28,2),VLOOKUP(I241,Feuil2!$F$10:$P$28,2))))))))))))","v":{"$error":"#N/A"}},null,{"$f":"T241-HLOOKUP(Y241,Feuil2!$C$1:$CD$9,2,FALSE)","v":{"$error":"#VALUE!"}},{"$f":"T241-HLOOKUP(Y241,Feuil2!$C$1:$CD$9,3,FALSE)","v":{"$error":"#VALUE!"}},{"$f":"T241-HLOOKUP(Y241,Feuil2!$C$1:$CD$9,4,FALSE)","v":{"$error":"#VALUE!"}},{"$f":"T241-HLOOKUP(Y241,Feuil2!$C$1:$CD$9,5,FALSE)","v":{"$error":"#VALUE!"}},{"$f":"T241-HLOOKUP(Y241,Feuil2!$C$1:$CD$9,6,FALSE)","v":{"$error":"#VALUE!"}},{"$f":"T241-HLOOKUP(Y241,Feuil2!$C$1:$CD$9,7,FALSE)","v":{"$error":"#VALUE!"}},{"$f":"T241-HLOOKUP(Y241,Feuil2!$C$1:$CD$9,8,FALSE)","v":{"$error":"#VALUE!"}},{"$f":"T241-HLOOKUP(Y241,Feuil2!$C$1:$CD$9,9,FALSE)","v":{"$error":"#VALUE!"}},null,null,null,null,null,null,null,{"$error":"#VALUE!"},2017,null,{"$f":"IF(AQ241,VLOOKUP(AQ241,HOM!$AS$389:$AT$444,2))","v":4.4930000000000003}]
["H",null,null,null,null,null,null,null,null,null,null,null,null,null,"",null,null,null,"","","","","",false,{"$f":"IF(AND(H242<1920),VLOOKUP(I242,Feuil2!$F$10:$P$28,11),IF(AND(H242>=1920,H242<1939),VLOOKUP(I242,Feuil2!$F$10:$P$28,11),IF(AND(H242>=1938,H242<1943),VLOOKUP(I242,Feuil2!$F$10:$P$28,10),IF(AND(H242>=1943,H242<1948),VLOOKUP(I242,Feuil2!$F$10:$P$28,9),IF(AND(H242>=1948,H242<1953),VLOOKUP(I242,Feuil2!$F$10:$P$28,8),IF(AND(H242>=1953,H242<1958),VLOOKUP(I242,Feuil2!$F$10:$P$28,7),IF(AND(H242>=1958,H242<1963),VLOOKUP(I242,Feuil2!$F$10:$P$28,6),IF(AND(H242>=1963,H242<1968),VLOOKUP(I242,Feuil2!$F$10:$P$28,5),IF(AND(H242>=1968,H242<1973),VLOOKUP(I242,Feuil2!$F$10:$P$28,4),IF(AND(H242>=1973,H242<1978),VLOOKUP(I242,Feuil2!$F$10:$P$28,3),IF(AND(H242>=1978,H242<1983),VLOOKUP(I242,Feuil2!$F$10:$P$28,2),VLOOKUP(I242,Feuil2!$F$10:$P$28,2))))))))))))","v":{"$error":"#N/A"}},null,{"$f":"T242-HLOOKUP(Y242,Feuil2!$C$1:$CD$9,2,FALSE)","v":{"$error":"#VALUE!"}},{"$f":"T242-HLOOKUP(Y242,Feuil2!$C$1:$CD$9,3,FALSE)","v":{"$error":"#VALUE!"}},{"$f":"T242-HLOOKUP(Y242,Feuil2!$C$1:$CD$9,4,FALSE)","v":{"$error":"#VALUE!"}},{"$f":"T242-HLOOKUP(Y242,Feuil2!$C$1:$CD$9,5,FALSE)","v":{"$error":"#VALUE!"}},{"$f":"T242-HLOOKUP(Y242,Feuil2!$C$1:$CD$9,6,FALSE)","v":{"$error":"#VALUE!"}},{"$f":"T242-HLOOKUP(Y242,Feuil2!$C$1:$CD$9,7,FALSE)","v":{"$error":"#VALUE!"}},{"$f":"T242-HLOOKUP(Y242,Feuil2!$C$1:$CD$9,8,FALSE)","v":{"$error":"#VALUE!"}},{"$f":"T242-HLOOKUP(Y242,Feuil2!$C$1:$CD$9,9,FALSE)","v":{"$error":"#VALUE!"}},null,null,null,null,null,null,null,{"$error":"#VALUE!"},2017,null,{"$f":"IF(AQ242,VLOOKUP(AQ242,HOM!$AS$389:$AT$444,2))","v":4.4930000000000003}]
["H",null,null,null,null,null,null,null,null,null,null,null,null,null,"",null,null,null,"","","","","",false,{"$f":"IF(AND(H243<1920),VLOOKUP(I243,Feuil2!$F$10:$P$28,11),IF(AND(H243>=1920,H243<1939),VLOOKUP(I243,Feuil2!$F$10:$P$28,11),IF(AND(H243>=1938,H243<1943),VLOOKUP(I243,Feuil2!$F$10:$P$28,10),IF(AND(H243>=1943,H243<1948),VLOOKUP(I243,Feuil2!$F$10:$P$28,9),IF(AND(H243>=1948,H243<1953),VLOOKUP(I243,Feuil2!$F$10:$P$28,8),IF(AND(H243>=1953,H243<1958),VLOOKUP(I243,Feuil2!$F$10:$P$28,7),IF(AND(H243>=1958,H243<1963),VLOOKUP(I243,Feuil2!$F$10:$P$28,6),IF(AND(H243>=1963,H243<1968),VLOOKUP(I243,Feuil2!$F$10:$P$28,5),IF(AND(H243>=1968,H243<1973),VLOOKUP(I243,Feuil2!$F$10:$P$28,4),IF(AND(H243>=1973,H243<1978),VLOOKUP(I243,Feuil2!$F$10:$P$28,3),IF(AND(H243>=1978,H243<1983),VLOOKUP(I243,Feuil2!$F$10:$P$28,2),VLOOKUP(I243,Feuil2!$F$10:$P$28,2))))))))))))","v":{"$error":"#N/A"}},null,{"$f":"T243-HLOOKUP(Y243,Feuil2!$C$1:$CD$9,2,FALSE)","v":{"$error":"#VALUE!"}},{"$f":"T243-HLOOKUP(Y243,Feuil2!$C$1:$CD$9,3,FALSE)","v":{"$error":"#VALUE!"}},{"$f":"T243-HLOOKUP(Y243,Feuil2!$C$1:$CD$9,4,FALSE)","v":{"$error":"#VALUE!"}},{"$f":"T243-HLOOKUP(Y243,Feuil2!$C$1:$CD$9,5,FALSE)","v":{"$error":"#VALUE!"}},{"$f":"T243-HLOOKUP(Y243,Feuil2!$C$1:$CD$9,6,FALSE)","v":{"$error":"#VALUE!"}},{"$f":"T243-HLOOKUP(Y243,Feuil2!$C$1:$CD$9,7,FALSE)","v":{"$error":"#VALUE!"}},{"$f":"T243-HLOOKUP(Y243,Feuil2!$C$1:$CD$9,8,FALSE)","v":{"$error":"#VALUE!"}},{"$f":"T243-HLOOKUP(Y243,Feuil2!$C$1:$CD$9,9,FALSE)","v":{"$error":"#VALUE!"}},null,null,null,null,null,null,null,{"$error":"#VALUE!"},2017,null,{"$f":"IF(AQ243,VLOOKUP(AQ243,HOM!$AS$389:$AT$444,2))","v":4.4930000000000003}]
["H",null,null,null,null,null,null,null,null,null,null,null,null,null,"",null,null,null,"","","","","",false,{"$f":"IF(AND(H244<1920),VLOOKUP(I244,Feuil2!$F$10:$P$28,11),IF(AND(H244>=1920,H244<1939),VLOOKUP(I244,Feuil2!$F$10:$P$28,11),IF(AND(H244>=1938,H244<1943),VLOOKUP(I244,Feuil2!$F$10:$P$28,10),IF(AND(H244>=1943,H244<1948),VLOOKUP(I244,Feuil2!$F$10:$P$28,9),IF(AND(H244>=1948,H244<1953),VLOOKUP(I244,Feuil2!$F$10:$P$28,8),IF(AND(H244>=1953,H244<1958),VLOOKUP(I244,Feuil2!$F$10:$P$28,7),IF(AND(H244>=1958,H244<1963),VLOOKUP(I244,Feuil2!$F$10:$P$28,6),IF(AND(H244>=1963,H244<1968),VLOOKUP(I244,Feuil2!$F$10:$P$28,5),IF(AND(H244>=1968,H244<1973),VLOOKUP(I244,Feuil2!$F$10:$P$28,4),IF(AND(H244>=1973,H244<1978),VLOOKUP(I244,Feuil2!$F$10:$P$28,3),IF(AND(H244>=1978,H244<1983),VLOOKUP(I244,Feuil2!$F$10:$P$28,2),VLOOKUP(I244,Feuil2!$F$10:$P$28,2))))))))))))","v":{"$error":"#N/A"}},null,{"$f":"T244-HLOOKUP(Y244,Feuil2!$C$1:$CD$9,2,FALSE)","v":{"$error":"#VALUE!"}},{"$f":"T244-HLOOKUP(Y244,Feuil2!$C$1:$CD$9,3,FALSE)","v":{"$error":"#VALUE!"}},{"$f":"T244-HLOOKUP(Y244,Feuil2!$C$1:$CD$9,4,FALSE)","v":{"$error":"#VALUE!"}},{"$f":"T244-HLOOKUP(Y244,Feuil2!$C$1:$CD$9,5,FALSE)","v":{"$error":"#VALUE!"}},{"$f":"T244-HLOOKUP(Y244,Feuil2!$C$1:$CD$9,6,FALSE)","v":{"$error":"#VALUE!"}},{"$f":"T244-HLOOKUP(Y244,Feuil2!$C$1:$CD$9,7,FALSE)","v":{"$error":"#VALUE!"}},{"$f":"T244-HLOOKUP(Y244,Feuil2!$C$1:$CD$9,8,FALSE)","v":{"$error":"#VALUE!"}},{"$f":"T244-HLOOKUP(Y244,Feuil2!$C$1:$CD$9,9,FALSE)","v":{"$error":"#VALUE!"}},null,null,null,null,null,null,null,{"$error":"#VALUE!"},2017,null,{"$f":"IF(AQ244,VLOOKUP(AQ244,HOM!$AS$389:$AT$444,2))","v":4.4930000000000003}]
["H",null,null,null,null,null,null,null,null,null,null,null,null,null,"",null,null,null,"","","","","",false,{"$f":"IF(AND(H245<1920),VLOOKUP(I245,Feuil2!$F$10:$P$28,11),IF(AND(H245>=1920,H245<1939),VLOOKUP(I245,Feuil2!$F$10:$P$28,11),IF(AND(H245>=1938,H245<1943),VLOOKUP(I245,Feuil2!$F$10:$P$28,10),IF(AND(H245>=1943,H245<1948),VLOOKUP(I245,Feuil2!$F$10:$P$28,9),IF(AND(H245>=1948,H245<1953),VLOOKUP(I245,Feuil2!$F$10:$P$28,8),IF(AND(H245>=1953,H245<1958),VLOOKUP(I245,Feuil2!$F$10:$P$28,7),IF(AND(H245>=1958,H245<1963),VLOOKUP(I245,Feuil2!$F$10:$P$28,6),IF(AND(H245>=1963,H245<1968),VLOOKUP(I245,Feuil2!$F$10:$P$28,5),IF(AND(H245>=1968,H245<1973),VLOOKUP(I245,Feuil2!$F$10:$P$28,4),IF(AND(H245>=1973,H245<1978),VLOOKUP(I245,Feuil2!$F$10:$P$28,3),IF(AND(H245>=1978,H245<1983),VLOOKUP(I245,Feuil2!$F$10:$P$28,2),VLOOKUP(I245,Feuil2!$F$10:$P$28,2))))))))))))","v":{"$error":"#N/A"}},null,{"$f":"T245-HLOOKUP(Y245,Feuil2!$C$1:$CD$9,2,FALSE)","v":{"$error":"#VALUE!"}},{"$f":"T245-HLOOKUP(Y245,Feuil2!$C$1:$CD$9,3,FALSE)","v":{"$error":"#VALUE!"}},{"$f":"T245-HLOOKUP(Y245,Feuil2!$C$1:$CD$9,4,FALSE)","v":{"$error":"#VALUE!"}},{"$f":"T245-HLOOKUP(Y245,Feuil2!$C$1:$CD$9,5,FALSE)","v":{"$error":"#VALUE!"}},{"$f":"T245-HLOOKUP(Y245,Feuil2!$C$1:$CD$9,6,FALSE)","v":{"$error":"#VALUE!"}},{"$f":"T245-HLOOKUP(Y245,Feuil2!$C$1:$CD$9,7,FALSE)","v":{"$error":"#VALUE!"}},{"$f":"T245-HLOOKUP(Y245,Feuil2!$C$1:$CD$9,8,FALSE)","v":{"$error":"#VALUE!"}},{"$f":"T245-HLOOKUP(Y245,Feuil2!$C$1:$CD$9,9,FALSE)","v":{"$error":"#VALUE!"}},null,null,null,null,null,null,null,{"$error":"#VALUE!"},2017,null,{"$f":"IF(AQ245,VLOOKUP(AQ245,HOM!$AS$389:$AT$444,2))","v":4.4930000000000003}]
["H",null,null,null,null,null,null,null,null,null,null,null,null,null,"",null,null,null,"","","","","",false,{"$f":"IF(AND(H246<1920),VLOOKUP(I246,Feuil2!$F$10:$P$28,11),IF(AND(H246>=1920,H246<1939),VLOOKUP(I246,Feuil2!$F$10:$P$28,11),IF(AND(H246>=1938,H246<1943),VLOOKUP(I246,Feuil2!$F$10:$P$28,10),IF(AND(H246>=1943,H246<1948),VLOOKUP(I246,Feuil2!$F$10:$P$28,9),IF(AND(H246>=1948,H246<1953),VLOOKUP(I246,Feuil2!$F$10:$P$28,8),IF(AND(H246>=1953,H246<1958),VLOOKUP(I246,Feuil2!$F$10:$P$28,7),IF(AND(H246>=1958,H246<1963),VLOOKUP(I246,Feuil2!$F$10:$P$28,6),IF(AND(H246>=1963,H246<1968),VLOOKUP(I246,Feuil2!$F$10:$P$28,5),IF(AND(H246>=1968,H246<1973),VLOOKUP(I246,Feuil2!$F$10:$P$28,4),IF(AND(H246>=1973,H246<1978),VLOOKUP(I246,Feuil2!$F$10:$P$28,3),IF(AND(H246>=1978,H246<1983),VLOOKUP(I246,Feuil2!$F$10:$P$28,2),VLOOKUP(I246,Feuil2!$F$10:$P$28,2))))))))))))","v":{"$error":"#N/A"}},null,{"$f":"T246-HLOOKUP(Y246,Feuil2!$C$1:$CD$9,2,FALSE)","v":{"$error":"#VALUE!"}},{"$f":"T246-HLOOKUP(Y246,Feuil2!$C$1:$CD$9,3,FALSE)","v":{"$error":"#VALUE!"}},{"$f":"T246-HLOOKUP(Y246,Feuil2!$C$1:$CD$9,4,FALSE)","v":{"$error":"#VALUE!"}},{"$f":"T246-HLOOKUP(Y246,Feuil2!$C$1:$CD$9,5,FALSE)","v":{"$error":"#VALUE!"}},{"$f":"T246-HLOOKUP(Y246,Feuil2!$C$1:$CD$9,6,FALSE)","v":{"$error":"#VALUE!"}},{"$f":"T246-HLOOKUP(Y246,Feuil2!$C$1:$CD$9,7,FALSE)","v":{"$error":"#VALUE!"}},{"$f":"T246-HLOOKUP(Y246,Feuil2!$C$1:$CD$9,8,FALSE)","v":{"$error":"#VALUE!"}},{"$f":"T246-HLOOKUP(Y246,Feuil2!$C$1:$CD$9,9,FALSE)","v":{"$error":"#VALUE!"}},null,null,null,null,null,null,null,{"$error":"#VALUE!"},2017,null,{"$f":"IF(AQ246,VLOOKUP(AQ246,HOM!$AS$389:$AT$444,2))","v":4.4930000000000003}]
["H",null,null,null,null,null,null,null,null,null,null,null,null,null,"",null,null,null,"","","","","",false,{"$f":"IF(AND(H247<1920),VLOOKUP(I247,Feuil2!$F$10:$P$28,11),IF(AND(H247>=1920,H247<1939),VLOOKUP(I247,Feuil2!$F$10:$P$28,11),IF(AND(H247>=1938,H247<1943),VLOOKUP(I247,Feuil2!$F$10:$P$28,10),IF(AND(H247>=1943,H247<1948),VLOOKUP(I247,Feuil2!$F$10:$P$28,9),IF(AND(H247>=1948,H247<1953),VLOOKUP(I247,Feuil2!$F$10:$P$28,8),IF(AND(H247>=1953,H247<1958),VLOOKUP(I247,Feuil2!$F$10:$P$28,7),IF(AND(H247>=1958,H247<1963),VLOOKUP(I247,Feuil2!$F$10:$P$28,6),IF(AND(H247>=1963,H247<1968),VLOOKUP(I247,Feuil2!$F$10:$P$28,5),IF(AND(H247>=1968,H247<1973),VLOOKUP(I247,Feuil2!$F$10:$P$28,4),IF(AND(H247>=1973,H247<1978),VLOOKUP(I247,Feuil2!$F$10:$P$28,3),IF(AND(H247>=1978,H247<1983),VLOOKUP(I247,Feuil2!$F$10:$P$28,2),VLOOKUP(I247,Feuil2!$F$10:$P$28,2))))))))))))","v":{"$error":"#N/A"}},null,{"$f":"T247-HLOOKUP(Y247,Feuil2!$C$1:$CD$9,2,FALSE)","v":{"$error":"#VALUE!"}},{"$f":"T247-HLOOKUP(Y247,Feuil2!$C$1:$CD$9,3,FALSE)","v":{"$error":"#VALUE!"}},{"$f":"T247-HLOOKUP(Y247,Feuil2!$C$1:$CD$9,4,FALSE)","v":{"$error":"#VALUE!"}},{"$f":"T247-HLOOKUP(Y247,Feuil2!$C$1:$CD$9,5,FALSE)","v":{"$error":"#VALUE!"}},{"$f":"T247-HLOOKUP(Y247,Feuil2!$C$1:$CD$9,6,FALSE)","v":{"$error":"#VALUE!"}},{"$f":"T247-HLOOKUP(Y247,Feuil2!$C$1:$CD$9,7,FALSE)","v":{"$error":"#VALUE!"}},{"$f":"T247-HLOOKUP(Y247,Feuil2!$C$1:$CD$9,8,FALSE)","v":{"$error":"#VALUE!"}},{"$f":"T247-HLOOKUP(Y247,Feuil2!$C$1:$CD$9,9,FALSE)","v":{"$error":"#VALUE!"}},null,null,null,null,null,null,null,{"$error":"#VALUE!"},2017,null,{"$f":"IF(AQ247,VLOOKUP(AQ247,HOM!$AS$389:$AT$444,2))","v":4.4930000000000003}]
["H",null,null,null,null,null,null,null,null,null,null,null,null,null,"",null,null,null,"","","","","",false,{"$f":"IF(AND(H248<1920),VLOOKUP(I248,Feuil2!$F$10:$P$28,11),IF(AND(H248>=1920,H248<1939),VLOOKUP(I248,Feuil2!$F$10:$P$28,11),IF(AND(H248>=1938,H248<1943),VLOOKUP(I248,Feuil2!$F$10:$P$28,10),IF(AND(H248>=1943,H248<1948),VLOOKUP(I248,Feuil2!$F$10:$P$28,9),IF(AND(H248>=1948,H248<1953),VLOOKUP(I248,Feuil2!$F$10:$P$28,8),IF(AND(H248>=1953,H248<1958),VLOOKUP(I248,Feuil2!$F$10:$P$28,7),IF(AND(H248>=1958,H248<1963),VLOOKUP(I248,Feuil2!$F$10:$P$28,6),IF(AND(H248>=1963,H248<1968),VLOOKUP(I248,Feuil2!$F$10:$P$28,5),IF(AND(H248>=1968,H248<1973),VLOOKUP(I248,Feuil2!$F$10:$P$28,4),IF(AND(H248>=1973,H248<1978),VLOOKUP(I248,Feuil2!$F$10:$P$28,3),IF(AND(H248>=1978,H248<1983),VLOOKUP(I248,Feuil2!$F$10:$P$28,2),VLOOKUP(I248,Feuil2!$F$10:$P$28,2))))))))))))","v":{"$error":"#N/A"}},null,{"$f":"T248-HLOOKUP(Y248,Feuil2!$C$1:$CD$9,2,FALSE)","v":{"$error":"#VALUE!"}},{"$f":"T248-HLOOKUP(Y248,Feuil2!$C$1:$CD$9,3,FALSE)","v":{"$error":"#VALUE!"}},{"$f":"T248-HLOOKUP(Y248,Feuil2!$C$1:$CD$9,4,FALSE)","v":{"$error":"#VALUE!"}},{"$f":"T248-HLOOKUP(Y248,Feuil2!$C$1:$CD$9,5,FALSE)","v":{"$error":"#VALUE!"}},{"$f":"T248-HLOOKUP(Y248,Feuil2!$C$1:$CD$9,6,FALSE)","v":{"$error":"#VALUE!"}},{"$f":"T248-HLOOKUP(Y248,Feuil2!$C$1:$CD$9,7,FALSE)","v":{"$error":"#VALUE!"}},{"$f":"T248-HLOOKUP(Y248,Feuil2!$C$1:$CD$9,8,FALSE)","v":{"$error":"#VALUE!"}},{"$f":"T248-HLOOKUP(Y248,Feuil2!$C$1:$CD$9,9,FALSE)","v":{"$error":"#VALUE!"}},null,null,null,null,null,null,null,{"$error":"#VALUE!"},2017,null,{"$f":"IF(AQ248,VLOOKUP(AQ248,HOM!$AS$389:$AT$444,2))","v":4.4930000000000003}]
["H",null,null,null,null,null,null,null,null,null,null,null,null,null,"",null,null,null,"","","","","",false,{"$f":"IF(AND(H249<1920),VLOOKUP(I249,Feuil2!$F$10:$P$28,11),IF(AND(H249>=1920,H249<1939),VLOOKUP(I249,Feuil2!$F$10:$P$28,11),IF(AND(H249>=1938,H249<1943),VLOOKUP(I249,Feuil2!$F$10:$P$28,10),IF(AND(H249>=1943,H249<1948),VLOOKUP(I249,Feuil2!$F$10:$P$28,9),IF(AND(H249>=1948,H249<1953),VLOOKUP(I249,Feuil2!$F$10:$P$28,8),IF(AND(H249>=1953,H249<1958),VLOOKUP(I249,Feuil2!$F$10:$P$28,7),IF(AND(H249>=1958,H249<1963),VLOOKUP(I249,Feuil2!$F$10:$P$28,6),IF(AND(H249>=1963,H249<1968),VLOOKUP(I249,Feuil2!$F$10:$P$28,5),IF(AND(H249>=1968,H249<1973),VLOOKUP(I249,Feuil2!$F$10:$P$28,4),IF(AND(H249>=1973,H249<1978),VLOOKUP(I249,Feuil2!$F$10:$P$28,3),IF(AND(H249>=1978,H249<1983),VLOOKUP(I249,Feuil2!$F$10:$P$28,2),VLOOKUP(I249,Feuil2!$F$10:$P$28,2))))))))))))","v":{"$error":"#N/A"}},null,{"$f":"T249-HLOOKUP(Y249,Feuil2!$C$1:$CD$9,2,FALSE)","v":{"$error":"#VALUE!"}},{"$f":"T249-HLOOKUP(Y249,Feuil2!$C$1:$CD$9,3,FALSE)","v":{"$error":"#VALUE!"}},{"$f":"T249-HLOOKUP(Y249,Feuil2!$C$1:$CD$9,4,FALSE)","v":{"$error":"#VALUE!"}},{"$f":"T249-HLOOKUP(Y249,Feuil2!$C$1:$CD$9,5,FALSE)","v":{"$error":"#VALUE!"}},{"$f":"T249-HLOOKUP(Y249,Feuil2!$C$1:$CD$9,6,FALSE)","v":{"$error":"#VALUE!"}},{"$f":"T249-HLOOKUP(Y249,Feuil2!$C$1:$CD$9,7,FALSE)","v":{"$error":"#VALUE!"}},{"$f":"T249-HLOOKUP(Y249,Feuil2!$C$1:$CD$9,8,FALSE)","v":{"$error":"#VALUE!"}},{"$f":"T249-HLOOKUP(Y249,Feuil2!$C$1:$CD$9,9,FALSE)","v":{"$error":"#VALUE!"}},null,null,null,null,null,null,null,{"$error":"#VALUE!"},2017,null,{"$f":"IF(AQ249,VLOOKUP(AQ249,HOM!$AS$389:$AT$444,2))","v":4.4930000000000003}]
["H",null,null,null,null,null,null,null,null,null,null,null,null,null,"",null,null,null,"","","","","",false,{"$f":"IF(AND(H250<1920),VLOOKUP(I250,Feuil2!$F$10:$P$28,11),IF(AND(H250>=1920,H250<1939),VLOOKUP(I250,Feuil2!$F$10:$P$28,11),IF(AND(H250>=1938,H250<1943),VLOOKUP(I250,Feuil2!$F$10:$P$28,10),IF(AND(H250>=1943,H250<1948),VLOOKUP(I250,Feuil2!$F$10:$P$28,9),IF(AND(H250>=1948,H250<1953),VLOOKUP(I250,Feuil2!$F$10:$P$28,8),IF(AND(H250>=1953,H250<1958),VLOOKUP(I250,Feuil2!$F$10:$P$28,7),IF(AND(H250>=1958,H250<1963),VLOOKUP(I250,Feuil2!$F$10:$P$28,6),IF(AND(H250>=1963,H250<1968),VLOOKUP(I250,Feuil2!$F$10:$P$28,5),IF(AND(H250>=1968,H250<1973),VLOOKUP(I250,Feuil2!$F$10:$P$28,4),IF(AND(H250>=1973,H250<1978),VLOOKUP(I250,Feuil2!$F$10:$P$28,3),IF(AND(H250>=1978,H250<1983),VLOOKUP(I250,Feuil2!$F$10:$P$28,2),VLOOKUP(I250,Feuil2!$F$10:$P$28,2))))))))))))","v":{"$error":"#N/A"}},null,{"$f":"T250-HLOOKUP(Y250,Feuil2!$C$1:$CD$9,2,FALSE)","v":{"$error":"#VALUE!"}},{"$f":"T250-HLOOKUP(Y250,Feuil2!$C$1:$CD$9,3,FALSE)","v":{"$error":"#VALUE!"}},{"$f":"T250-HLOOKUP(Y250,Feuil2!$C$1:$CD$9,4,FALSE)","v":{"$error":"#VALUE!"}},{"$f":"T250-HLOOKUP(Y250,Feuil2!$C$1:$CD$9,5,FALSE)","v":{"$error":"#VALUE!"}},{"$f":"T250-HLOOKUP(Y250,Feuil2!$C$1:$CD$9,6,FALSE)","v":{"$error":"#VALUE!"}},{"$f":"T250-HLOOKUP(Y250,Feuil2!$C$1:$CD$9,7,FALSE)","v":{"$error":"#VALUE!"}},{"$f":"T250-HLOOKUP(Y250,Feuil2!$C$1:$CD$9,8,FALSE)","v":{"$error":"#VALUE!"}},{"$f":"T250-HLOOKUP(Y250,Feuil2!$C$1:$CD$9,9,FALSE)","v":{"$error":"#VALUE!"}},null,null,null,null,null,null,null,{"$error":"#VALUE!"},2017,null,{"$f":"IF(AQ250,VLOOKUP(AQ250,HOM!$AS$389:$AT$444,2))","v":4.4930000000000003}]
["H",null,null,null,null,null,null,null,null,null,null,null,null,null,"",null,null,null,"","","","","",false,{"$f":"IF(AND(H251<1920),VLOOKUP(I251,Feuil2!$F$10:$P$28,11),IF(AND(H251>=1920,H251<1939),VLOOKUP(I251,Feuil2!$F$10:$P$28,11),IF(AND(H251>=1938,H251<1943),VLOOKUP(I251,Feuil2!$F$10:$P$28,10),IF(AND(H251>=1943,H251<1948),VLOOKUP(I251,Feuil2!$F$10:$P$28,9),IF(AND(H251>=1948,H251<1953),VLOOKUP(I251,Feuil2!$F$10:$P$28,8),IF(AND(H251>=1953,H251<1958),VLOOKUP(I251,Feuil2!$F$10:$P$28,7),IF(AND(H251>=1958,H251<1963),VLOOKUP(I251,Feuil2!$F$10:$P$28,6),IF(AND(H251>=1963,H251<1968),VLOOKUP(I251,Feuil2!$F$10:$P$28,5),IF(AND(H251>=1968,H251<1973),VLOOKUP(I251,Feuil2!$F$10:$P$28,4),IF(AND(H251>=1973,H251<1978),VLOOKUP(I251,Feuil2!$F$10:$P$28,3),IF(AND(H251>=1978,H251<1983),VLOOKUP(I251,Feuil2!$F$10:$P$28,2),VLOOKUP(I251,Feuil2!$F$10:$P$28,2))))))))))))","v":{"$error":"#N/A"}},null,{"$f":"T251-HLOOKUP(Y251,Feuil2!$C$1:$CD$9,2,FALSE)","v":{"$error":"#VALUE!"}},{"$f":"T251-HLOOKUP(Y251,Feuil2!$C$1:$CD$9,3,FALSE)","v":{"$error":"#VALUE!"}},{"$f":"T251-HLOOKUP(Y251,Feuil2!$C$1:$CD$9,4,FALSE)","v":{"$error":"#VALUE!"}},{"$f":"T251-HLOOKUP(Y251,Feuil2!$C$1:$CD$9,5,FALSE)","v":{"$error":"#VALUE!"}},{"$f":"T251-HLOOKUP(Y251,Feuil2!$C$1:$CD$9,6,FALSE)","v":{"$error":"#VALUE!"}},{"$f":"T251-HLOOKUP(Y251,Feuil2!$C$1:$CD$9,7,FALSE)","v":{"$error":"#VALUE!"}},{"$f":"T251-HLOOKUP(Y251,Feuil2!$C$1:$CD$9,8,FALSE)","v":{"$error":"#VALUE!"}},{"$f":"T251-HLOOKUP(Y251,Feuil2!$C$1:$CD$9,9,FALSE)","v":{"$error":"#VALUE!"}},null,null,null,null,null,null,null,{"$error":"#VALUE!"},2017,null,{"$f":"IF(AQ251,VLOOKUP(AQ251,HOM!$AS$389:$AT$444,2))","v":4.4930000000000003}]
["H",null,null,null,null,null,null,null,null,null,null,null,null,null,"",null,null,null,"","","","","",false,{"$f":"IF(AND(H252<1920),VLOOKUP(I252,Feuil2!$F$10:$P$28,11),IF(AND(H252>=1920,H252<1939),VLOOKUP(I252,Feuil2!$F$10:$P$28,11),IF(AND(H252>=1938,H252<1943),VLOOKUP(I252,Feuil2!$F$10:$P$28,10),IF(AND(H252>=1943,H252<1948),VLOOKUP(I252,Feuil2!$F$10:$P$28,9),IF(AND(H252>=1948,H252<1953),VLOOKUP(I252,Feuil2!$F$10:$P$28,8),IF(AND(H252>=1953,H252<1958),VLOOKUP(I252,Feuil2!$F$10:$P$28,7),IF(AND(H252>=1958,H252<1963),VLOOKUP(I252,Feuil2!$F$10:$P$28,6),IF(AND(H252>=1963,H252<1968),VLOOKUP(I252,Feuil2!$F$10:$P$28,5),IF(AND(H252>=1968,H252<1973),VLOOKUP(I252,Feuil2!$F$10:$P$28,4),IF(AND(H252>=1973,H252<1978),VLOOKUP(I252,Feuil2!$F$10:$P$28,3),IF(AND(H252>=1978,H252<1983),VLOOKUP(I252,Feuil2!$F$10:$P$28,2),VLOOKUP(I252,Feuil2!$F$10:$P$28,2))))))))))))","v":{"$error":"#N/A"}},null,{"$f":"T252-HLOOKUP(Y252,Feuil2!$C$1:$CD$9,2,FALSE)","v":{"$error":"#VALUE!"}},{"$f":"T252-HLOOKUP(Y252,Feuil2!$C$1:$CD$9,3,FALSE)","v":{"$error":"#VALUE!"}},{"$f":"T252-HLOOKUP(Y252,Feuil2!$C$1:$CD$9,4,FALSE)","v":{"$error":"#VALUE!"}},{"$f":"T252-HLOOKUP(Y252,Feuil2!$C$1:$CD$9,5,FALSE)","v":{"$error":"#VALUE!"}},{"$f":"T252-HLOOKUP(Y252,Feuil2!$C$1:$CD$9,6,FALSE)","v":{"$error":"#VALUE!"}},{"$f":"T252-HLOOKUP(Y252,Feuil2!$C$1:$CD$9,7,FALSE)","v":{"$error":"#VALUE!"}},{"$f":"T252-HLOOKUP(Y252,Feuil2!$C$1:$CD$9,8,FALSE)","v":{"$error":"#VALUE!"}},{"$f":"T252-HLOOKUP(Y252,Feuil2!$C$1:$CD$9,9,FALSE)","v":{"$error":"#VALUE!"}},null,null,null,null,null,null,null,{"$error":"#VALUE!"},2017,null,{"$f":"IF(AQ252,VLOOKUP(AQ252,HOM!$AS$389:$AT$444,2))","v":4.4930000000000003}]
["H",null,null,null,null,null,null,null,null,null,null,null,null,null,"",null,null,null,"","","","","",false,{"$f":"IF(AND(H253<1920),VLOOKUP(I253,Feuil2!$F$10:$P$28,11),IF(AND(H253>=1920,H253<1939),VLOOKUP(I253,Feuil2!$F$10:$P$28,11),IF(AND(H253>=1938,H253<1943),VLOOKUP(I253,Feuil2!$F$10:$P$28,10),IF(AND(H253>=1943,H253<1948),VLOOKUP(I253,Feuil2!$F$10:$P$28,9),IF(AND(H253>=1948,H253<1953),VLOOKUP(I253,Feuil2!$F$10:$P$28,8),IF(AND(H253>=1953,H253<1958),VLOOKUP(I253,Feuil2!$F$10:$P$28,7),IF(AND(H253>=1958,H253<1963),VLOOKUP(I253,Feuil2!$F$10:$P$28,6),IF(AND(H253>=1963,H253<1968),VLOOKUP(I253,Feuil2!$F$10:$P$28,5),IF(AND(H253>=1968,H253<1973),VLOOKUP(I253,Feuil2!$F$10:$P$28,4),IF(AND(H253>=1973,H253<1978),VLOOKUP(I253,Feuil2!$F$10:$P$28,3),IF(AND(H253>=1978,H253<1983),VLOOKUP(I253,Feuil2!$F$10:$P$28,2),VLOOKUP(I253,Feuil2!$F$10:$P$28,2))))))))))))","v":{"$error":"#N/A"}},null,{"$f":"T253-HLOOKUP(Y253,Feuil2!$C$1:$CD$9,2,FALSE)","v":{"$error":"#VALUE!"}},{"$f":"T253-HLOOKUP(Y253,Feuil2!$C$1:$CD$9,3,FALSE)","v":{"$error":"#VALUE!"}},{"$f":"T253-HLOOKUP(Y253,Feuil2!$C$1:$CD$9,4,FALSE)","v":{"$error":"#VALUE!"}},{"$f":"T253-HLOOKUP(Y253,Feuil2!$C$1:$CD$9,5,FALSE)","v":{"$error":"#VALUE!"}},{"$f":"T253-HLOOKUP(Y253,Feuil2!$C$1:$CD$9,6,FALSE)","v":{"$error":"#VALUE!"}},{"$f":"T253-HLOOKUP(Y253,Feuil2!$C$1:$CD$9,7,FALSE)","v":{"$error":"#VALUE!"}},{"$f":"T253-HLOOKUP(Y253,Feuil2!$C$1:$CD$9,8,FALSE)","v":{"$error":"#VALUE!"}},{"$f":"T253-HLOOKUP(Y253,Feuil2!$C$1:$CD$9,9,FALSE)","v":{"$error":"#VALUE!"}},null,null,null,null,null,null,null,{"$error":"#VALUE!"},2017,null,{"$f":"IF(AQ253,VLOOKUP(AQ253,HOM!$AS$389:$AT$444,2))","v":4.4930000000000003}]
["H",null,null,null,null,null,null,null,null,null,null,null,null,null,"",null,null,null,null,null,null,null,null,false,{"$f":"IF(AND(H254<1920),VLOOKUP(I254,Feuil2!$F$10:$P$28,11),IF(AND(H254>=1920,H254<1939),VLOOKUP(I254,Feuil2!$F$10:$P$28,11),IF(AND(H254>=1938,H254<1943),VLOOKUP(I254,Feuil2!$F$10:$P$28,10),IF(AND(H254>=1943,H254<1948),VLOOKUP(I254,Feuil2!$F$10:$P$28,9),IF(AND(H254>=1948,H254<1953),VLOOKUP(I254,Feuil2!$F$10:$P$28,8),IF(AND(H254>=1953,H254<1958),VLOOKUP(I254,Feuil2!$F$10:$P$28,7),IF(AND(H254>=1958,H254<1963),VLOOKUP(I254,Feuil2!$F$10:$P$28,6),IF(AND(H254>=1963,H254<1968),VLOOKUP(I254,Feuil2!$F$10:$P$28,5),IF(AND(H254>=1968,H254<1973),VLOOKUP(I254,Feuil2!$F$10:$P$28,4),IF(AND(H254>=1973,H254<1978),VLOOKUP(I254,Feuil2!$F$10:$P$28,3),IF(AND(H254>=1978,H254<1983),VLOOKUP(I254,Feuil2!$F$10:$P$28,2),VLOOKUP(I254,Feuil2!$F$10:$P$28,2))))))))))))","v":{"$error":"#N/A"}},null,{"$f":"T254-HLOOKUP(Y254,Feuil2!$C$1:$CD$9,2,FALSE)","v":{"$error":"#N/A"}},{"$f":"T254-HLOOKUP(Y254,Feuil2!$C$1:$CD$9,3,FALSE)","v":{"$error":"#N/A"}},{"$f":"T254-HLOOKUP(Y254,Feuil2!$C$1:$CD$9,4,FALSE)","v":{"$error":"#N/A"}},{"$f":"T254-HLOOKUP(Y254,Feuil2!$C$1:$CD$9,5,FALSE)","v":{"$error":"#N/A"}},{"$f":"T254-HLOOKUP(Y254,Feuil2!$C$1:$CD$9,6,FALSE)","v":{"$error":"#N/A"}},{"$f":"T254-HLOOKUP(Y254,Feuil2!$C$1:$CD$9,7,FALSE)","v":{"$error":"#N/A"}},{"$f":"T254-HLOOKUP(Y254,Feuil2!$C$1:$CD$9,8,FALSE)","v":{"$error":"#N/A"}},{"$f":"T254-HLOOKUP(Y254,Feuil2!$C$1:$CD$9,9,FALSE)","v":{"$error":"#N/A"}},null,null,null,null,null,null,null,{"$error":"#N/A"},2017,null,{"$f":"IF(AQ254,VLOOKUP(AQ254,HOM!$AS$389:$AT$444,2))","v":4.4930000000000003}]
["H",null,null,null,null,null,null,null,null,null,null,null,null,null,null,null,null,null,null,null,null,null,null,false,{"$f":"IF(AND(H255<1920),VLOOKUP(I255,Feuil2!$F$10:$P$28,11),IF(AND(H255>=1920,H255<1939),VLOOKUP(I255,Feuil2!$F$10:$P$28,11),IF(AND(H255>=1938,H255<1943),VLOOKUP(I255,Feuil2!$F$10:$P$28,10),IF(AND(H255>=1943,H255<1948),VLOOKUP(I255,Feuil2!$F$10:$P$28,9),IF(AND(H255>=1948,H255<1953),VLOOKUP(I255,Feuil2!$F$10:$P$28,8),IF(AND(H255>=1953,H255<1958),VLOOKUP(I255,Feuil2!$F$10:$P$28,7),IF(AND(H255>=1958,H255<1963),VLOOKUP(I255,Feuil2!$F$10:$P$28,6),IF(AND(H255>=1963,H255<1968),VLOOKUP(I255,Feuil2!$F$10:$P$28,5),IF(AND(H255>=1968,H255<1973),VLOOKUP(I255,Feuil2!$F$10:$P$28,4),IF(AND(H255>=1973,H255<1978),VLOOKUP(I255,Feuil2!$F$10:$P$28,3),IF(AND(H255>=1978,H255<1983),VLOOKUP(I255,Feuil2!$F$10:$P$28,2),VLOOKUP(I255,Feuil2!$F$10:$P$28,2))))))))))))","v":{"$error":"#N/A"}},null,{"$f":"T255-HLOOKUP(Y255,Feuil2!$C$1:$CD$9,2,FALSE)","v":{"$error":"#N/A"}},{"$f":"T255-HLOOKUP(Y255,Feuil2!$C$1:$CD$9,3,FALSE)","v":{"$error":"#N/A"}},{"$f":"T255-HLOOKUP(Y255,Feuil2!$C$1:$CD$9,4,FALSE)","v":{"$error":"#N/A"}},{"$f":"T255-HLOOKUP(Y255,Feuil2!$C$1:$CD$9,5,FALSE)","v":{"$error":"#N/A"}},{"$f":"T255-HLOOKUP(Y255,Feuil2!$C$1:$CD$9,6,FALSE)","v":{"$error":"#N/A"}},{"$f":"T255-HLOOKUP(Y255,Feuil2!$C$1:$CD$9,7,FALSE)","v":{"$error":"#N/A"}},{"$f":"T255-HLOOKUP(Y255,Feuil2!$C$1:$CD$9,8,FALSE)","v":{"$error":"#N/A"}},{"$f":"T255-HLOOKUP(Y255,Feuil2!$C$1:$CD$9,9,FALSE)","v":{"$error":"#N/A"}},null,null,null,null,null,null,null,{"$error":"#N/A"},2017,null,{"$f":"IF(AQ255,VLOOKUP(AQ255,HOM!$AS$389:$AT$444,2))","v":4.4930000000000003}]
["H",null,null,null,null,null,null,null,null,null,null,null,null,null,{"$f":"IF(H256=\"\",\"\",IF(MAXA(L256:N256)<=0,0,MAXA(L256:N256)))","v":""},null,null,null,{"$f":"IF(I256=\"\",\"\",IF(MAXA(P256:R256)<=0,0,MAXA(P256:R256)))","v":""},{"$f":"IF(I256=\"\",\"\",IF(OR(O256=0,S256=0),0,O256+S256))","v":""},{"$f":"IF(I256=\"\",\"\",IF(A256=\"H\",10^(0.794358141*LOG(I256/174.393)^2)*T256*AS256,IF(A256=\"F\",10^(0.89726074 * LOG(I256/148.026)^2)*T256*AS256,\"\")))","v":""},{"$f":"IF(I256=\"\",\"\",AP256)","v":""},{"$f":"IF(I256=\"\",\"\",IF(AH256>=0,AH256,IF(AG256>=0,AG256,IF(AF256>=0,AF256,IF(AE256>=0,AE256,IF(AD256>=0,AD256,IF(AC256>=0,AC256,IF(AB256>=0,AB256,AA256))))))))","v":""},false,{"$f":"IF(AND(H256<1920),VLOOKUP(I256,Feuil2!$F$10:$P$28,11),IF(AND(H256>=1920,H256<1939),VLOOKUP(I256,Feuil2!$F$10:$P$28,11),IF(AND(H256>=1938,H256<1943),VLOOKUP(I256,Feuil2!$F$10:$P$28,10),IF(AND(H256>=1943,H256<1948),VLOOKUP(I256,Feuil2!$F$10:$P$28,9),IF(AND(H256>=1948,H256<1953),VLOOKUP(I256,Feuil2!$F$10:$P$28,8),IF(AND(H256>=1953,H256<1958),VLOOKUP(I256,Feuil2!$F$10:$P$28,7),IF(AND(H256>=1958,H256<1963),VLOOKUP(I256,Feuil2!$F$10:$P$28,6),IF(AND(H256>=1963,H256<1968),VLOOKUP(I256,Feuil2!$F$10:$P$28,5),IF(AND(H256>=1968,H256<1973),VLOOKUP(I256,Feuil2!$F$10:$P$28,4),IF(AND(H256>=1973,H256<1978),VLOOKUP(I256,Feuil2!$F$10:$P$28,3),IF(AND(H256>=1978,H256<1983),VLOOKUP(I256,Feuil2!$F$10:$P$28,2),VLOOKUP(I256,Feuil2!$F$10:$P$28,2))))))))))))","v":{"$error":"#N/A"}},null,{"$f":"T256-HLOOKUP(Y256,Feuil2!$C$1:$CD$9,2,FALSE)","v":{"$error":"#VALUE!"}},{"$f":"T256-HLOOKUP(Y256,Feuil2!$C$1:$CD$9,3,FALSE)","v":{"$error":"#VALUE!"}},{"$f":"T256-HLOOKUP(Y256,Feuil2!$C$1:$CD$9,4,FALSE)","v":{"$error":"#VALUE!"}},{"$f":"T256-HLOOKUP(Y256,Feuil2!$C$1:$CD$9,5,FALSE)","v":{"$error":"#VALUE!"}},{"$f":"T256-HLOOKUP(Y256,Feuil2!$C$1:$CD$9,6,FALSE)","v":{"$error":"#VALUE!"}},{"$f":"T256-HLOOKUP(Y256,Feuil2!$C$1:$CD$9,7,FALSE)","v":{"$error":"#VALUE!"}},{"$f":"T256-HLOOKUP(Y256,Feuil2!$C$1:$CD$9,8,FALSE)","v":{"$error":"#VALUE!"}},{"$f":"T256-HLOOKUP(Y256,Feuil2!$C$1:$CD$9,9,FALSE)","v":{"$error":"#VALUE!"}},null,null,null,null,null,null,null,{"$error":"#VALUE!"},2017,null,{"$f":"IF(AQ256,VLOOKUP(AQ256,HOM!$AS$389:$AT$444,2))","v":4.4930000000000003}]
["H",null,null,null,null,null,null,null,null,null,null,null,null,null,"",null,null,null,"","","","","",false,{"$f":"IF(AND(H257<1920),VLOOKUP(I257,Feuil2!$F$10:$P$28,11),IF(AND(H257>=1920,H257<1939),VLOOKUP(I257,Feuil2!$F$10:$P$28,11),IF(AND(H257>=1938,H257<1943),VLOOKUP(I257,Feuil2!$F$10:$P$28,10),IF(AND(H257>=1943,H257<1948),VLOOKUP(I257,Feuil2!$F$10:$P$28,9),IF(AND(H257>=1948,H257<1953),VLOOKUP(I257,Feuil2!$F$10:$P$28,8),IF(AND(H257>=1953,H257<1958),VLOOKUP(I257,Feuil2!$F$10:$P$28,7),IF(AND(H257>=1958,H257<1963),VLOOKUP(I257,Feuil2!$F$10:$P$28,6),IF(AND(H257>=1963,H257<1968),VLOOKUP(I257,Feuil2!$F$10:$P$28,5),IF(AND(H257>=1968,H257<1973),VLOOKUP(I257,Feuil2!$F$10:$P$28,4),IF(AND(H257>=1973,H257<1978),VLOOKUP(I257,Feuil2!$F$10:$P$28,3),IF(AND(H257>=1978,H257<1983),VLOOKUP(I257,Feuil2!$F$10:$P$28,2),VLOOKUP(I257,Feuil2!$F$10:$P$28,2))))))))))))","v":{"$error":"#N/A"}},null,{"$f":"T257-HLOOKUP(Y257,Feuil2!$C$1:$CD$9,2,FALSE)","v":{"$error":"#VALUE!"}},{"$f":"T257-HLOOKUP(Y257,Feuil2!$C$1:$CD$9,3,FALSE)","v":{"$error":"#VALUE!"}},{"$f":"T257-HLOOKUP(Y257,Feuil2!$C$1:$CD$9,4,FALSE)","v":{"$error":"#VALUE!"}},{"$f":"T257-HLOOKUP(Y257,Feuil2!$C$1:$CD$9,5,FALSE)","v":{"$error":"#VALUE!"}},{"$f":"T257-HLOOKUP(Y257,Feuil2!$C$1:$CD$9,6,FALSE)","v":{"$error":"#VALUE!"}},{"$f":"T257-HLOOKUP(Y257,Feuil2!$C$1:$CD$9,7,FALSE)","v":{"$error":"#VALUE!"}},{"$f":"T257-HLOOKUP(Y257,Feuil2!$C$1:$CD$9,8,FALSE)","v":{"$error":"#VALUE!"}},{"$f":"T257-HLOOKUP(Y257,Feuil2!$C$1:$CD$9,9,FALSE)","v":{"$error":"#VALUE!"}},null,null,null,null,null,null,null,{"$error":"#VALUE!"},2017,null,{"$f":"IF(AQ257,VLOOKUP(AQ257,HOM!$AS$389:$AT$444,2))","v":4.4930000000000003}]
["H",null,null,null,null,null,null,null,null,null,null,null,null,null,"",null,null,null,"","","","","",false,{"$f":"IF(AND(H258<1920),VLOOKUP(I258,Feuil2!$F$10:$P$28,11),IF(AND(H258>=1920,H258<1939),VLOOKUP(I258,Feuil2!$F$10:$P$28,11),IF(AND(H258>=1938,H258<1943),VLOOKUP(I258,Feuil2!$F$10:$P$28,10),IF(AND(H258>=1943,H258<1948),VLOOKUP(I258,Feuil2!$F$10:$P$28,9),IF(AND(H258>=1948,H258<1953),VLOOKUP(I258,Feuil2!$F$10:$P$28,8),IF(AND(H258>=1953,H258<1958),VLOOKUP(I258,Feuil2!$F$10:$P$28,7),IF(AND(H258>=1958,H258<1963),VLOOKUP(I258,Feuil2!$F$10:$P$28,6),IF(AND(H258>=1963,H258<1968),VLOOKUP(I258,Feuil2!$F$10:$P$28,5),IF(AND(H258>=1968,H258<1973),VLOOKUP(I258,Feuil2!$F$10:$P$28,4),IF(AND(H258>=1973,H258<1978),VLOOKUP(I258,Feuil2!$F$10:$P$28,3),IF(AND(H258>=1978,H258<1983),VLOOKUP(I258,Feuil2!$F$10:$P$28,2),VLOOKUP(I258,Feuil2!$F$10:$P$28,2))))))))))))","v":{"$error":"#N/A"}},null,{"$f":"T258-HLOOKUP(Y258,Feuil2!$C$1:$CD$9,2,FALSE)","v":{"$error":"#VALUE!"}},{"$f":"T258-HLOOKUP(Y258,Feuil2!$C$1:$CD$9,3,FALSE)","v":{"$error":"#VALUE!"}},{"$f":"T258-HLOOKUP(Y258,Feuil2!$C$1:$CD$9,4,FALSE)","v":{"$error":"#VALUE!"}},{"$f":"T258-HLOOKUP(Y258,Feuil2!$C$1:$CD$9,5,FALSE)","v":{"$error":"#VALUE!"}},{"$f":"T258-HLOOKUP(Y258,Feuil2!$C$1:$CD$9,6,FALSE)","v":{"$error":"#VALUE!"}},{"$f":"T258-HLOOKUP(Y258,Feuil2!$C$1:$CD$9,7,FALSE)","v":{"$error":"#VALUE!"}},{"$f":"T258-HLOOKUP(Y258,Feuil2!$C$1:$CD$9,8,FALSE)","v":{"$error":"#VALUE!"}},{"$f":"T258-HLOOKUP(Y258,Feuil2!$C$1:$CD$9,9,FALSE)","v":{"$error":"#VALUE!"}},null,null,null,null,null,null,null,{"$error":"#VALUE!"},2017,null,{"$f":"IF(AQ258,VLOOKUP(AQ258,HOM!$AS$389:$AT$444,2))","v":4.4930000000000003}]
["H",null,null,null,null,null,null,null,null,null,null,null,null,null,"",null,null,null,"","","","","",false,{"$f":"IF(AND(H259<1920),VLOOKUP(I259,Feuil2!$F$10:$P$28,11),IF(AND(H259>=1920,H259<1939),VLOOKUP(I259,Feuil2!$F$10:$P$28,11),IF(AND(H259>=1938,H259<1943),VLOOKUP(I259,Feuil2!$F$10:$P$28,10),IF(AND(H259>=1943,H259<1948),VLOOKUP(I259,Feuil2!$F$10:$P$28,9),IF(AND(H259>=1948,H259<1953),VLOOKUP(I259,Feuil2!$F$10:$P$28,8),IF(AND(H259>=1953,H259<1958),VLOOKUP(I259,Feuil2!$F$10:$P$28,7),IF(AND(H259>=1958,H259<1963),VLOOKUP(I259,Feuil2!$F$10:$P$28,6),IF(AND(H259>=1963,H259<1968),VLOOKUP(I259,Feuil2!$F$10:$P$28,5),IF(AND(H259>=1968,H259<1973),VLOOKUP(I259,Feuil2!$F$10:$P$28,4),IF(AND(H259>=1973,H259<1978),VLOOKUP(I259,Feuil2!$F$10:$P$28,3),IF(AND(H259>=1978,H259<1983),VLOOKUP(I259,Feuil2!$F$10:$P$28,2),VLOOKUP(I259,Feuil2!$F$10:$P$28,2))))))))))))","v":{"$error":"#N/A"}},null,{"$f":"T259-HLOOKUP(Y259,Feuil2!$C$1:$CD$9,2,FALSE)","v":{"$error":"#VALUE!"}},{"$f":"T259-HLOOKUP(Y259,Feuil2!$C$1:$CD$9,3,FALSE)","v":{"$error":"#VALUE!"}},{"$f":"T259-HLOOKUP(Y259,Feuil2!$C$1:$CD$9,4,FALSE)","v":{"$error":"#VALUE!"}},{"$f":"T259-HLOOKUP(Y259,Feuil2!$C$1:$CD$9,5,FALSE)","v":{"$error":"#VALUE!"}},{"$f":"T259-HLOOKUP(Y259,Feuil2!$C$1:$CD$9,6,FALSE)","v":{"$error":"#VALUE!"}},{"$f":"T259-HLOOKUP(Y259,Feuil2!$C$1:$CD$9,7,FALSE)","v":{"$error":"#VALUE!"}},{"$f":"T259-HLOOKUP(Y259,Feuil2!$C$1:$CD$9,8,FALSE)","v":{"$error":"#VALUE!"}},{"$f":"T259-HLOOKUP(Y259,Feuil2!$C$1:$CD$9,9,FALSE)","v":{"$error":"#VALUE!"}},null,null,null,null,null,null,null,{"$error":"#VALUE!"},2017,null,{"$f":"IF(AQ259,VLOOKUP(AQ259,HOM!$AS$389:$AT$444,2))","v":4.4930000000000003}]
["H",null,null,null,null,null,null,null,null,null,null,null,null,null,"",null,null,null,"","","","","",false,{"$f":"IF(AND(H260<1920),VLOOKUP(I260,Feuil2!$F$10:$P$28,11),IF(AND(H260>=1920,H260<1939),VLOOKUP(I260,Feuil2!$F$10:$P$28,11),IF(AND(H260>=1938,H260<1943),VLOOKUP(I260,Feuil2!$F$10:$P$28,10),IF(AND(H260>=1943,H260<1948),VLOOKUP(I260,Feuil2!$F$10:$P$28,9),IF(AND(H260>=1948,H260<1953),VLOOKUP(I260,Feuil2!$F$10:$P$28,8),IF(AND(H260>=1953,H260<1958),VLOOKUP(I260,Feuil2!$F$10:$P$28,7),IF(AND(H260>=1958,H260<1963),VLOOKUP(I260,Feuil2!$F$10:$P$28,6),IF(AND(H260>=1963,H260<1968),VLOOKUP(I260,Feuil2!$F$10:$P$28,5),IF(AND(H260>=1968,H260<1973),VLOOKUP(I260,Feuil2!$F$10:$P$28,4),IF(AND(H260>=1973,H260<1978),VLOOKUP(I260,Feuil2!$F$10:$P$28,3),IF(AND(H260>=1978,H260<1983),VLOOKUP(I260,Feuil2!$F$10:$P$28,2),VLOOKUP(I260,Feuil2!$F$10:$P$28,2))))))))))))","v":{"$error":"#N/A"}},null,{"$f":"T260-HLOOKUP(Y260,Feuil2!$C$1:$CD$9,2,FALSE)","v":{"$error":"#VALUE!"}},{"$f":"T260-HLOOKUP(Y260,Feuil2!$C$1:$CD$9,3,FALSE)","v":{"$error":"#VALUE!"}},{"$f":"T260-HLOOKUP(Y260,Feuil2!$C$1:$CD$9,4,FALSE)","v":{"$error":"#VALUE!"}},{"$f":"T260-HLOOKUP(Y260,Feuil2!$C$1:$CD$9,5,FALSE)","v":{"$error":"#VALUE!"}},{"$f":"T260-HLOOKUP(Y260,Feuil2!$C$1:$CD$9,6,FALSE)","v":{"$error":"#VALUE!"}},{"$f":"T260-HLOOKUP(Y260,Feuil2!$C$1:$CD$9,7,FALSE)","v":{"$error":"#VALUE!"}},{"$f":"T260-HLOOKUP(Y260,Feuil2!$C$1:$CD$9,8,FALSE)","v":{"$error":"#VALUE!"}},{"$f":"T260-HLOOKUP(Y260,Feuil2!$C$1:$CD$9,9,FALSE)","v":{"$error":"#VALUE!"}},null,null,null,null,null,null,null,{"$error":"#VALUE!"},2017,null,{"$f":"IF(AQ260,VLOOKUP(AQ260,HOM!$AS$389:$AT$444,2))","v":4.4930000000000003}]
["H",null,null,null,null,null,null,null,null,null,null,null,null,null,"",null,null,null,"","","","","",false,{"$f":"IF(AND(H261<1920),VLOOKUP(I261,Feuil2!$F$10:$P$28,11),IF(AND(H261>=1920,H261<1939),VLOOKUP(I261,Feuil2!$F$10:$P$28,11),IF(AND(H261>=1938,H261<1943),VLOOKUP(I261,Feuil2!$F$10:$P$28,10),IF(AND(H261>=1943,H261<1948),VLOOKUP(I261,Feuil2!$F$10:$P$28,9),IF(AND(H261>=1948,H261<1953),VLOOKUP(I261,Feuil2!$F$10:$P$28,8),IF(AND(H261>=1953,H261<1958),VLOOKUP(I261,Feuil2!$F$10:$P$28,7),IF(AND(H261>=1958,H261<1963),VLOOKUP(I261,Feuil2!$F$10:$P$28,6),IF(AND(H261>=1963,H261<1968),VLOOKUP(I261,Feuil2!$F$10:$P$28,5),IF(AND(H261>=1968,H261<1973),VLOOKUP(I261,Feuil2!$F$10:$P$28,4),IF(AND(H261>=1973,H261<1978),VLOOKUP(I261,Feuil2!$F$10:$P$28,3),IF(AND(H261>=1978,H261<1983),VLOOKUP(I261,Feuil2!$F$10:$P$28,2),VLOOKUP(I261,Feuil2!$F$10:$P$28,2))))))))))))","v":{"$error":"#N/A"}},null,{"$f":"T261-HLOOKUP(Y261,Feuil2!$C$1:$CD$9,2,FALSE)","v":{"$error":"#VALUE!"}},{"$f":"T261-HLOOKUP(Y261,Feuil2!$C$1:$CD$9,3,FALSE)","v":{"$error":"#VALUE!"}},{"$f":"T261-HLOOKUP(Y261,Feuil2!$C$1:$CD$9,4,FALSE)","v":{"$error":"#VALUE!"}},{"$f":"T261-HLOOKUP(Y261,Feuil2!$C$1:$CD$9,5,FALSE)","v":{"$error":"#VALUE!"}},{"$f":"T261-HLOOKUP(Y261,Feuil2!$C$1:$CD$9,6,FALSE)","v":{"$error":"#VALUE!"}},{"$f":"T261-HLOOKUP(Y261,Feuil2!$C$1:$CD$9,7,FALSE)","v":{"$error":"#VALUE!"}},{"$f":"T261-HLOOKUP(Y261,Feuil2!$C$1:$CD$9,8,FALSE)","v":{"$error":"#VALUE!"}},{"$f":"T261-HLOOKUP(Y261,Feuil2!$C$1:$CD$9,9,FALSE)","v":{"$error":"#VALUE!"}},null,null,null,null,null,null,null,{"$error":"#VALUE!"},2017,null,{"$f":"IF(AQ261,VLOOKUP(AQ261,HOM!$AS$389:$AT$444,2))","v":4.4930000000000003}]
["H",null,null,null,null,null,null,null,null,null,null,null,null,null,"",null,null,null,"","","","","",false,{"$f":"IF(AND(H262<1920),VLOOKUP(I262,Feuil2!$F$10:$P$28,11),IF(AND(H262>=1920,H262<1939),VLOOKUP(I262,Feuil2!$F$10:$P$28,11),IF(AND(H262>=1938,H262<1943),VLOOKUP(I262,Feuil2!$F$10:$P$28,10),IF(AND(H262>=1943,H262<1948),VLOOKUP(I262,Feuil2!$F$10:$P$28,9),IF(AND(H262>=1948,H262<1953),VLOOKUP(I262,Feuil2!$F$10:$P$28,8),IF(AND(H262>=1953,H262<1958),VLOOKUP(I262,Feuil2!$F$10:$P$28,7),IF(AND(H262>=1958,H262<1963),VLOOKUP(I262,Feuil2!$F$10:$P$28,6),IF(AND(H262>=1963,H262<1968),VLOOKUP(I262,Feuil2!$F$10:$P$28,5),IF(AND(H262>=1968,H262<1973),VLOOKUP(I262,Feuil2!$F$10:$P$28,4),IF(AND(H262>=1973,H262<1978),VLOOKUP(I262,Feuil2!$F$10:$P$28,3),IF(AND(H262>=1978,H262<1983),VLOOKUP(I262,Feuil2!$F$10:$P$28,2),VLOOKUP(I262,Feuil2!$F$10:$P$28,2))))))))))))","v":{"$error":"#N/A"}},null,{"$f":"T262-HLOOKUP(Y262,Feuil2!$C$1:$CD$9,2,FALSE)","v":{"$error":"#VALUE!"}},{"$f":"T262-HLOOKUP(Y262,Feuil2!$C$1:$CD$9,3,FALSE)","v":{"$error":"#VALUE!"}},{"$f":"T262-HLOOKUP(Y262,Feuil2!$C$1:$CD$9,4,FALSE)","v":{"$error":"#VALUE!"}},{"$f":"T262-HLOOKUP(Y262,Feuil2!$C$1:$CD$9,5,FALSE)","v":{"$error":"#VALUE!"}},{"$f":"T262-HLOOKUP(Y262,Feuil2!$C$1:$CD$9,6,FALSE)","v":{"$error":"#VALUE!"}},{"$f":"T262-HLOOKUP(Y262,Feuil2!$C$1:$CD$9,7,FALSE)","v":{"$error":"#VALUE!"}},{"$f":"T262-HLOOKUP(Y262,Feuil2!$C$1:$CD$9,8,FALSE)","v":{"$error":"#VALUE!"}},{"$f":"T262-HLOOKUP(Y262,Feuil2!$C$1:$CD$9,9,FALSE)","v":{"$error":"#VALUE!"}},null,null,null,null,null,null,null,{"$error":"#VALUE!"},2017,null,{"$f":"IF(AQ262,VLOOKUP(AQ262,HOM!$AS$389:$AT$444,2))","v":4.4930000000000003}]
["H",null,null,null,null,null,null,null,null,null,null,null,null,null,"",null,null,null,"","","","","",false,{"$f":"IF(AND(H263<1920),VLOOKUP(I263,Feuil2!$F$10:$P$28,11),IF(AND(H263>=1920,H263<1939),VLOOKUP(I263,Feuil2!$F$10:$P$28,11),IF(AND(H263>=1938,H263<1943),VLOOKUP(I263,Feuil2!$F$10:$P$28,10),IF(AND(H263>=1943,H263<1948),VLOOKUP(I263,Feuil2!$F$10:$P$28,9),IF(AND(H263>=1948,H263<1953),VLOOKUP(I263,Feuil2!$F$10:$P$28,8),IF(AND(H263>=1953,H263<1958),VLOOKUP(I263,Feuil2!$F$10:$P$28,7),IF(AND(H263>=1958,H263<1963),VLOOKUP(I263,Feuil2!$F$10:$P$28,6),IF(AND(H263>=1963,H263<1968),VLOOKUP(I263,Feuil2!$F$10:$P$28,5),IF(AND(H263>=1968,H263<1973),VLOOKUP(I263,Feuil2!$F$10:$P$28,4),IF(AND(H263>=1973,H263<1978),VLOOKUP(I263,Feuil2!$F$10:$P$28,3),IF(AND(H263>=1978,H263<1983),VLOOKUP(I263,Feuil2!$F$10:$P$28,2),VLOOKUP(I263,Feuil2!$F$10:$P$28,2))))))))))))","v":{"$error":"#N/A"}},null,{"$f":"T263-HLOOKUP(Y263,Feuil2!$C$1:$CD$9,2,FALSE)","v":{"$error":"#VALUE!"}},{"$f":"T263-HLOOKUP(Y263,Feuil2!$C$1:$CD$9,3,FALSE)","v":{"$error":"#VALUE!"}},{"$f":"T263-HLOOKUP(Y263,Feuil2!$C$1:$CD$9,4,FALSE)","v":{"$error":"#VALUE!"}},{"$f":"T263-HLOOKUP(Y263,Feuil2!$C$1:$CD$9,5,FALSE)","v":{"$error":"#VALUE!"}},{"$f":"T263-HLOOKUP(Y263,Feuil2!$C$1:$CD$9,6,FALSE)","v":{"$error":"#VALUE!"}},{"$f":"T263-HLOOKUP(Y263,Feuil2!$C$1:$CD$9,7,FALSE)","v":{"$error":"#VALUE!"}},{"$f":"T263-HLOOKUP(Y263,Feuil2!$C$1:$CD$9,8,FALSE)","v":{"$error":"#VALUE!"}},{"$f":"T263-HLOOKUP(Y263,Feuil2!$C$1:$CD$9,9,FALSE)","v":{"$error":"#VALUE!"}},null,null,null,null,null,null,null,{"$error":"#VALUE!"},2017,null,{"$f":"IF(AQ263,VLOOKUP(AQ263,HOM!$AS$389:$AT$444,2))","v":4.4930000000000003}]
["H",null,null,null,null,null,null,null,null,null,null,null,null,null,"",null,null,null,"","","","","",false,{"$f":"IF(AND(H264<1920),VLOOKUP(I264,Feuil2!$F$10:$P$28,11),IF(AND(H264>=1920,H264<1939),VLOOKUP(I264,Feuil2!$F$10:$P$28,11),IF(AND(H264>=1938,H264<1943),VLOOKUP(I264,Feuil2!$F$10:$P$28,10),IF(AND(H264>=1943,H264<1948),VLOOKUP(I264,Feuil2!$F$10:$P$28,9),IF(AND(H264>=1948,H264<1953),VLOOKUP(I264,Feuil2!$F$10:$P$28,8),IF(AND(H264>=1953,H264<1958),VLOOKUP(I264,Feuil2!$F$10:$P$28,7),IF(AND(H264>=1958,H264<1963),VLOOKUP(I264,Feuil2!$F$10:$P$28,6),IF(AND(H264>=1963,H264<1968),VLOOKUP(I264,Feuil2!$F$10:$P$28,5),IF(AND(H264>=1968,H264<1973),VLOOKUP(I264,Feuil2!$F$10:$P$28,4),IF(AND(H264>=1973,H264<1978),VLOOKUP(I264,Feuil2!$F$10:$P$28,3),IF(AND(H264>=1978,H264<1983),VLOOKUP(I264,Feuil2!$F$10:$P$28,2),VLOOKUP(I264,Feuil2!$F$10:$P$28,2))))))))))))","v":{"$error":"#N/A"}},null,{"$f":"T264-HLOOKUP(Y264,Feuil2!$C$1:$CD$9,2,FALSE)","v":{"$error":"#VALUE!"}},{"$f":"T264-HLOOKUP(Y264,Feuil2!$C$1:$CD$9,3,FALSE)","v":{"$error":"#VALUE!"}},{"$f":"T264-HLOOKUP(Y264,Feuil2!$C$1:$CD$9,4,FALSE)","v":{"$error":"#VALUE!"}},{"$f":"T264-HLOOKUP(Y264,Feuil2!$C$1:$CD$9,5,FALSE)","v":{"$error":"#VALUE!"}},{"$f":"T264-HLOOKUP(Y264,Feuil2!$C$1:$CD$9,6,FALSE)","v":{"$error":"#VALUE!"}},{"$f":"T264-HLOOKUP(Y264,Feuil2!$C$1:$CD$9,7,FALSE)","v":{"$error":"#VALUE!"}},{"$f":"T264-HLOOKUP(Y264,Feuil2!$C$1:$CD$9,8,FALSE)","v":{"$error":"#VALUE!"}},{"$f":"T264-HLOOKUP(Y264,Feuil2!$C$1:$CD$9,9,FALSE)","v":{"$error":"#VALUE!"}},null,null,null,null,null,null,null,{"$error":"#VALUE!"},2017,null,{"$f":"IF(AQ264,VLOOKUP(AQ264,HOM!$AS$389:$AT$444,2))","v":4.4930000000000003}]
["H",null,null,null,null,null,null,null,null,null,null,null,null,null,"",null,null,null,"","","","","",false,{"$f":"IF(AND(H265<1920),VLOOKUP(I265,Feuil2!$F$10:$P$28,11),IF(AND(H265>=1920,H265<1939),VLOOKUP(I265,Feuil2!$F$10:$P$28,11),IF(AND(H265>=1938,H265<1943),VLOOKUP(I265,Feuil2!$F$10:$P$28,10),IF(AND(H265>=1943,H265<1948),VLOOKUP(I265,Feuil2!$F$10:$P$28,9),IF(AND(H265>=1948,H265<1953),VLOOKUP(I265,Feuil2!$F$10:$P$28,8),IF(AND(H265>=1953,H265<1958),VLOOKUP(I265,Feuil2!$F$10:$P$28,7),IF(AND(H265>=1958,H265<1963),VLOOKUP(I265,Feuil2!$F$10:$P$28,6),IF(AND(H265>=1963,H265<1968),VLOOKUP(I265,Feuil2!$F$10:$P$28,5),IF(AND(H265>=1968,H265<1973),VLOOKUP(I265,Feuil2!$F$10:$P$28,4),IF(AND(H265>=1973,H265<1978),VLOOKUP(I265,Feuil2!$F$10:$P$28,3),IF(AND(H265>=1978,H265<1983),VLOOKUP(I265,Feuil2!$F$10:$P$28,2),VLOOKUP(I265,Feuil2!$F$10:$P$28,2))))))))))))","v":{"$error":"#N/A"}},null,{"$f":"T265-HLOOKUP(Y265,Feuil2!$C$1:$CD$9,2,FALSE)","v":{"$error":"#VALUE!"}},{"$f":"T265-HLOOKUP(Y265,Feuil2!$C$1:$CD$9,3,FALSE)","v":{"$error":"#VALUE!"}},{"$f":"T265-HLOOKUP(Y265,Feuil2!$C$1:$CD$9,4,FALSE)","v":{"$error":"#VALUE!"}},{"$f":"T265-HLOOKUP(Y265,Feuil2!$C$1:$CD$9,5,FALSE)","v":{"$error":"#VALUE!"}},{"$f":"T265-HLOOKUP(Y265,Feuil2!$C$1:$CD$9,6,FALSE)","v":{"$error":"#VALUE!"}},{"$f":"T265-HLOOKUP(Y265,Feuil2!$C$1:$CD$9,7,FALSE)","v":{"$error":"#VALUE!"}},{"$f":"T265-HLOOKUP(Y265,Feuil2!$C$1:$CD$9,8,FALSE)","v":{"$error":"#VALUE!"}},{"$f":"T265-HLOOKUP(Y265,Feuil2!$C$1:$CD$9,9,FALSE)","v":{"$error":"#VALUE!"}},null,null,null,null,null,null,null,{"$error":"#VALUE!"},2017,null,{"$f":"IF(AQ265,VLOOKUP(AQ265,HOM!$AS$389:$AT$444,2))","v":4.4930000000000003}]
["H",null,null,null,null,null,null,null,null,null,null,null,null,null,"",null,null,null,"","","","","",false,{"$f":"IF(AND(H266<1920),VLOOKUP(I266,Feuil2!$F$10:$P$28,11),IF(AND(H266>=1920,H266<1939),VLOOKUP(I266,Feuil2!$F$10:$P$28,11),IF(AND(H266>=1938,H266<1943),VLOOKUP(I266,Feuil2!$F$10:$P$28,10),IF(AND(H266>=1943,H266<1948),VLOOKUP(I266,Feuil2!$F$10:$P$28,9),IF(AND(H266>=1948,H266<1953),VLOOKUP(I266,Feuil2!$F$10:$P$28,8),IF(AND(H266>=1953,H266<1958),VLOOKUP(I266,Feuil2!$F$10:$P$28,7),IF(AND(H266>=1958,H266<1963),VLOOKUP(I266,Feuil2!$F$10:$P$28,6),IF(AND(H266>=1963,H266<1968),VLOOKUP(I266,Feuil2!$F$10:$P$28,5),IF(AND(H266>=1968,H266<1973),VLOOKUP(I266,Feuil2!$F$10:$P$28,4),IF(AND(H266>=1973,H266<1978),VLOOKUP(I266,Feuil2!$F$10:$P$28,3),IF(AND(H266>=1978,H266<1983),VLOOKUP(I266,Feuil2!$F$10:$P$28,2),VLOOKUP(I266,Feuil2!$F$10:$P$28,2))))))))))))","v":{"$error":"#N/A"}},null,{"$f":"T266-HLOOKUP(Y266,Feuil2!$C$1:$CD$9,2,FALSE)","v":{"$error":"#VALUE!"}},{"$f":"T266-HLOOKUP(Y266,Feuil2!$C$1:$CD$9,3,FALSE)","v":{"$error":"#VALUE!"}},{"$f":"T266-HLOOKUP(Y266,Feuil2!$C$1:$CD$9,4,FALSE)","v":{"$error":"#VALUE!"}},{"$f":"T266-HLOOKUP(Y266,Feuil2!$C$1:$CD$9,5,FALSE)","v":{"$error":"#VALUE!"}},{"$f":"T266-HLOOKUP(Y266,Feuil2!$C$1:$CD$9,6,FALSE)","v":{"$error":"#VALUE!"}},{"$f":"T266-HLOOKUP(Y266,Feuil2!$C$1:$CD$9,7,FALSE)","v":{"$error":"#VALUE!"}},{"$f":"T266-HLOOKUP(Y266,Feuil2!$C$1:$CD$9,8,FALSE)","v":{"$error":"#VALUE!"}},{"$f":"T266-HLOOKUP(Y266,Feuil2!$C$1:$CD$9,9,FALSE)","v":{"$error":"#VALUE!"}},null,null,null,null,null,null,null,{"$error":"#VALUE!"},2017,null,{"$f":"IF(AQ266,VLOOKUP(AQ266,HOM!$AS$389:$AT$444,2))","v":4.4930000000000003}]
["H",null,null,null,null,null,null,null,null,null,null,null,null,null,"",null,null,null,"","","","","",false,{"$f":"IF(AND(H267<1920),VLOOKUP(I267,Feuil2!$F$10:$P$28,11),IF(AND(H267>=1920,H267<1939),VLOOKUP(I267,Feuil2!$F$10:$P$28,11),IF(AND(H267>=1938,H267<1943),VLOOKUP(I267,Feuil2!$F$10:$P$28,10),IF(AND(H267>=1943,H267<1948),VLOOKUP(I267,Feuil2!$F$10:$P$28,9),IF(AND(H267>=1948,H267<1953),VLOOKUP(I267,Feuil2!$F$10:$P$28,8),IF(AND(H267>=1953,H267<1958),VLOOKUP(I267,Feuil2!$F$10:$P$28,7),IF(AND(H267>=1958,H267<1963),VLOOKUP(I267,Feuil2!$F$10:$P$28,6),IF(AND(H267>=1963,H267<1968),VLOOKUP(I267,Feuil2!$F$10:$P$28,5),IF(AND(H267>=1968,H267<1973),VLOOKUP(I267,Feuil2!$F$10:$P$28,4),IF(AND(H267>=1973,H267<1978),VLOOKUP(I267,Feuil2!$F$10:$P$28,3),IF(AND(H267>=1978,H267<1983),VLOOKUP(I267,Feuil2!$F$10:$P$28,2),VLOOKUP(I267,Feuil2!$F$10:$P$28,2))))))))))))","v":{"$error":"#N/A"}},null,{"$f":"T267-HLOOKUP(Y267,Feuil2!$C$1:$CD$9,2,FALSE)","v":{"$error":"#VALUE!"}},{"$f":"T267-HLOOKUP(Y267,Feuil2!$C$1:$CD$9,3,FALSE)","v":{"$error":"#VALUE!"}},{"$f":"T267-HLOOKUP(Y267,Feuil2!$C$1:$CD$9,4,FALSE)","v":{"$error":"#VALUE!"}},{"$f":"T267-HLOOKUP(Y267,Feuil2!$C$1:$CD$9,5,FALSE)","v":{"$error":"#VALUE!"}},{"$f":"T267-HLOOKUP(Y267,Feuil2!$C$1:$CD$9,6,FALSE)","v":{"$error":"#VALUE!"}},{"$f":"T267-HLOOKUP(Y267,Feuil2!$C$1:$CD$9,7,FALSE)","v":{"$error":"#VALUE!"}},{"$f":"T267-HLOOKUP(Y267,Feuil2!$C$1:$CD$9,8,FALSE)","v":{"$error":"#VALUE!"}},{"$f":"T267-HLOOKUP(Y267,Feuil2!$C$1:$CD$9,9,FALSE)","v":{"$error":"#VALUE!"}},null,null,null,null,null,null,null,{"$error":"#VALUE!"},2017,null,{"$f":"IF(AQ267,VLOOKUP(AQ267,HOM!$AS$389:$AT$444,2))","v":4.4930000000000003}]
[]
[]
[]
[]
[]
[]
[]
[]
[]
[]
[]
[]
[]
[]
[]
[]
[]
[]
[]
[]
[]
[]
[]
[]
[]
[]
[]
[]
[]
[]
[]
[]
[]
[]
[]
[]
[]
[]
[]
[]
[]
[]
[]
[]
[]
[]
[]
[]
[]
[]
[]
[]
[]
[]
[]
[]
[]
[]
[]
[]
[]
[]
[]
[]
[]
[]
[]
[]
[]
[]
[]
[]
[]
[]
[]
[]
[]
[]
[]
[]
[]
[]
[]
[]
[]
[]
[]
[]
[]
[]
[]
[]
[]
[]
[]
[]
[]
[]
[]
[]
[]
[]
[]
[]
[]
[]
[]
[]
[]
[]
[]
[]
[]
[]
[]
[]
[null,null,null,null,null,null,null,null,null,null,null,null,null,null,null,null,null,null,null,null,null,null,null,null,null,null,null,null,null,null,null,null,null,null,null,null,null,null,null,null,null,null,30,null,30,1]
[null,null,null,null,null,null,null,null,null,null,null,null,null,null,null,null,null,null,null,null,null,null,null,null,null,null,null,null,null,null,null,null,null,null,null,null,null,null,null,null,null,null,31,null,31,1.016]
[null,null,null,null,null,null,null,null,null,null,null,null,null,null,null,null,null,null,null,null,null,null,null,null,null,null,null,null,null,null,null,null,null,null,null,null,null,null,null,null,null,null,32,null,32,1.0309999999999999]
[null,null,null,null,null,null,null,null,null,null,null,null,null,null,null,null,null,null,null,null,null,null,null,null,null,null,null,null,null,null,null,null,null,null,null,null,null,null,null,null,null,null,33,null,33,1.046]
[null,null,null,null,null,null,null,null,null,null,null,null,null,null,null,null,null,null,null,null,null,null,null,null,null,null,null,null,null,null,null,null,null,null,null,null,null,null,null,null,null,null,34,null,34,1.0589999999999999]
[null,null,null,null,null,null,null,null,null,null,null,null,null,null,null,null,null,null,null,null,null,null,null,null,null,null,null,null,null,null,null,null,null,null,null,null,null,null,null,null,null,null,35,"V1 H35",35,1.0720000000000001]
[null,null,null,null,null,null,null,null,null,null,null,null,null,null,null,null,null,null,null,null,null,null,null,null,null,null,null,null,null,null,null,null,null,null,null,null,null,null,null,null,null,null,36,"V1 H35",36,1.083]
[null,null,null,null,null,null,null,null,null,null,null,null,null,null,null,null,null,null,null,null,null,null,null,null,null,null,null,null,null,null,null,null,null,null,null,null,null,null,null,null,null,null,37,"V1 H35",37,1.0960000000000001]
[null,null,null,null,null,null,null,null,null,null,null,null,null,null,null,null,null,null,null,null,null,null,null,null,null,null,null,null,null,null,null,null,null,null,null,null,null,null,null,null,null,null,38,"V1 H35",38,1.109]
[null,null,null,null,null,null,null,null,null,null,null,null,null,null,null,null,null,null,null,null,null,null,null,null,null,null,null,null,null,null,null,null,null,null,null,null,null,null,null,null,null,null,39,"V1 H35",39,1.1220000000000001]
[null,null,null,null,null,null,null,null,null,null,null,null,null,null,null,null,null,null,null,null,null,null,null,null,null,null,null,null,null,null,null,null,null,null,null,null,null,null,null,null,null,null,40,"V2 H40",40,1.135]
[null,null,null,null,null,null,null,null,null,null,null,null,null,null,null,null,null,null,null,null,null,null,null,null,null,null,null,null,null,null,null,null,null,null,null,null,null,null,null,null,null,null,41,"V2 H40",41,1.149]
[null,null,null,null,null,null,null,null,null,null,null,null,null,null,null,null,null,null,null,null,null,null,null,null,null,null,null,null,null,null,null,null,null,null,null,null,null,null,null,null,null,null,42,"V2 H40",42,1.1619999999999999]
[null,null,null,null,null,null,null,null,null,null,null,null,null,null,null,null,null,null,null,null,null,null,null,null,null,null,null,null,null,null,null,null,null,null,null,null,null,null,null,null,null,null,43,"V2 H40",43,1.1759999999999999]
[null,null,null,null,null,null,null,null,null,null,null,null,null,null,null,null,null,null,null,null,null,null,null,null,null,null,null,null,null,null,null,null,null,null,null,null,null,null,null,null,null,null,44,"V2 H40",44,1.1890000000000001]
[null,null,null,null,null,null,null,null,null,null,null,null,null,null,null,null,null,null,null,null,null,null,null,null,null,null,null,null,null,null,null,null,null,null,null,null,null,null,null,null,null,null,45,"V3 H45",45,1.2030000000000001]
[null,null,null,null,null,null,null,null,null,null,null,null,null,null,null,null,null,null,null,null,null,null,null,null,null,null,null,null,null,null,null,null,null,null,null,null,null,null,null,null,null,null,46,"V3 H45",46,1.218]
[null,null,null,null,null,null,null,null,null,null,null,null,null,null,null,null,null,null,null,null,null,null,null,null,null,null,null,null,null,null,null,null,null,null,null,null,null,null,null,null,null,null,47,"V3 H45",47,1.2330000000000001]
[null,null,null,null,null,null,null,null,null,null,null,null,null,null,null,null,null,null,null,null,null,null,null,null,null,null,null,null,null,null,null,null,null,null,null,null,null,null,null,null,null,null,48,"V3 H45",48,1.248]
[null,null,null,null,null,null,null,null,null,null,null,null,null,null,null,null,null,null,null,null,null,null,null,null,null,null,null,null,null,null,null,null,null,null,null,null,null,null,null,null,null,null,49,"V3 H45",49,1.2629999999999999]
[null,null,null,null,null,null,null,null,null,null,null,null,null,null,null,null,null,null,null,null,null,null,null,null,null,null,null,null,null,null,null,null,null,null,null,null,null,null,null,null,null,null,50,"V4 H50",50,1.2789999999999999]
[null,null,null,null,null,null,null,null,null,null,null,null,null,null,null,null,null,null,null,null,null,null,null,null,null,null,null,null,null,null,null,null,null,null,null,null,null,null,null,null,null,null,51,"V4 H50",51,1.2969999999999999]
[null,null,null,null,null,null,null,null,null,null,null,null,null,null,null,null,null,null,null,null,null,null,null,null,null,null,null,null,null,null,null,null,null,null,null,null,null,null,null,null,null,null,52,"V4 H50",52,1.3160000000000001]
[null,null,null,null,null,null,null,null,null,null,null,null,null,null,null,null,null,null,null,null,null,null,null,null,null,null,null,null,null,null,null,null,null,null,null,null,null,null,null,null,null,null,53,"V4 H50",53,1.3380000000000001]
[null,null,null,null,null,null,null,null,null,null,null,null,null,null,null,null,null,null,null,null,null,null,null,null,null,null,null,null,null,null,null,null,null,null,null,null,null,null,null,null,null,null,54,"V4 H50",54,1.361]
[null,null,null,null,null,null,null,null,null,null,null,null,null,null,null,null,null,null,null,null,null,null,null,null,null,null,null,null,null,null,null,null,null,null,null,null,null,null,null,null,null,null,55,"V5 H55",55,1.385]
[null,null,null,null,null,null,null,null,null,null,null,null,null,null,null,null,null,null,null,null,null,null,null,null,null,null,null,null,null,null,null,null,null,null,null,null,null,null,null,null,null,null,56,"V5 H55",56,1.411]
[null,null,null,null,null,null,null,null,null,null,null,null,null,null,null,null,null,null,null,null,null,null,null,null,null,null,null,null,null,null,null,null,null,null,null,null,null,null,null,null,null,null,57,"V5 H55",57,1.4370000000000001]
[null,null,null,null,null,null,null,null,null,null,null,null,null,null,null,null,null,null,null,null,null,null,null,null,null,null,null,null,null,null,null,null,null,null,null,null,null,null,null,null,null,null,58,"V5 H55",58,1.462]
[null,null,null,null,null,null,null,null,null,null,null,null,null,null,null,null,null,null,null,null,null,null,null,null,null,null,null,null,null,null,null,null,null,null,null,null,null,null,null,null,null,null,59,"V5 H55",59,1.488]
[null,null,null,null,null,null,null,null,null,null,null,null,null,null,null,null,null,null,null,null,null,null,null,null,null,null,null,null,null,null,null,null,null,null,null,null,null,null,null,null,null,null,60,"V6 H60",60,1.514]
[null,null,null,null,null,null,null,null,null,null,null,null,null,null,null,null,null,null,null,null,null,null,null,null,null,null,null,null,null,null,null,null,null,null,null,null,null,null,null,null,null,null,61,"V6 H60",61,1.5409999999999999]
[null,null,null,null,null,null,null,null,null,null,null,null,null,null,null,null,null,null,null,null,null,null,null,null,null,null,null,null,null,null,null,null,null,null,null,null,null,null,null,null,null,null,62,"V6 H60",62,1.5680000000000001]
[null,null,null,null,null,null,null,null,null,null,null,null,null,null,null,null,null,null,null,null,null,null,null,null,null,null,null,null,null,null,null,null,null,null,null,null,null,null,null,null,null,null,63,"V6 H60",63,1.5980000000000001]
[null,null,null,null,null,null,null,null,null,null,null,null,null,null,null,null,null,null,null,null,null,null,null,null,null,null,null,null,null,null,null,null,null,null,null,null,null,null,null,null,null,null,64,"V6 H60",64,1.629]
[null,null,null,null,null,null,null,null,null,null,null,null,null,null,null,null,null,null,null,null,null,null,null,null,null,null,null,null,null,null,null,null,null,null,null,null,null,null,null,null,null,null,65,"V7 H65",65,1.663]
[null,null,null,null,null,null,null,null,null,null,null,null,null,null,null,null,null,null,null,null,null,null,null,null,null,null,null,null,null,null,null,null,null,null,null,null,null,null,null,null,null,null,66,"V7 H65",66,1.6990000000000001]
[null,null,null,null,null,null,null,null,null,null,null,null,null,null,null,null,null,null,null,null,null,null,null,null,null,null,null,null,null,null,null,null,null,null,null,null,null,null,null,null,null,null,67,"V7 H65",67,1.738]
[null,null,null,null,null,null,null,null,null,null,null,null,null,null,null,null,null,null,null,null,null,null,null,null,null,null,null,null,null,null,null,null,null,null,null,null,null,null,null,null,null,null,68,"V7 H65",68,1.7789999999999999]
[null,null,null,null,null,null,null,null,null,null,null,null,null,null,null,null,null,null,null,null,null,null,null,null,null,null,null,null,null,null,null,null,null,null,null,null,null,null,null,null,null,null,69,"V7 H65",69,1.823]
[null,null,null,null,null,null,null,null,null,null,null,null,null,null,null,null,null,null,null,null,null,null,null,null,null,null,null,null,null,null,null,null,null,null,null,null,null,null,null,null,null,null,70,"V8 H70",70,1.867]
[null,null,null,null,null,null,null,null,null,null,null,null,null,null,null,null,null,null,null,null,null,null,null,null,null,null,null,null,null,null,null,null,null,null,null,null,null,null,null,null,null,null,71,"V8 H70",71,1.91]
[null,null,null,null,null,null,null,null,null,null,null,null,null,null,null,null,null,null,null,null,null,null,null,null,null,null,null,null,null,null,null,null,null,null,null,null,null,null,null,null,null,null,72,"V8 H70",72,1.9530000000000001]
[null,null,null,null,null,null,null,null,null,null,null,null,null,null,null,null,null,null,null,null,null,null,null,null,null,null,null,null,null,null,null,null,null,null,null,null,null,null,null,null,null,null,73,"V8 H70",73,2.004]
[null,null,null,null,null,null,null,null,null,null,null,null,null,null,null,null,null,null,null,null,null,null,null,null,null,null,null,null,null,null,null,null,null,null,null,null,null,null,null,null,null,null,74,"V8 H70",74,2.06]
[null,null,null,null,null,null,null,null,null,null,null,null,null,null,null,null,null,null,null,null,null,null,null,null,null,null,null,null,null,null,null,null,null,null,null,null,null,null,null,null,null,null,75,"V9 H75",75,2.117]
[null,null,null,null,null,null,null,null,null,null,null,null,null,null,null,null,null,null,null,null,null,null,null,null,null,null,null,null,null,null,null,null,null,null,null,null,null,null,null,null,null,null,76,"V9 H75",76,2.181]
[null,null,null,null,null,null,null,null,null,null,null,null,null,null,null,null,null,null,null,null,null,null,null,null,null,null,null,null,null,null,null,null,null,null,null,null,null,null,null,null,null,null,77,"V9 H75",77,2.2549999999999999]
[null,null,null,null,null,null,null,null,null,null,null,null,null,null,null,null,null,null,null,null,null,null,null,null,null,null,null,null,null,null,null,null,null,null,null,null,null,null,null,null,null,null,78,"V9 H75",78,2.3359999999999999]
[null,null,null,null,null,null,null,null,null,null,null,null,null,null,null,null,null,null,null,null,null,null,null,null,null,null,null,null,null,null,null,null,null,null,null,null,null,null,null,null,null,null,79,"V9 H75",79,2.419]
[null,null,null,null,null,null,null,null,null,null,null,null,null,null,null,null,null,null,null,null,null,null,null,null,null,null,null,null,null,null,null,null,null,null,null,null,null,null,null,null,null,null,80,"V10 H80+",80,2.504]
[null,null,null,null,null,null,null,null,null,null,null,null,null,null,null,null,null,null,null,null,null,null,null,null,null,null,null,null,null,null,null,null,null,null,null,null,null,null,null,null,null,null,81,"V10 H80+",81,2.597]
[null,null,null,null,null,null,null,null,null,null,null,null,null,null,null,null,null,null,null,null,null,null,null,null,null,null,null,null,null,null,null,null,null,null,null,null,null,null,null,null,null,null,82,"V10 H80+",82,2.702]
[null,null,null,null,null,null,null,null,null,null,null,null,null,null,null,null,null,null,null,null,null,null,null,null,null,null,null,null,null,null,null,null,null,null,null,null,null,null,null,null,null,null,83,"V10 H80+",83,2.831]
[null,null,null,null,null,null,null,null,null,null,null,null,null,null,null,null,null,null,null,null,null,null,null,null,null,null,null,null,null,null,null,null,null,null,null,null,null,null,null,null,null,null,84,"V10 H80+",84,2.9809999999999999]
[null,null,null,null,null,null,null,null,null,null,null,null,null,null,null,null,null,null,null,null,null,null,null,null,null,null,null,null,null,null,null,null,null,null,null,null,null,null,null,null,null,null,85,"V10 H80+",85,3.153]
[null,null,null,null,null,null,null,null,null,null,null,null,null,null,null,null,null,null,null,null,null,null,null,null,null,null,null,null,null,null,null,null,null,null,null,null,null,null,null,null,null,null,86,"V10 H80+",86,3.3519999999999999]
[null,null,null,null,null,null,null,null,null,null,null,null,null,null,null,null,null,null,null,null,null,null,null,null,null,null,null,null,null,null,null,null,null,null,null,null,null,null,null,null,null,null,87,"V10 H80+",87,3.58]
[null,null,null,null,null,null,null,null,null,null,null,null,null,null,null,null,null,null,null,null,null,null,null,null,null,null,null,null,null,null,null,null,null,null,null,null,null,null,null,null,null,null,88,"V10 H80+",88,3.843]
[null,null,null,null,null,null,null,null,null,null,null,null,null,null,null,null,null,null,null,null,null,null,null,null,null,null,null,null,null,null,null,null,null,null,null,null,null,null,null,null,null,null,89,"V10 H80+",89,4.1449999999999996]
[null,null,null,null,null,null,null,null,null,null,null,null,null,null,null,null,null,null,null,null,null,null,null,null,null,null,null,null,null,null,null,null,null,null,null,null,null,null,null,null,null,null,90,"V10 H80+",90,4.4930000000000003]
[]
[]
[]
[]
[]
[]
[]
[]
[]
[]
[]
[]
[]
[]
[]
[]
[]
[]
[]
[]
[]
[]
[]
[]
[]
[]
[]
[]
[]
[]
[]
[]
[]
[]
[]
[]
[]
[]
[]
[]
[]
[]
[]
[]
[]
[]
[]
[]
[]
[]
[]
[]
[]
[]
[]
[]
[]
[]
[]
[]
[]
[]
[]
[]
[]
[]
[]
[]
[]
[]
[]
[]
[]
[]
[]
[]
[]
[]
[]
[]
[]
[]
[]
[]
[]
[]
[]
[]
[]
[null,null,null,null,null,null,null,null,null,null,null,null,null,null,null,null,null,null,null,null,null,null,null,null,null,"J69","J77","J85","J94","J105","J+105",null,"J56","J62","J69","J77","J85","J94","J105","J+105",null,"S56","S62","S69","S77","S85","S94","S105","S+105"]
[null,null,null,null,null,null,null,null,null,null,null,null,null,null,null,null,null,null,null,null,null,null,null,null,null,130,145,160,170,180,190,null,100,115,130,145,160,170,180,190,null,115,135,150,165,180,190,200,210]
[null,null,null,null,null,null,null,null,null,null,null,null,null,null,null,null,null,null,null,null,null,null,null,null,null,150,165,180,190,200,210,null,115,135,150,165,180,190,200,210,null,130,150,165,185,200,210,220,230]
[null,null,null,null,null,null,null,null,null,null,null,null,null,null,null,null,null,null,null,null,null,null,null,null,null,165,185,200,210,220,230,null,130,150,165,185,200,210,220,230,null,145,165,180,200,220,230,240,250]
[null,null,null,null,null,null,null,null,null,null,null,null,null,null,null,null,null,null,null,null,null,null,null,null,null,180,200,220,230,240,250,null,145,165,180,200,220,230,240,250,null,175,195,215,235,250,260,275,280]
[null,null,null,null,null,null,null,null,null,null,null,null,null,null,null,null,null,null,null,null,null,null,null,null,null,215,235,250,260,275,280,null,175,195,215,235,250,260,275,280,null,210,230,250,270,290,300,310,325]
[null,null,null,null,null,null,null,null,null,null,null,null,null,null,null,null,null,null,null,null,null,null,null,null,null,250,270,290,300,310,325,null,210,230,250,270,290,300,310,325,null,230,255,275,300,315,335,345,355]
[null,null,null,null,null,null,null,null,null,null,null,null,null,null,null,null,null,null,null,null,null,null,null,null,null,295,320,335,355,370,380,null,245,270,295,320,335,355,370,380,null,245,270,295,320,335,355,370,380]

{"sheet":"Feuil1","index":1,"n_rows":24,"n_cols":58,"rows_kept":24,"cut":false,"hidden":true,"merged":[]}
[null,null,"VF35-48","VF35-53","VF35-58","VF35-63","VF35-69","VF35-75","VF35+75","VF40-48","VF40-53","VF40-58","VF40-63","VF40-69","VF40-75","VF40+75","VF45-48","VF45-53","VF45-58","VF45-63","VF45-69","VF45-75","VF45+75","VF50-48","VF50-53","VF50-58","VF50-63","VF50-69","VF50-75","VF50+75","VF55-48","VF55-53","VF55-58","VF55-63","VF55-69","VF55-75","VF55+75","VF60-48","VF60-53","VF60-58","VF60-63","VF60-69","VF60-75","VF60+75","VF65-48","VF65-53","VF65-58","VF65-63","VF65-69","VF65-75","VF65+75","VF70+-48","VF70+-53","VF70+-58","VF70+-63","VF70+-69","VF70+-75","VF70++75"]
[null,null,null,null,null,null,null,null,null,null,null,null,null,null,null,null,null,null,null,null,null,null,null,null,null,null,null,null,null,null,null,null,null,null,null,null,null,null,null,null,null,null,null,null,null,null,null,null,null,null,null," "]
[null,"REGION",55,60,62,65,70,72,80,52,55,60,62,65,67,75,50,52,55,60,62,65,72,45,47,52,55,57,60,67,42,45,47,50,52,55,57,40,42,45,47,50,52,55,38,40,42,45,48,50,52,36,38,40,43,45,48,50]
[null,"France",60,62,67,70,75,77,85,55,60,62,65,70,72,80,52,55,60,62,65,67,75,50,52,55,60,62,65,72,45,47,52,55,57,60,67,42,45,47,50,52,55,57,40,42,45,47,50,52,55,38,40,42,45,48,50,52]
[null,"EUROPE",70,72,77,80,85,87,95,65,70,72,75,80,82,90,62,65,70,72,75,77,85,60,62,65,70,72,75,82,55,57,62,65,67,70,77,52,55,57,60,62,65,67,50,52,55,57,60,62,65,45,47,49,52,55,57,60]
[null,"MONDE",82,90,95,100,102,107,112,80,85,90,95,97,100,105,72,77,82,85,90,92,97,67,72,75,77,82,85,90,60,65,67,70,75,77,82,55,57,62,65,67,70,72,50,52,55,57,60,62,65,46,48,50,53,56,58,61]
[null,"INTERNATIONAL B",1000,1000,1000,1000,1000,1000,1000,1000,1000,1000,1000,1000,1000,1000,1000,1000,1000,1000,1000,1000,1000,1000,1000,1000,1000,1000,1000,1000,1000,1000,1000,1000,1000,1000,1000,1000,1000,1000,1000,1000,1000,1000,1000,1000,1000,1000,1000,1000,1000,1000,1000,1000,1000,1000,1000,1000]
[null,"INTERNATIONAL A",1000,1000,1000,1000,1000,1000,1000,1000,1000,1000,1000,1000,1000,1000,1000,1000,1000,1000,1000,1000,1000,1000,1000,1000,1000,1000,1000,1000,1000,1000,1000,1000,1000,1000,1000,1000,1000,1000,1000,1000,1000,1000,1000,1000,1000,1000,1000,1000,1000,1000,1000,1000,1000,1000,1000,1000]
[null,"OLYMPIQUE",1000,1000,1000,1000,1000,1000,1000,1000,1000,1000,1000,1000,1000,1000,1000,1000,1000,1000,1000,1000,1000,1000,1000,1000,1000,1000,1000,1000,1000,1000,1000,1000,1000,1000,1000,1000,1000,1000,1000,1000,1000,1000,1000,1000,1000,1000,1000,1000,1000,1000,1000,1000,1000,1000,1000,1000]
[null,null,null,null,null,null,"VF35","VF40","VF45","VF50","VF55","VF60","VF65","VF70+"]
[null,null,null,null,null,20.010000000000002,"VF35-48","VF40-48","VF45-48","VF50-48","VF55-48","VF60-48","VF65-48","VF70+-48"]
[null,null,null,null,null,30.01,"VF35-48","VF40-48","VF45-48","VF50-48","VF55-48","VF60-48","VF65-48","VF70+-48"]
[null,null,null,null,null,35.01,"VF35-48","VF40-48","VF45-48","VF50-48","VF55-48","VF60-48","VF65-48","VF70+-48"]
[null,null,null,null,null,36.01,"VF35-48","VF40-48","VF45-48","VF50-48","VF55-48","VF60-48","VF65-48","VF70+-48"]
[null,null,null,null,null,40.01,"VF35-48","VF40-48","VF45-48","VF50-48","VF55-48","VF60-48","VF65-48","VF70+-48"]
[null,null,null,null,null,44.01,"VF35-48","VF40-48","VF45-48","VF50-48","VF55-48","VF60-48","VF65-48","VF70+-48"]
[null,null,null,null,null,48.01,"VF35-53","VF40-53","VF45-53","VF50-53","VF55-53","VF60-53","VF65-53","VF70+-53"]
[null,null,null,null,null,53.01,"VF35-58","VF40-58","VF45-58","VF50-58","VF55-58","VF60-58","VF65-58","VF70+-58"]
[null,null,null,null,null,58.01,"VF35-63","VF40-63","VF45-63","VF50-63","VF55-63","VF60-63","VF65-63","VF70+-63"]
[null,null,null,null,null,63.01,"VF35-69","VF40-69","VF45-69","VF50-69","VF55-69","VF60-69","VF65-69","VF70+-69"]
[null,null,null,null,null,69.010000000000005,"VF35-75","VF40-75","VF45-75","VF50-75","VF55-75","VF60-75","VF65-75","VF70+-75"]
[null,null,null,null,null,75.010000000000005,"VF35+75","VF40+75","VF45+75","VF50+75","VF55+75","VF60+75","VF65+75","VF70++75"]
[null,null,null,null,null,110,"VF35+75","VF40+75","VF45+75","VF50+75","VF55+75","VF60+75","VF65+75","VF70++75"]
[null,null,null,null,null,140,"VF35+75","VF40+75","VF45+75","VF50+75","VF55+75","VF60+75","VF65+75","VF70++75"]

{"sheet":"Feuil2","index":2,"n_rows":90,"n_cols":83,"rows_kept":90,"cut":false,"hidden":true,"merged":[]}
[null,null,"VH35-56","VH35-62","VH35-69","VH35-77","VH35-85","VH35-94","VH35-105","VH35+105","VH40-56","VH40-62","VH40-69","VH40-77","VH40-85","VH40-94","VH40-105","VH40+105","VH45-56","VH45-62","VH45-69","VH45-77","VH45-85","VH45-94","VH45-105","VH45+105","VH50-56","VH50-62","VH50-69","VH50-77","VH50-85","VH50-94","VH50-105","VH50+105","VH55-56","VH55-62","VH55-69","VH55-77","VH55-85","VH55-94","VH55-105","VH55+105","VH60-56","VH60-62","VH60-69","VH60-77","VH60-85","VH60-94","VH60-105","VH60+105","VH65-56","VH65-62","VH65-69","VH65-77","VH65-85","VH65-94","VH65-105","VH65+105","VH70-56","VH70-62","VH70-69","VH70-77","VH70-85","VH70-94","VH70-105","VH70+105","VH75-56","VH75-62","VH75-69","VH75-77","VH75-85","VH75-94","VH75-105","VH75+105","VH80+-56","VH80+-62","VH80+-69","VH80+-77","VH80+-85","VH80+-94","VH80+-105","VH80++105"]
[null,null,null,null,null,null,null,null,null,null,null,null,null,null,null,null,null,null,null,null,null,null,null,null,null,null,null,null,null,null,null,null,null,null,null,null,null,null,null,null,null,null,null,null,null,null,null,null,null,null,null," "]
[null,"REGION",117,132,147,162,172,182,190,197,110,125,140,152,162,172,180,187,105,117,130,145,155,162,170,177,95,107,120,130,140,147,155,162,82,92,105,115,122,130,137,145,72,82,92,102,110,117,122,130,60,70,77,87,92,100,102,107,47,55,62,70,75,80,82,87,42,47,55,62,67,70,75,80,40,45,50,60,63,64,69,70,"REGIONAL"]
[null,"France",127,142,157,172,182,192,200,202,120,135,150,162,172,182,190,197,115,127,140,155,165,172,180,187,105,117,130,140,150,157,165,172,92,102,115,125,132,140,147,155,82,92,102,112,120,127,132,140,70,80,87,97,102,110,112,117,57,65,72,80,85,90,92,97,52,57,65,72,77,80,85,90,50,55,58,62,64,65,70,75,"France"]
[null,"EUROPE",137,152,167,182,192,202,210,217,130,145,160,172,182,192,200,207,125,137,150,165,175,182,190,197,115,127,140,150,160,167,175,182,102,112,125,135,142,150,157,165,92,102,112,122,130,137,142,150,80,90,97,107,112,120,122,127,67,75,82,90,95,100,102,107,62,67,75,82,87,90,95,100,54,56,59,64,69,71,76,79,"EUROPE"]
[null,"MONDE",155,172,187,202,215,227,237,245,147,162,177,192,205,215,225,232,140,155,170,185,195,205,212,222,130,142,157,170,180,190,197,205,115,127,140,152,162,170,177,182,105,117,127,137,147,155,160,167,92,102,112,120,127,135,140,145,75,82,90,97,102,107,112,117,67,75,82,87,95,97,102,107,55,57,60,65,70,72,77,80,"MONDE"]
[null,"INTERNATIONAL B",1000,1000,1000,1000,1000,1000,1000,1000,1000,1000,1000,1000,1000,1000,1000,1000,1000,1000,1000,1000,1000,1000,1000,1000,1000,1000,1000,1000,1000,1000,1000,1000,1000,1000,1000,1000,1000,1000,1000,1000,1000,1000,1000,1000,1000,1000,1000,1000,1000,1000,1000,1000,1000,1000,1000,1000,1000,1000,1000,1000,1000,1000,1000,1000,1000,1000,1000,1000,1000,1000,1000,1000,1000,1000,1000,1000,1000,1000,1000,1000]
[null,"INTERNATIONAL A",1000,1000,1000,1000,1000,1000,1000,1000,1000,1000,1000,1000,1000,1000,1000,1000,1000,1000,1000,1000,1000,1000,1000,1000,1000,1000,1000,1000,1000,1000,1000,1000,1000,1000,1000,1000,1000,1000,1000,1000,1000,1000,1000,1000,1000,1000,1000,1000,1000,1000,1000,1000,1000,1000,1000,1000,1000,1000,1000,1000,1000,1000,1000,1000,1000,1000,1000,1000,1000,1000,1000,1000,1000,1000,1000,1000,1000,1000,1000,1000]
[null,"OLYMPIQUE",1000,1000,1000,1000,1000,1000,1000,1000,1000,1000,1000,1000,1000,1000,1000,1000,1000,1000,1000,1000,1000,1000,1000,1000,1000,1000,1000,1000,1000,1000,1000,1000,1000,1000,1000,1000,1000,1000,1000,1000,1000,1000,1000,1000,1000,1000,1000,1000,1000,1000,1000,1000,1000,1000,1000,1000,1000,1000,1000,1000,1000,1000,1000,1000,1000,1000,1000,1000,1000,1000,1000,1000,1000,1000,1000,1000,1000,1000,1000,1000]
[null,null,null,null,null,null,"VH35","VH40","VH45","VH50","VH55","VH60","VH65","VH70","VH75","VH80+"]
[null,null,null,null,null,20.010000000000002,"VH35-56","VH40-56","VH45-56","VH50-56","VH55-56","VH60-56","VH65-56","VH70-56","VH75-56","VH80+-56"]
[null,null,null,null,null,34.01,"VH35-56","VH40-56","VH45-56","VH50-56","VH55-56","VH60-56","VH65-56","VH70-56","VH75-56","VH80+-56"]
[null,null,null,null,null,38.01,"VH35-56","VH40-56","VH45-56","VH50-56","VH55-56","VH60-56","VH65-56","VH70-56","VH75-56","VH80+-56"]
[null,null,null,null,null,40.01,"VH35-56","VH40-56","VH45-56","VH50-56","VH55-56","VH60-56","VH65-56","VH70-56","VH75-56","VH80+-56"]
[null,null,null,null,null,45.01,"VH35-56","VH40-56","VH45-56","VH50-56","VH55-56","VH60-56","VH65-56","VH70-56","VH75-56","VH80+-56"]
[null,null,null,null,null,50.01,"VH35-56","VH40-56","VH45-56","VH50-56","VH55-56","VH60-56","VH65-56","VH70-56","VH75-56","VH80+-56"]
[null,null,null,null,null,52.05,"VH35-56","VH40-56","VH45-56","VH50-56","VH55-56","VH60-56","VH65-56","VH70-56","VH75-56","VH80+-56"]
[null,null,null,null,null,56.01,"VH35-62","VH40-62","VH45-62","VH50-62","VH55-62","VH60-62","VH65-62","VH70-62","VH75-62","VH80+-62"]
[null,null,null,null,null,62.01,"VH35-69","VH40-69","VH45-69","VH50-69","VH55-69","VH60-69","VH65-69","VH70-69","VH75-69","VH80+-69"]
[null,null,null,null,null,69.010000000000005,"VH35-77","VH40-77","VH45-77","VH50-77","VH55-77","VH60-77","VH65-77","VH70-77","VH75-77","VH80+-77"]
[null,null,null,null,null,77.010000000000005,"VH35-85","VH40-85","VH45-85","VH50-85","VH55-85","VH60-85","VH65-85","VH70-85","VH75-85","VH80+-85"]
[null,null,null,null,null,85.01,"VH35-94","VH40-94","VH45-94","VH50-94","VH55-94","VH60-94","VH65-94","VH70-94","VH75-94","VH80+-94"]
[null,null,null,null,null,94.01,"VH35-105","VH40-105","VH45-105","VH50-105","VH55-105","VH60-105","VH65-105","VH70-105","VH75-105","VH80+-105"]
[null,null,null,null,null,105.01,"VH35+105","VH40+105","VH45+105","VH50+105","VH55+105","VH60+105","VH65+105","VH70+105","VH75+105","VH80++105"]
[null,null,null,null,null,110,"VH35+105","VH40+105","VH45+105","VH50+105","VH55+105","VH60+105","VH65+105","VH70+105","VH75+105","VH80++105"]
[null,null,null,null,null,120,"VH35+105","VH40+105","VH45+105","VH50+105","VH55+105","VH60+105","VH65+105","VH70+105","VH75+105","VH80++105"]
[null,null,null,null,null,130,"VH35+105","VH40+105","VH45+105","VH50+105","VH55+105","VH60+105","VH65+105","VH70+105","VH75+105","VH80++105"]
[null,null,null,null,null,140,"VH35+105","VH40+105","VH45+105","VH50+105","VH55+105","VH60+105","VH65+105","VH70+105","VH75+105","VH80++105"]
[null,null,null,null,null," "]
[null,null,null,null,null,30,1]
[null,null,null,null,null,31,1.016]
[null,null,null,null,null,32,1.0309999999999999]
[null,null,null,null,null,33,1.046]
[null,null,null,null,null,34,1.0589999999999999]
[null,null,null,null,null,35,1.0720000000000001,1.0720000000000001]
[null,null,null,null,null,36,1.083,1.083]
[null,null,null,null,null,37,1.0960000000000001,1.0960000000000001]
[null,null,null,null,null,38,1.109,1.109]
[null,null,null,null,null,39,1.1220000000000001,1.1220000000000001]
[null,null,null,null,null,40,1.135,1.135]
[null,null,null,null,null,41,1.149,1.149]
[null,null,null,null,null,42,1.1619999999999999,1.1619999999999999]
[null,null,null,null,null,43,1.1759999999999999,1.1759999999999999]
[null,null,null,null,null,44,1.1890000000000001,1.1890000000000001]
[null,null,null,null,null,45,1.2030000000000001,1.2030000000000001]
[null,null,null,null,null,46,1.218,1.218]
[null,null,null,null,null,47,1.2330000000000001,1.2330000000000001]
[null,null,null,null,null,48,1.248,1.248]
[null,null,null,null,null,49,1.2629999999999999,1.2629999999999999]
[null,null,null,null,null,50,1.2789999999999999,1.2789999999999999]
[null,null,null,null,null,51,1.2969999999999999,1.2969999999999999]
[null,null,null,null,null,52,1.3160000000000001,1.3160000000000001]
[null,null,null,null,null,53,1.3380000000000001,1.3380000000000001]
[null,null,null,null,null,54,1.361,1.361]
[null,null,null,null,null,55,1.385,1.385]
[null,null,null,null,null,56,1.411,1.411]
[null,null,null,null,null,57,1.4370000000000001,1.4370000000000001]
[null,null,null,null,null,58,1.462,1.462]
[null,null,null,null,null,59,1.488,1.488]
[null,null,null,null,null,60,1.514,1.514]
[null,null,null,null,null,61,1.5409999999999999,1.5409999999999999]
[null,null,null,null,null,62,1.5680000000000001,1.5680000000000001]
[null,null,null,null,null,63,1.5980000000000001,1.5980000000000001]
[null,null,null,null,null,64,1.629,1.629]
[null,null,null,null,null,65,1.663,1.663]
[null,null,null,null,null,66,1.6990000000000001,1.6990000000000001]
[null,null,null,null,null,67,1.738,1.738]
[null,null,null,null,null,68,1.7789999999999999,1.7789999999999999]
[null,null,null,null,null,69,1.823,1.823]
[null,null,null,null,null,70,1.867,1.867]
[null,null,null,null,null,71,1.91,1.91]
[null,null,null,null,null,72,1.9530000000000001,1.9530000000000001]
[null,null,null,null,null,73,2.004,2.004]
[null,null,null,null,null,74,2.06,2.06]
[null,null,null,null,null,75,2.117,2.117]
[null,null,null,null,null,76,2.181,2.181]
[null,null,null,null,null,77,2.2549999999999999,2.2549999999999999]
[null,null,null,null,null,78,2.3359999999999999,2.3359999999999999]
[null,null,null,null,null,79,2.419,2.419]
[null,null,null,null,null,80,2.504,2.504]
[null,null,null,null,null,81,2.597,2.597]
[null,null,null,null,null,82,2.702,2.702]
[null,null,null,null,null,83,2.831,2.831]
[null,null,null,null,null,84,2.9809999999999999,2.9809999999999999]
[null,null,null,null,null,85,3.153,3.153]
[null,null,null,null,null,86,3.3519999999999999,3.3519999999999999]
[null,null,null,null,null,87,3.58,3.58]
[null,null,null,null,null,88,3.843,3.843]
[null,null,null,null,null,89,4.1449999999999996,4.1449999999999996]
[null,null,null,null,null,90,4.4930000000000003,4.4930000000000003]