{"text_format":"1","workbook":"xlsx","n_sheets":3,"sheets":["HOM","Feuil1","Feuil2"],"not_rendered":{"charts":0,"images":1,"macros":1,"external_links":0,"defined_names":3,"comments":1,"pivot_tables":0},"unopened":[],"bounds":{"document_bytes":16777216,"sheet_cells":100000,"rows_first":2000,"rows_last":500,"rows_between":2000,"halvings":0,"cell_chars":16384,"cell_head_chars":4096},"cells_cut":0,"cells_raw":0,"read":"whole","date_system":"1900"}

{"sheet":"HOM","index":0,"n_rows":541,"n_cols":49,"rows_kept":541,"cut":false,"hidden":false,"merged":[[0,5,0,14],[4,21,4,22],[2,7,2,13],[2,18,2,22],[0,18,0,21],[1,15,1,17]]}
[null,null,null,null,null,"LISTING  pour les MASTERS HOMMES",null,null,null,null,null,null,null,null,null,null,"DATE :",null," "]
[null,null,null,null,null," "," "," ",null,null,null,null,null,null,null," ",null,null," "]
[null,null,null,null,null," "," "," ",null,null,null,null,null,null,null,null,null,null," "]
[]
["SEXE","ZONE","REG.","Cl.","LICENCE","NOMS","Prénoms","AN","POIDS","CLUB","NAT",1,2,3,"ARR",1,2,3,"EP-J","Total","IWF SMM","SERIE",null,"Caté","Catég",null,"N.CL.","REG +","FRA +","EUR +","MON +","INTB +","INTA +","OLY +","NCL"]
["H"," "," ",null,null," "," ",1982,85," ","F",null,null,102,{"$f":"IF(I6=\"\",\"\",IF(MAXA(L6:N6)<=0,0,MAXA(L6:N6)))","v":102},133,null,null,{"$f":"IF(I6=\"\",\"\",IF(MAXA(P6:R6)<=0,0,MAXA(P6:R6)))","v":133},{"$f":"IF(I6=\"\",\"\",IF(OR(O6=0,S6=0),0,O6+S6))","v":235},{"$f":"IF(I6=\"\",\"\",IF(A6=\"H\",10^(0.794358141*LOG(I6/174.393)^2)*T6*AS6,IF(A6=\"F\",10^(0.89726074 * LOG(I6/148.026)^2)*T6*AS6,\"\")))","v":301.05319584674669},{"$f":"IF(I6=\"\",\"\",AP6)","v":"MON +"},{"$f":"IF(I6=\"\",\"\",IF(AH6>=0,AH6,IF(AG6>=0,AG6,IF(AF6>=0,AF6,IF(AE6>=0,AE6,IF(AD6>=0,AD6,IF(AC6>=0,AC6,IF(AB6>=0,AB6,AA6))))))))","v":20},{"$f":"IF(AQ6<95,IF(AQ6<=90,VLOOKUP(AQ6,$AQ$255:$AR$444,2)))","v":"V1 H35"},{"$f":"IF(AND(H6<1920),VLOOKUP(I6,Feuil2!$F$10:$P$28,11),IF(AND(H6>=1920,H6<1939),VLOOKUP(I6,Feuil2!$F$10:$P$28,11),IF(AND(H6>=1938,H6<1943),VLOOKUP(I6,Feuil2!$F$10:$P$28,10),IF(AND(H6>=1943,H6<1948),VLOOKUP(I6,Feuil2!$F$10:$P$28,9),IF(AND(H6>=1948,H6<1953),VLOOKUP(I6,Feuil2!$F$10:$P$28,8),IF(AND(H6>=1953,H6<1958),VLOOKUP(I6,Feuil2!$F$10:$P$28,7),IF(AND(H6>=1958,H6<1963),VLOOKUP(I6,Feuil2!$F$10:$P$28,6),IF(AND(H6>=1963,H6<1968),VLOOKUP(I6,Feuil2!$F$10:$P$28,5),IF(AND(H6>=1968,H6<1973),VLOOKUP(I6,Feuil2!$F$10:$P$28,4),IF(AND(H6>=1973,H6<1978),VLOOKUP(I6,Feuil2!$F$10:$P$28,3),IF(AND(H6>=1978,H6<1983),VLOOKUP(I6,Feuil2!$F$10:$P$28,2),VLOOKUP(I6,Feuil2!$F$10:$P$28,2))))))))))))","v":"VH35-85"},null,{"$f":"T6-HLOOKUP(Y6,Feuil2!$C$1:$CD$9,2,FALSE)","v":235},{"$f":"T6-HLOOKUP(Y6,Feuil2!$C$1:$CD$9,3,FALSE)","v":63},{"$f":"T6-HLOOKUP(Y6,Feuil2!$C$1:$CD$9,4,FALSE)","v":53},{"$f":"T6-HLOOKUP(Y6,Feuil2!$C$1:$CD$9,5,FALSE)","v":43},{"$f":"T6-HLOOKUP(Y6,Feuil2!$C$1:$CD$9,6,FALSE)","v":20},{"$f":"T6-HLOOKUP(Y6,Feuil2!$C$1:$CD$9,7,FALSE)","v":-765},{"$f":"T6-HLOOKUP(Y6,Feuil2!$C$1:$CD$9,8,FALSE)","v":-765},{"$f":"T6-HLOOKUP(Y6,Feuil2!$C$1:$CD$9,9,FALSE)","v":-765},null,null,null,null,null,null,null,{"$f":"IF(AH6>=0,$AH$5,IF(AG6>=0,$AG$5,IF(AF6>=0,$AF$5,IF(AE6>=0,$AE$5,IF(AD6>=0,$AD$5,IF(AC6>=0,$AC$5,IF(AB6>=0,$AB$5,IF(AA6>=0,$AA$5,$AI$5))))))))","v":"MON +"},{"$f":"2017-H6","v":35},null,{"$f":"IF(AQ6,VLOOKUP(AQ6,HOM!$AS$389:$AT$444,2))","v":1.0720000000000001}]
["H",null,null,null,null,null,null,1977,77,null,"F",null,null,90,90,120,null,null,120,210,300.15512035733974,"MON +",18,"V2 H40",{"$f":"IF(AND(H7<1920),VLOOKUP(I7,Feuil2!$F$10:$P$28,11),IF(AND(H7>=1920,H7<1939),VLOOKUP(I7,Feuil2!$F$10:$P$28,11),IF(AND(H7>=1938,H7<1943),VLOOKUP(I7,Feuil2!$F$10:$P$28,10),IF(AND(H7>=1943,H7<1948),VLOOKUP(I7,Feuil2!$F$10:$P$28,9),IF(AND(H7>=1948,H7<1953),VLOOKUP(I7,Feuil2!$F$10:$P$28,8),IF(AND(H7>=1953,H7<1958),VLOOKUP(I7,Feuil2!$F$10:$P$28,7),IF(AND(H7>=1958,H7<1963),VLOOKUP(I7,Feuil2!$F$10:$P$28,6),IF(AND(H7>=1963,H7<1968),VLOOKUP(I7,Feuil2!$F$10:$P$28,5),IF(AND(H7>=1968,H7<1973),VLOOKUP(I7,Feuil2!$F$10:$P$28,4),IF(AND(H7>=1973,H7<1978),VLOOKUP(I7,Feuil2!$F$10:$P$28,3),IF(AND(H7>=1978,H7<1983),VLOOKUP(I7,Feuil2!$F$10:$P$28,2),VLOOKUP(I7,Feuil2!$F$10:$P$28,2))))))))))))","v":"VH40-77"},null,{"$f":"T7-HLOOKUP(Y7,Feuil2!$C$1:$CD$9,2,FALSE)","v":210},{"$f":"T7-HLOOKUP(Y7,Feuil2!$C$1:$CD$9,3,FALSE)","v":58},{"$f":"T7-HLOOKUP(Y7,Feuil2!$C$1:$CD$9,4,FALSE)","v":48},{"$f":"T7-HLOOKUP(Y7,Feuil2!$C$1:$CD$9,5,FALSE)","v":38},{"$f":"T7-HLOOKUP(Y7,Feuil2!$C$1:$CD$9,6,FALSE)","v":18},{"$f":"T7-HLOOKUP(Y7,Feuil2!$C$1:$CD$9,7,FALSE)","v":-790},{"$f":"T7-HLOOKUP(Y7,Feuil2!$C$1:$CD$9,8,FALSE)","v":-790},{"$f":"T7-HLOOKUP(Y7,Feuil2!$C$1:$CD$9,9,FALSE)","v":-790},null,null,null,null,null,null,null,"MON +",40,null,{"$f":"IF(AQ7,VLOOKUP(AQ7,HOM!$AS$389:$AT$444,2))","v":1.135}]
["H",null,null,null,null,null,null,1972,77,null,"F",null,null,85,85,100,null,null,100,185,280.26441288494959,"MON +",0,"V3 H45",{"$f":"IF(AND(H8<1920),VLOOKUP(I8,Feuil2!$F$10:$P$28,11),IF(AND(H8>=1920,H8<1939),VLOOKUP(I8,Feuil2!$F$10:$P$28,11),IF(AND(H8>=1938,H8<1943),VLOOKUP(I8,Feuil2!$F$10:$P$28,10),IF(AND(H8>=1943,H8<1948),VLOOKUP(I8,Feuil2!$F$10:$P$28,9),IF(AND(H8>=1948,H8<1953),VLOOKUP(I8,Feuil2!$F$10:$P$28,8),IF(AND(H8>=1953,H8<1958),VLOOKUP(I8,Feuil2!$F$10:$P$28,7),IF(AND(H8>=1958,H8<1963),VLOOKUP(I8,Feuil2!$F$10:$P$28,6),IF(AND(H8>=1963,H8<1968),VLOOKUP(I8,Feuil2!$F$10:$P$28,5),IF(AND(H8>=1968,H8<1973),VLOOKUP(I8,Feuil2!$F$10:$P$28,4),IF(AND(H8>=1973,H8<1978),VLOOKUP(I8,Feuil2!$F$10:$P$28,3),IF(AND(H8>=1978,H8<1983),VLOOKUP(I8,Feuil2!$F$10:$P$28,2),VLOOKUP(I8,Feuil2!$F$10:$P$28,2))))))))))))","v":"VH45-77"},null,{"$f":"T8-HLOOKUP(Y8,Feuil2!$C$1:$CD$9,2,FALSE)","v":185},{"$f":"T8-HLOOKUP(Y8,Feuil2!$C$1:$CD$9,3,FALSE)","v":40},{"$f":"T8-HLOOKUP(Y8,Feuil2!$C$1:$CD$9,4,FALSE)","v":30},{"$f":"T8-HLOOKUP(Y8,Feuil2!$C$1:$CD$9,5,FALSE)","v":20},{"$f":"T8-HLOOKUP(Y8,Feuil2!$C$1:$CD$9,6,FALSE)","v":0},{"$f":"T8-HLOOKUP(Y8,Feuil2!$C$1:$CD$9,7,FALSE)","v":-815},{"$f":"T8-HLOOKUP(Y8,Feuil2!$C$1:$CD$9,8,FALSE)","v":-815},{"$f":"T8-HLOOKUP(Y8,Feuil2!$C$1:$CD$9,9,FALSE)","v":-815},null,null,null,null,null,null,null,"MON +",45,null,{"$f":"IF(AQ8,VLOOKUP(AQ8,HOM!$AS$389:$AT$444,2))","v":1.2030000000000001}]
["H",null,null,null,null,null,null,1967,85,null,"F",null,null,65,65,80,null,null,80,145,221.62520020545571,"REG +",5,"V4 H50",{"$f":"IF(AND(H9<1920),VLOOKUP(I9,Feuil2!$F$10:$P$28,11),IF(AND(H9>=1920,H9<1939),VLOOKUP(I9,Feuil2!$F$10:$P$28,11),IF(AND(H9>=1938,H9<1943),VLOOKUP(I9,Feuil2!$F$10:$P$28,10),IF(AND(H9>=1943,H9<1948),VLOOKUP(I9,Feuil2!$F$10:$P$28,9),IF(AND(H9>=1948,H9<1953),VLOOKUP(I9,Feuil2!$F$10:$P$28,8),IF(AND(H9>=1953,H9<1958),VLOOKUP(I9,Feuil2!$F$10:$P$28,7),IF(AND(H9>=1958,H9<1963),VLOOKUP(I9,Feuil2!$F$10:$P$28,6),IF(AND(H9>=1963,H9<1968),VLOOKUP(I9,Feuil2!$F$10:$P$28,5),IF(AND(H9>=1968,H9<1973),VLOOKUP(I9,Feuil2!$F$10:$P$28,4),IF(AND(H9>=1973,H9<1978),VLOOKUP(I9,Feuil2!$F$10:$P$28,3),IF(AND(H9>=1978,H9<1983),VLOOKUP(I9,Feuil2!$F$10:$P$28,2),VLOOKUP(I9,Feuil2!$F$10:$P$28,2))))))))))))","v":"VH50-85"},null,{"$f":"T9-HLOOKUP(Y9,Feuil2!$C$1:$CD$9,2,FALSE)","v":145},{"$f":"T9-HLOOKUP(Y9,Feuil2!$C$1:$CD$9,3,FALSE)","v":5},{"$f":"T9-HLOOKUP(Y9,Feuil2!$C$1:$CD$9,4,FALSE)","v":-5},{"$f":"T9-HLOOKUP(Y9,Feuil2!$C$1:$CD$9,5,FALSE)","v":-15},{"$f":"T9-HLOOKUP(Y9,Feuil2!$C$1:$CD$9,6,FALSE)","v":-35},{"$f":"T9-HLOOKUP(Y9,Feuil2!$C$1:$CD$9,7,FALSE)","v":-855},{"$f":"T9-HLOOKUP(Y9,Feuil2!$C$1:$CD$9,8,FALSE)","v":-855},{"$f":"T9-HLOOKUP(Y9,Feuil2!$C$1:$CD$9,9,FALSE)","v":-855},null,null,null,null,null,null,null,"REG +",50,null,{"$f":"IF(AQ9,VLOOKUP(AQ9,HOM!$AS$389:$AT$444,2))","v":1.2789999999999999}]
["H",null,null,null,null,null,null,1962,69,null,"F",null,null,89,89,110,null,null,110,199,370.77371184113008,"MON +",59,"V5 H55",{"$f":"IF(AND(H10<1920),VLOOKUP(I10,Feuil2!$F$10:$P$28,11),IF(AND(H10>=1920,H10<1939),VLOOKUP(I10,Feuil2!$F$10:$P$28,11),IF(AND(H10>=1938,H10<1943),VLOOKUP(I10,Feuil2!$F$10:$P$28,10),IF(AND(H10>=1943,H10<1948),VLOOKUP(I10,Feuil2!$F$10:$P$28,9),IF(AND(H10>=1948,H10<1953),VLOOKUP(I10,Feuil2!$F$10:$P$28,8),IF(AND(H10>=1953,H10<1958),VLOOKUP(I10,Feuil2!$F$10:$P$28,7),IF(AND(H10>=1958,H10<1963),VLOOKUP(I10,Feuil2!$F$10:$P$28,6),IF(AND(H10>=1963,H10<1968),VLOOKUP(I10,Feuil2!$F$10:$P$28,5),IF(AND(H10>=1968,H10<1973),VLOOKUP(I10,Feuil2!$F$10:$P$28,4),IF(AND(H10>=1973,H10<1978),VLOOKUP(I10,Feuil2!$F$10:$P$28,3),IF(AND(H10>=1978,H10<1983),VLOOKUP(I10,Feuil2!$F$10:$P$28,2),VLOOKUP(I10,Feuil2!$F$10:$P$28,2))))))))))))","v":"VH55-69"},null,{"$f":"T10-HLOOKUP(Y10,Feuil2!$C$1:$CD$9,2,FALSE)","v":199},{"$f":"T10-HLOOKUP(Y10,Feuil2!$C$1:$CD$9,3,FALSE)","v":94},{"$f":"T10-HLOOKUP(Y10,Feuil2!$C$1:$CD$9,4,FALSE)","v":84},{"$f":"T10-HLOOKUP(Y10,Feuil2!$C$1:$CD$9,5,FALSE)","v":74},{"$f":"T10-HLOOKUP(Y10,Feuil2!$C$1:$CD$9,6,FALSE)","v":59},{"$f":"T10-HLOOKUP(Y10,Feuil2!$C$1:$CD$9,7,FALSE)","v":-801},{"$f":"T10-HLOOKUP(Y10,Feuil2!$C$1:$CD$9,8,FALSE)","v":-801},{"$f":"T10-HLOOKUP(Y10,Feuil2!$C$1:$CD$9,9,FALSE)","v":-801},null,null,null,null,null,null,null,"MON +",55,null,{"$f":"IF(AQ10,VLOOKUP(AQ10,HOM!$AS$389:$AT$444,2))","v":1.385}]
["H",null,null,null,null,null,null,1957,77,null,"F",null,null,65,{"$f":"IF(I11=\"\",\"\",IF(MAXA(L11:N11)<=0,0,MAXA(L11:N11)))","v":65},80,null,null,80,145,276.45501813319402,"MON +",8,"V6 H60",{"$f":"IF(AND(H11<1920),VLOOKUP(I11,Feuil2!$F$10:$P$28,11),IF(AND(H11>=1920,H11<1939),VLOOKUP(I11,Feuil2!$F$10:$P$28,11),IF(AND(H11>=1938,H11<1943),VLOOKUP(I11,Feuil2!$F$10:$P$28,10),IF(AND(H11>=1943,H11<1948),VLOOKUP(I11,Feuil2!$F$10:$P$28,9),IF(AND(H11>=1948,H11<1953),VLOOKUP(I11,Feuil2!$F$10:$P$28,8),IF(AND(H11>=1953,H11<1958),VLOOKUP(I11,Feuil2!$F$10:$P$28,7),IF(AND(H11>=1958,H11<1963),VLOOKUP(I11,Feuil2!$F$10:$P$28,6),IF(AND(H11>=1963,H11<1968),VLOOKUP(I11,Feuil2!$F$10:$P$28,5),IF(AND(H11>=1968,H11<1973),VLOOKUP(I11,Feuil2!$F$10:$P$28,4),IF(AND(H11>=1973,H11<1978),VLOOKUP(I11,Feuil2!$F$10:$P$28,3),IF(AND(H11>=1978,H11<1983),VLOOKUP(I11,Feuil2!$F$10:$P$28,2),VLOOKUP(I11,Feuil2!$F$10:$P$28,2))))))))))))","v":"VH60-77"},null,{"$f":"T11-HLOOKUP(Y11,Feuil2!$C$1:$CD$9,2,FALSE)","v":145},{"$f":"T11-HLOOKUP(Y11,Feuil2!$C$1:$CD$9,3,FALSE)","v":43},{"$f":"T11-HLOOKUP(Y11,Feuil2!$C$1:$CD$9,4,FALSE)","v":33},{"$f":"T11-HLOOKUP(Y11,Feuil2!$C$1:$CD$9,5,FALSE)","v":23},{"$f":"T11-HLOOKUP(Y11,Feuil2!$C$1:$CD$9,6,FALSE)","v":8},{"$f":"T11-HLOOKUP(Y11,Feuil2!$C$1:$CD$9,7,FALSE)","v":-855},{"$f":"T11-HLOOKUP(Y11,Feuil2!$C$1:$CD$9,8,FALSE)","v":-855},{"$f":"T11-HLOOKUP(Y11,Feuil2!$C$1:$CD$9,9,FALSE)","v":-855},null,null,null,null,null,null,null,"MON +",60,null,{"$f":"IF(AQ11,VLOOKUP(AQ11,HOM!$AS$389:$AT$444,2))","v":1.514}]
["H",null,null,null,null,null,null,1952,69,null,"F",null,null,65,65,80,null,null,80,145,324.38916243604626,"MON +",33,"V7 H65",{"$f":"IF(AND(H12<1920),VLOOKUP(I12,Feuil2!$F$10:$P$28,11),IF(AND(H12>=1920,H12<1939),VLOOKUP(I12,Feuil2!$F$10:$P$28,11),IF(AND(H12>=1938,H12<1943),VLOOKUP(I12,Feuil2!$F$10:$P$28,10),IF(AND(H12>=1943,H12<1948),VLOOKUP(I12,Feuil2!$F$10:$P$28,9),IF(AND(H12>=1948,H12<1953),VLOOKUP(I12,Feuil2!$F$10:$P$28,8),IF(AND(H12>=1953,H12<1958),VLOOKUP(I12,Feuil2!$F$10:$P$28,7),IF(AND(H12>=1958,H12<1963),VLOOKUP(I12,Feuil2!$F$10:$P$28,6),IF(AND(H12>=1963,H12<1968),VLOOKUP(I12,Feuil2!$F$10:$P$28,5),IF(AND(H12>=1968,H12<1973),VLOOKUP(I12,Feuil2!$F$10:$P$28,4),IF(AND(H12>=1973,H12<1978),VLOOKUP(I12,Feuil2!$F$10:$P$28,3),IF(AND(H12>=1978,H12<1983),VLOOKUP(I12,Feuil2!$F$10:$P$28,2),VLOOKUP(I12,Feuil2!$F$10:$P$28,2))))))))))))","v":"VH65-69"},null,{"$f":"T12-HLOOKUP(Y12,Feuil2!$C$1:$CD$9,2,FALSE)","v":145},{"$f":"T12-HLOOKUP(Y12,Feuil2!$C$1:$CD$9,3,FALSE)","v":68},{"$f":"T12-HLOOKUP(Y12,Feuil2!$C$1:$CD$9,4,FALSE)","v":58},{"$f":"T12-HLOOKUP(Y12,Feuil2!$C$1:$CD$9,5,FALSE)","v":48},{"$f":"T12-HLOOKUP(Y12,Feuil2!$C$1:$CD$9,6,FALSE)","v":33},{"$f":"T12-HLOOKUP(Y12,Feuil2!$C$1:$CD$9,7,FALSE)","v":-855},{"$f":"T12-HLOOKUP(Y12,Feuil2!$C$1:$CD$9,8,FALSE)","v":-855},{"$f":"T12-HLOOKUP(Y12,Feuil2!$C$1:$CD$9,9,FALSE)","v":-855},null,null,null,null,null,null,null,"MON +",65,null,{"$f":"IF(AQ12,VLOOKUP(AQ12,HOM!$AS$389:$AT$444,2))","v":1.663}]
["H",null,null,null,null,null,null,1947,77,null,"F",null,null,65,65,80,null,null,80,145,340.91249594099946,"MON +",48,"V8 H70",{"$f":"IF(AND(H13<1920),VLOOKUP(I13,Feuil2!$F$10:$P$28,11),IF(AND(H13>=1920,H13<1939),VLOOKUP(I13,Feuil2!$F$10:$P$28,11),IF(AND(H13>=1938,H13<1943),VLOOKUP(I13,Feuil2!$F$10:$P$28,10),IF(AND(H13>=1943,H13<1948),VLOOKUP(I13,Feuil2!$F$10:$P$28,9),IF(AND(H13>=1948,H13<1953),VLOOKUP(I13,Feuil2!$F$10:$P$28,8),IF(AND(H13>=1953,H13<1958),VLOOKUP(I13,Feuil2!$F$10:$P$28,7),IF(AND(H13>=1958,H13<1963),VLOOKUP(I13,Feuil2!$F$10:$P$28,6),IF(AND(H13>=1963,H13<1968),VLOOKUP(I13,Feuil2!$F$10:$P$28,5),IF(AND(H13>=1968,H13<1973),VLOOKUP(I13,Feuil2!$F$10:$P$28,4),IF(AND(H13>=1973,H13<1978),VLOOKUP(I13,Feuil2!$F$10:$P$28,3),IF(AND(H13>=1978,H13<1983),VLOOKUP(I13,Feuil2!$F$10:$P$28,2),VLOOKUP(I13,Feuil2!$F$10:$P$28,2))))))))))))","v":"VH70-77"},null,{"$f":"T13-HLOOKUP(Y13,Feuil2!$C$1:$CD$9,2,FALSE)","v":145},{"$f":"T13-HLOOKUP(Y13,Feuil2!$C$1:$CD$9,3,FALSE)","v":75},{"$f":"T13-HLOOKUP(Y13,Feuil2!$C$1:$CD$9,4,FALSE)","v":65},{"$f":"T13-HLOOKUP(Y13,Feuil2!$C$1:$CD$9,5,FALSE)","v":55},{"$f":"T13-HLOOKUP(Y13,Feuil2!$C$1:$CD$9,6,FALSE)","v":48},{"$f":"T13-HLOOKUP(Y13,Feuil2!$C$1:$CD$9,7,FALSE)","v":-855},{"$f":"T13-HLOOKUP(Y13,Feuil2!$C$1:$CD$9,8,FALSE)","v":-855},{"$f":"T13-HLOOKUP(Y13,Feuil2!$C$1:$CD$9,9,FALSE)","v":-855},null,null,null,null,null,null,null,"MON +",70,null,{"$f":"IF(AQ13,VLOOKUP(AQ13,HOM!$AS$389:$AT$444,2))","v":1.867}]
["H",null,null,null,null,null,null,1942,75,null,"F",null,null,65,65,80,null,null,80,145,392.43711687457613,"MON +",58,"V9 H75",{"$f":"IF(AND(H14<1920),VLOOKUP(I14,Feuil2!$F$10:$P$28,11),IF(AND(H14>=1920,H14<1939),VLOOKUP(I14,Feuil2!$F$10:$P$28,11),IF(AND(H14>=1938,H14<1943),VLOOKUP(I14,Feuil2!$F$10:$P$28,10),IF(AND(H14>=1943,H14<1948),VLOOKUP(I14,Feuil2!$F$10:$P$28,9),IF(AND(H14>=1948,H14<1953),VLOOKUP(I14,Feuil2!$F$10:$P$28,8),IF(AND(H14>=1953,H14<1958),VLOOKUP(I14,Feuil2!$F$10:$P$28,7),IF(AND(H14>=1958,H14<1963),VLOOKUP(I14,Feuil2!$F$10:$P$28,6),IF(AND(H14>=1963,H14<1968),VLOOKUP(I14,Feuil2!$F$10:$P$28,5),IF(AND(H14>=1968,H14<1973),VLOOKUP(I14,Feuil2!$F$10:$P$28,4),IF(AND(H14>=1973,H14<1978),VLOOKUP(I14,Feuil2!$F$10:$P$28,3),IF(AND(H14>=1978,H14<1983),VLOOKUP(I14,Feuil2!$F$10:$P$28,2),VLOOKUP(I14,Feuil2!$F$10:$P$28,2))))))))))))","v":"VH75-77"},null,{"$f":"T14-HLOOKUP(Y14,Feuil2!$C$1:$CD$9,2,FALSE)","v":145},{"$f":"T14-HLOOKUP(Y14,Feuil2!$C$1:$CD$9,3,FALSE)","v":83},{"$f":"T14-HLOOKUP(Y14,Feuil2!$C$1:$CD$9,4,FALSE)","v":73},{"$f":"T14-HLOOKUP(Y14,Feuil2!$C$1:$CD$9,5,FALSE)","v":63},{"$f":"T14-HLOOKUP(Y14,Feuil2!$C$1:$CD$9,6,FALSE)","v":58},{"$f":"T14-HLOOKUP(Y14,Feuil2!$C$1:$CD$9,7,FALSE)","v":-855},{"$f":"T14-HLOOKUP(Y14,Feuil2!$C$1:$CD$9,8,FALSE)","v":-855},{"$f":"T14-HLOOKUP(Y14,Feuil2!$C$1:$CD$9,9,FALSE)","v":-855},null,null,null,null,null,null,null,"MON +",75,null,{"$f":"IF(AQ14,VLOOKUP(AQ14,HOM!$AS$389:$AT$444,2))","v":2.117}]
["H",null,null,null,null,null,null,1937,65,null,"F",null,null,30,30,40,null,null,40,70,245.28162789102348,"MON +",10,"V10 H80+",{"$f":"IF(AND(H15<1920),VLOOKUP(I15,Feuil2!$F$10:$P$28,11),IF(AND(H15>=1920,H15<1939),VLOOKUP(I15,Feuil2!$F$10:$P$28,11),IF(AND(H15>=1938,H15<1943),VLOOKUP(I15,Feuil2!$F$10:$P$28,10),IF(AND(H15>=1943,H15<1948),VLOOKUP(I15,Feuil2!$F$10:$P$28,9),IF(AND(H15>=1948,H15<1953),VLOOKUP(I15,Feuil2!$F$10:$P$28,8),IF(AND(H15>=1953,H15<1958),VLOOKUP(I15,Feuil2!$F$10:$P$28,7),IF(AND(H15>=1958,H15<1963),VLOOKUP(I15,Feuil2!$F$10:$P$28,6),IF(AND(H15>=1963,H15<1968),VLOOKUP(I15,Feuil2!$F$10:$P$28,5),IF(AND(H15>=1968,H15<1973),VLOOKUP(I15,Feuil2!$F$10:$P$28,4),IF(AND(H15>=1973,H15<1978),VLOOKUP(I15,Feuil2!$F$10:$P$28,3),IF(AND(H15>=1978,H15<1983),VLOOKUP(I15,Feuil2!$F$10:$P$28,2),VLOOKUP(I15,Feuil2!$F$10:$P$28,2))))))))))))","v":"VH80+-69"},null,{"$f":"T15-HLOOKUP(Y15,Feuil2!$C$1:$CD$9,2,FALSE)","v":70},{"$f":"T15-HLOOKUP(Y15,Feuil2!$C$1:$CD$9,3,FALSE)","v":20},{"$f":"T15-HLOOKUP(Y15,Feuil2!$C$1:$CD$9,4,FALSE)","v":12},{"$f":"T15-HLOOKUP(Y15,Feuil2!$C$1:$CD$9,5,FALSE)","v":11},{"$f":"T15-HLOOKUP(Y15,Feuil2!$C$1:$CD$9,6,FALSE)","v":10},{"$f":"T15-HLOOKUP(Y15,Feuil2!$C$1:$CD$9,7,FALSE)","v":-930},{"$f":"T15-HLOOKUP(Y15,Feuil2!$C$1:$CD$9,8,FALSE)","v":-930},{"$f":"T15-HLOOKUP(Y15,Feuil2!$C$1:$CD$9,9,FALSE)","v":-930},null,null,null,null,null,null,null,"MON +",80,null,{"$f":"IF(AQ15,VLOOKUP(AQ15,HOM!$AS$389:$AT$444,2))","v":2.504}]
{"$rows_left_out":527}
{"sheet":"Feuil1","index":1,"n_rows":24,"n_cols":58,"rows_kept":24,"cut":false,"hidden":true,"merged":[]}
[null,null,"VF35-48","VF35-53","VF35-58","VF35-63","VF35-69","VF35-75","VF35+75","VF40-48","VF40-53","VF40-58","VF40-63","VF40-69","VF40-75","VF40+75","VF45-48","VF45-53","VF45-58","VF45-63","VF45-69","VF45-75","VF45+75","VF50-48","VF50-53","VF50-58","VF50-63","VF50-69","VF50-75","VF50+75","VF55-48","VF55-53","VF55-58","VF55-63","VF55-69","VF55-75","VF55+75","VF60-48","VF60-53","VF60-58","VF60-63","VF60-69","VF60-75","VF60+75","VF65-48","VF65-53","VF65-58","VF65-63","VF65-69","VF65-75","VF65+75","VF70+-48","VF70+-53","VF70+-58","VF70+-63","VF70+-69","VF70+-75","VF70++75"]
[null,null,null,null,null,null,null,null,null,null,null,null,null,null,null,null,null,null,null,null,null,null,null,null,null,null,null,null,null,null,null,null,null,null,null,null,null,null,null,null,null,null,null,null,null,null,null,null,null,null,null," "]
[null,"REGION",55,60,62,65,70,72,80,52,55,60,62,65,67,75,50,52,55,60,62,65,72,45,47,52,55,57,60,67,42,45,47,50,52,55,57,40,42,45,47,50,52,55,38,40,42,45,48,50,52,36,38,40,43,45,48,50]
[null,"France",60,62,67,70,75,77,85,55,60,62,65,70,72,80,52,55,60,62,65,67,75,50,52,55,60,62,65,72,45,47,52,55,57,60,67,42,45,47,50,52,55,57,40,42,45,47,50,52,55,38,40,42,45,48,50,52]
[null,"EUROPE",70,72,77,80,85,87,95,65,70,72,75,80,82,90,62,65,70,72,75,77,85,60,62,65,70,72,75,82,55,57,62,65,67,70,77,52,55,57,60,62,65,67,50,52,55,57,60,62,65,45,47,49,52,55,57,60]
[null,"MONDE",82,90,95,100,102,107,112,80,85,90,95,97,100,105,72,77,82,85,90,92,97,67,72,75,77,82,85,90,60,65,67,70,75,77,82,55,57,62,65,67,70,72,50,52,55,57,60,62,65,46,48,50,53,56,58,61]
[null,"INTERNATIONAL B",1000,1000,1000,1000,1000,1000,1000,1000,1000,1000,1000,1000,1000,1000,1000,1000,1000,1000,1000,1000,1000,1000,1000,1000,1000,1000,1000,1000,1000,1000,1000,1000,1000,1000,1000,1000,1000,1000,1000,1000,1000,1000,1000,1000,1000,1000,1000,1000,1000,1000,1000,1000,1000,1000,1000,1000]
[null,"INTERNATIONAL A",1000,1000,1000,1000,1000,1000,1000,1000,1000,1000,1000,1000,1000,1000,1000,1000,1000,1000,1000,1000,1000,1000,1000,1000,1000,1000,1000,1000,1000,1000,1000,1000,1000,1000,1000,1000,1000,1000,1000,1000,1000,1000,1000,1000,1000,1000,1000,1000,1000,1000,1000,1000,1000,1000,1000,1000]
[null,"OLYMPIQUE",1000,1000,1000,1000,1000,1000,1000,1000,1000,1000,1000,1000,1000,1000,1000,1000,1000,1000,1000,1000,1000,1000,1000,1000,1000,1000,1000,1000,1000,1000,1000,1000,1000,1000,1000,1000,1000,1000,1000,1000,1000,1000,1000,1000,1000,1000,1000,1000,1000,1000,1000,1000,1000,1000,1000,1000]
[null,null,null,null,null,null,"VF35","VF40","VF45","VF50","VF55","VF60","VF65","VF70+"]
[null,null,null,null,null,20.010000000000002,"VF35-48","VF40-48","VF45-48","VF50-48","VF55-48","VF60-48","VF65-48","VF70+-48"]
[null,null,null,null,null,30.01,"VF35-48","VF40-48","VF45-48","VF50-48","VF55-48","VF60-48","VF65-48","VF70+-48"]
[null,null,null,null,null,35.01,"VF35-48","VF40-48","VF45-48","VF50-48","VF55-48","VF60-48","VF65-48","VF70+-48"]
[null,null,null,null,null,36.01,"VF35-48","VF40-48","VF45-48","VF50-48","VF55-48","VF60-48","VF65-48","VF70+-48"]
[null,null,null,null,null,40.01,"VF35-48","VF40-48","VF45-48","VF50-48","VF55-48","VF60-48","VF65-48","VF70+-48"]
{"$rows_left_out":10}
{"sheet":"Feuil2","index":2,"n_rows":90,"n_cols":83,"rows_kept":90,"cut":false,"hidden":true,"merged":[]}
[null,null,"VH35-56","VH35-62","VH35-69","VH35-77","VH35-85","VH35-94","VH35-105","VH35+105","VH40-56","VH40-62","VH40-69","VH40-77","VH40-85","VH40-94","VH40-105","VH40+105","VH45-56","VH45-62","VH45-69","VH45-77","VH45-85","VH45-94","VH45-105","VH45+105","VH50-56","VH50-62","VH50-69","VH50-77","VH50-85","VH50-94","VH50-105","VH50+105","VH55-56","VH55-62","VH55-69","VH55-77","VH55-85","VH55-94","VH55-105","VH55+105","VH60-56","VH60-62","VH60-69","VH60-77","VH60-85","VH60-94","VH60-105","VH60+105","VH65-56","VH65-62","VH65-69","VH65-77","VH65-85","VH65-94","VH65-105","VH65+105","VH70-56","VH70-62","VH70-69","VH70-77","VH70-85","VH70-94","VH70-105","VH70+105","VH75-56","VH75-62","VH75-69","VH75-77","VH75-85","VH75-94","VH75-105","VH75+105","VH80+-56","VH80+-62","VH80+-69","VH80+-77","VH80+-85","VH80+-94","VH80+-105","VH80++105"]
[null,null,null,null,null,null,null,null,null,null,null,null,null,null,null,null,null,null,null,null,null,null,null,null,null,null,null,null,null,null,null,null,null,null,null,null,null,null,null,null,null,null,null,null,null,null,null,null,null,null,null," "]
[null,"REGION",117,132,147,162,172,182,190,197,110,125,140,152,162,172,180,187,105,117,130,145,155,162,170,177,95,107,120,130,140,147,155,162,82,92,105,115,122,130,137,145,72,82,92,102,110,117,122,130,60,70,77,87,92,100,102,107,47,55,62,70,75,80,82,87,42,47,55,62,67,70,75,80,40,45,50,60,63,64,69,70,"REGIONAL"]
[null,"France",127,142,157,172,182,192,200,202,120,135,150,162,172,182,190,197,115,127,140,155,165,172,180,187,105,117,130,140,150,157,165,172,92,102,115,125,132,140,147,155,82,92,102,112,120,127,132,140,70,80,87,97,102,110,112,117,57,65,72,80,85,90,92,97,52,57,65,72,77,80,85,90,50,55,58,62,64,65,70,75,"France"]
[null,"EUROPE",137,152,167,182,192,202,210,217,130,145,160,172,182,192,200,207,125,137,150,165,175,182,190,197,115,127,140,150,160,167,175,182,102,112,125,135,142,150,157,165,92,102,112,122,130,137,142,150,80,90,97,107,112,120,122,127,67,75,82,90,95,100,102,107,62,67,75,82,87,90,95,100,54,56,59,64,69,71,76,79,"EUROPE"]
[null,"MONDE",155,172,187,202,215,227,237,245,147,162,177,192,205,215,225,232,140,155,170,185,195,205,212,222,130,142,157,170,180,190,197,205,115,127,140,152,162,170,177,182,105,117,127,137,147,155,160,167,92,102,112,120,127,135,140,145,75,82,90,97,102,107,112,117,67,75,82,87,95,97,102,107,55,57,60,65,70,72,77,80,"MONDE"]
[null,"INTERNATIONAL B",1000,1000,1000,1000,1000,1000,1000,1000,1000,1000,1000,1000,1000,1000,1000,1000,1000,1000,1000,1000,1000,1000,1000,1000,1000,1000,1000,1000,1000,1000,1000,1000,1000,1000,1000,1000,1000,1000,1000,1000,1000,1000,1000,1000,1000,1000,1000,1000,1000,1000,1000,1000,1000,1000,1000,1000,1000,1000,1000,1000,1000,1000,1000,1000,1000,1000,1000,1000,1000,1000,1000,1000,1000,1000,1000,1000,1000,1000,1000,1000]
[null,"INTERNATIONAL A",1000,1000,1000,1000,1000,1000,1000,1000,1000,1000,1000,1000,1000,1000,1000,1000,1000,1000,1000,1000,1000,1000,1000,1000,1000,1000,1000,1000,1000,1000,1000,1000,1000,1000,1000,1000,1000,1000,1000,1000,1000,1000,1000,1000,1000,1000,1000,1000,1000,1000,1000,1000,1000,1000,1000,1000,1000,1000,1000,1000,1000,1000,1000,1000,1000,1000,1000,1000,1000,1000,1000,1000,1000,1000,1000,1000,1000,1000,1000,1000]
[null,"OLYMPIQUE",1000,1000,1000,1000,1000,1000,1000,1000,1000,1000,1000,1000,1000,1000,1000,1000,1000,1000,1000,1000,1000,1000,1000,1000,1000,1000,1000,1000,1000,1000,1000,1000,1000,1000,1000,1000,1000,1000,1000,1000,1000,1000,1000,1000,1000,1000,1000,1000,1000,1000,1000,1000,1000,1000,1000,1000,1000,1000,1000,1000,1000,1000,1000,1000,1000,1000,1000,1000,1000,1000,1000,1000,1000,1000,1000,1000,1000,1000,1000,1000]
[null,null,null,null,null,null,"VH35","VH40","VH45","VH50","VH55","VH60","VH65","VH70","VH75","VH80+"]
[null,null,null,null,null,20.010000000000002,"VH35-56","VH40-56","VH45-56","VH50-56","VH55-56","VH60-56","VH65-56","VH70-56","VH75-56","VH80+-56"]
[null,null,null,null,null,34.01,"VH35-56","VH40-56","VH45-56","VH50-56","VH55-56","VH60-56","VH65-56","VH70-56","VH75-56","VH80+-56"]
[null,null,null,null,null,38.01,"VH35-56","VH40-56","VH45-56","VH50-56","VH55-56","VH60-56","VH65-56","VH70-56","VH75-56","VH80+-56"]
[null,null,null,null,null,40.01,"VH35-56","VH40-56","VH45-56","VH50-56","VH55-56","VH60-56","VH65-56","VH70-56","VH75-56","VH80+-56"]
[null,null,null,null,null,45.01,"VH35-56","VH40-56","VH45-56","VH50-56","VH55-56","VH60-56","VH65-56","VH70-56","VH75-56","VH80+-56"]
{"$rows_left_out":75}